PUSHES REPORT: 8u161

This report shows who pushed the backports to the given release. This usually shows who did the backporting, testing, and review work.

Report generated: Wed Dec 01 02:59:34 CET 2021

Distribution by priority

Count Priority
1 P2

Distribution by components

Count Component
1 100% Total
1 100.0% hotspot
1 100.0% hotspot/runtime

Distribution by affiliation

Count Committer
1 100% Total
1 100.0% Oracle
1 100.0% Kevin Walls

Chronological push log:

Days Ago Committer Affiliation Bug Summary
1895 Kevin Walls Oracle JDK-8157548 JVM crashes sometimes while starting

No changesets log

JDK-8196015 Release Note: TLS Session Hash and Extended Master Secret Extension Support
JDK-8195652 Release Note: JNLP files won't launch from IE11 on Windows 10 Creators Update
JDK-8193693 Increase the number of clones in the CloneableDigest
JDK-8193456 JNLP files won't launch from IE11 on Windows 10 Creators Update
JDK-8191703 test tck.java.time.zone.TCKZoneRules is broken by tzdata2017c
JDK-8191702 (tz) Support tzdata2017c
JDK-8191667 com/sun/crypto/provider/KeyAgreement/SupportedDHParamGens.java failed with timeout
JDK-8191607 undo 8189805: 64 and 32 bit RPMS must co-exist
JDK-8191601 Update copyright date to 2018 for developer guides
JDK-8191461 Sun Provider's PKCS12 KeyStore should document that KeyBag type is not supported
JDK-8191345 Release Note: Support DHE sizes up to 8192-bits and DSA sizes up to 3072-bits
JDK-8191208 keytool fails to format resource strings for keys for some languages after JDK-8171319
JDK-8191191 [TEST_BUG] sun/security/pkcs11/KeyPairGenerator/TestDH2048.java fails on Solaris x64 5.10
JDK-8191190 Text in native popup is not always updated with Sogou IME
JDK-8191189 [TEST_BUG] Cipher tests fail when running with unlimited policy
JDK-8190971 Release Note: Disable exportable cipher suites
JDK-8190490 Fix compatibility issue in AlgorithmChecker for 3rd party JCE providers
JDK-8190474 sun/security/provider/NSASuiteB/TestDSAGenParameterSpec.java timeouts intermittently
JDK-8190468 Support DHE sizes up to 8192-bits and DSA sizes up to 3072-bits
JDK-8189805 64 and 32 bit RPMS must co-exist
JDK-8189770 Release Note: Unlimited cryptography enabled by default
JDK-8189384 XSOM parser incorrectly processes type names with whitespaces
JDK-8189383 Enable unlimited cryptographic policy by default in Oracle JDK builds
JDK-8189086 64 bit java install not setting jnlp associate if lower 32bit versions exist
JDK-8189085 64 bit java install not setting jnlp associate if lower 32bit versions exist
JDK-8188581 Certificates not being blocked by jdk.tls.disabledAlgorithms property
JDK-8188577 Verifying ECDSA signatures permits trailing bytes
JDK-8188564 The new menu can't be shown on the menubar after clicking the "Add" button.
JDK-8188555 IME Composition Window is displayed at incorrect location
JDK-8188554 closed/java/awt/MenuBar/MenuBarStress1/MenuBarStress1.java hangs on win 64 bit with jdk8
JDK-8188552 FtpURLConnection connection leak on FileNotFoundException
JDK-8188542 Chrome interop regression with JDK-8148516
JDK-8188532 Integrate new version of Java VisualVM based on VisualVM 1.3.9 into JDK
JDK-8188531 Java installer leaves cached files on host after update
JDK-8188211 [TESTBUG] com/sun/jdi/LineNumberInfo.java fails with ArrayIndexOutOfBoundsException
JDK-8188209 Enable AssumeMP by default on SPARC machines
JDK-8188206 webstart app fails with CouldNotLoadArgumentException when account in Japanese
JDK-8188197 [CPU17_04] Need to update securitypack.jar with baseline.versions file having jdk9 entry
JDK-8187638 typo "Collectdions" in page title of collections framework documentation
JDK-8187323 [testlibrary] TestSocketFactory should allow triggers before match/replace
JDK-8187322 [testlibrary] rmi TestSocketFactory does not flush
JDK-8185933 DNS provider cleanups
JDK-8185664 keytool should not warn if signature algorithm used in cacerts is weak
JDK-8185663 keytool should print out warnings when reading or generating cert/cert req using weak algorithms
JDK-8185662 Keytool, print key algorithm of certificate or key entry
JDK-8185628 Backport jdk/test/lib/testlibrary/CompilerUtils.java to jdk8u which is helpful in test development
JDK-8185462 getUint32 returning Long
JDK-8185338 Build hangs and fills up disk on Windows with VS 2013 or 2010
JDK-8184993 Jar file verification failing with SecurityException: digest missing xxx
JDK-8184701 Java 8u121 on Linux intermittently returns null for MAC address
JDK-8184700 JCK test api/java_net/Socket/descriptions.html#Bind crashes on Windows
JDK-8184697 OOM ERRORS + SERVICE-THREAD TAKES A PROCESSOR TO 100%
JDK-8183889 JSObject property access is broken for numeric keys outside the int range
JDK-8183887 SparseArrayData should not grow its underlying dense array data
JDK-8183886 Missing checks in sparse array shift() implementation
JDK-8183885 Can't unambiguously select between fixed arity signatures [(java.util.Collection), (java.util.Map)]
JDK-8183884 JSObject call() is passed undefined for the argument 'thiz'
JDK-8183883 >>>=0 generates invalid bytecode for BaseNode LHS
JDK-8183882 "Bad local variable type" in ES6 Nashorn when reassigning a `let` within a `try`
JDK-8183881 Nested object literal property maps not reset in optimistic recompilation
JDK-8183880 Honor Number type hint in toPrimitive on Numbers
JDK-8183879 Polymorhic signature method check crashes javac
JDK-8183874 TestDefNewAllocationPendingStackTrace.java and TestG1HumongousAllocationPendingStackTrace.java test failures with java.lang.AssertionError: No matching stack trace found
JDK-8183869 UsageTracker should limit records and avoid truncation
JDK-8183867 CID keyed OpenType fonts are not supported by T2K
JDK-8183865 JRE 8u112 attempts to run ICACLS.EXE on startup in Windows 10 Version 1607, build 14393
JDK-8183861 JRE fails to load/register security providers when started from UNC pathname
JDK-8183860 ConcurrentSkipListSet.clear() can leave the Set in an invalid state
JDK-8183859 Correctly handle exception in TCPChannel.createConnection
JDK-8183858 sun.rmi.transport.tcp.TCPChannel.createConnection close connection on timeout
JDK-8183857 Typo in https://java.net/downloads/heap-snapshot/hprof-binary-format.html
JDK-8183856 NPE hit with java.security.debug=provider
JDK-8183855 Class java.util.concurrent.ThreadLocalRandom fails to Initialize when using SecurityManager
JDK-8183854 NullPointerException from JComboBox and JList when Accessibility enabled
JDK-8183853 Need to terminate server process if client runs into problems
JDK-8183852 Java "1.8.0_112" on Windows 10 displays different characters for EUDCs from ones created in eudcedit.exe.
JDK-8183851 [macosx] JMenuItems in JPopupMenu are not accessible
JDK-8183850 InetAddress.getLocalHost crash
JDK-8183849 Use stronger algorithms and keys for JSSE testing
JDK-8183848 javax.swing.text.html.parser.Parser parseScript ignores a character after comment end
JDK-8183847 Create an equivalent test case for JDK9's SupplementalJapaneseEraTest
JDK-8183846 Overstatement of universality of Era.getDisplayName() implementation
JDK-8183845 Wrong display name for supplemental Japanese era
JDK-8183844 JapaneseEra.getDisplayName doesn't return names if it's an additional era
JDK-8183843 [macosx] Sometimes NSWindow.isZoomed hangs
JDK-8183842 [macosx] The print test crashed with Nimbus L&F
JDK-8183841 [JCP] [Mac]Cannot launch JCP on Mac os with language set to "Chinese, Simplified" while region is not China
JDK-8183840 Locale issues with Mac 10.12
JDK-8183839 System.getProperty("os.version") returns incorrect version number on Mac
JDK-8183838 System.getProperty("os.version") returns "Unknown" on Mac
JDK-8183837 (props) "No Java runtime present, requesting install" when creating VM from JNI [macosx]
JDK-8183836 MAWT: Java should be more careful manipulating NLSPATH, XFILESEARCHPATH env variables
JDK-8183835 Stop changing user environment variables related to /usr/dt
JDK-8183834 StringIndexOutOfBoundsException in Pattern.compile with CANON_EQ flag
JDK-8183833 JDK support for JavaFX modal print dialogs
JDK-8183832 PrinterJob.pageDialog() with DialogSelectionType.NATIVE returns a PageFormat when cancelled.
JDK-8183831 Stack overflow on Linux using DialogTypeSelection.NATIVE
JDK-8183830 Wrap FileInputStream's native skip and available methods
JDK-8183828 IllegalArgumentException in java.awt.image.ReplicateScaleFilter
JDK-8183827 (tz) Support tzdata2017a
JDK-8183826 [macosx] Fast precise scrolling and DeltaAccumulator fix for macOS Sierra 10.12.2
JDK-8183825 The copyright section in the test/java/awt/font/TextLayout/DiacriticsDrawingTest.java should be updated
JDK-8183824 [macosx] Wrong rendering of diacritics on macOS
JDK-8183823 Make tracking SecondaryLoop.enter/exit methods easier
JDK-8183822 CUPS Printing is broken with Ubuntu 16.10 (CUPS 2.2)
JDK-8183821 JDK8u ProblemList.txt Updates
JDK-8183820 (fs) WatchService hangs on GetOverlappedResult and locks directory (win)
JDK-8183819 IllegalArgumentException: jdk.tls.namedGroups
JDK-8183818 performance regression in com/sun/crypto/provider/OutputFeedback.java
JDK-8183817 TsacertOptionTest.java intermittently fails on Mac
JDK-8183816 Two "Direct Clip" threads are created to play the same "AudioClip" object, what makes clip sound corrupted
JDK-8183815 [macosx] LinearGradientPaint and RadialGradientPaint are not printed on OS X.
JDK-8183814 [macosx] Printing a shape filled with a texture doesn't work under Mac OS X
JDK-8183813 ProblemList.txt needs to be updated as 7041639 closed
JDK-8183811 com/sun/net/httpserver/bugs/6725892/Test.java fails intermittently
JDK-8183810 java/util/concurrent/locks/ReentrantLock/CancelledLockLoops.java test failed with 'Completed != 2'
JDK-8183809 [PIT] on Windows, failure of java/awt/Dialog/DialogAboveFrame/DialogAboveFrameTest.java
JDK-8183808 Deadlock in com.sun.jndi.ldap.pool.Connections
JDK-8183807 (ppc64) Downport of 8170153 breaks build on linux/ppc64 (big endian)
JDK-8183804 (tz) Support tzdata2016j
JDK-8183802 [macosx] Activating a JDialog puts to back another dialog
JDK-8183801 [macosx] Cursor management unification
JDK-8183800 ReflectionFactory support for IIOP and custom serialization
JDK-8183797 Currency update needed for ISO 4217 Amendment #162.
JDK-8183796 Currency update needed for ISO 4217 Amendment #161
JDK-8183795 Diacritics input works incorrectly on Windows if Spanish (Latin American) keyboard layout is used
JDK-8183794 Modify sun/security/smartcardio manual regression tests so that they do not just fail if no cardreader found
JDK-8183793 ticket renewal won't happen with debugging turned on
JDK-8183792 AwtFrame::WmShowWindow() may steal focus
JDK-8183790 Downport minor fixes in java.net native code from JDK 9 to JDK 8
JDK-8183789 Mac OS: Unexpected JavaLaunchHelper message displaying
JDK-8183788 jdb returns invalid argument count if first parameter to Arrays.asList is null
JDK-8183787 (tz) Support tzdata2016i
JDK-8183786 [macosx] Various memory leaks in jdk9
JDK-8183784 RSAClientKeyExchange debug info is incorrect
JDK-8183783 JVM crash at sun.java2d.windows.GDIBlitLoops.nativeBlit
JDK-8183782 [PIT] Exception running java/awt/event/KeyEvent/KeyChar/KeyCharTest.java
JDK-8183781 VK_OEM_102 dead key detected as VK_UNDEFINED
JDK-8183780 Pending exceptions in java.base/windows/native/libnet
JDK-8183763 [macosx] Delete unused class NSPrintinfo
JDK-8183762 automatic discovery of LDAP servers with Kerberos authentication
JDK-8183761 jarsigner -verbose -verify should print the algorithms used to sign the jar
JDK-8183760 Add MD5 to signed JAR restrictions
JDK-8183759 Further improvements for Unix NetworkInterface native implementation
JDK-8183758 [macosx] Incorrect char to glyph mapping printing on OSX 10.10
JDK-8183757 Add debug output for indicating if a chosen ciphersuite was legacy
JDK-8183756 (tz) Support tzdata2016g
JDK-8183755 [REDO] JDWP: Memory Leak: GlobalRefs never deleted when processing invokeMethod command
JDK-8183754 [macos 10.12] Trackpad scrolling of text on macOS 10.12 Sierra is very fast (Trackpad, Retina only)
JDK-8183753 SIGSEGV when attempting to rotate BufferedImage using AffineTransform by NaN degrees
JDK-8183752 [TEST_BUG] :jdk/test/sun/misc/URLClassPath/ClassnameCharTest.java test fails with NullPointerException
JDK-8183751 [TEST_BUG] sun/security/ssl/SSLSocketImpl/CloseSocket.java failed with "Error while cleaning up threads after test"
JDK-8183750 sun/security/krb5/auto/MaxRetries.java failed with timeout
JDK-8183749 sun/security/krb5/auto/MaxRetries.java fails with Retry count is -1 less
JDK-8183748 sun/security/krb5/auto/MaxRetries.java may fail with BindException
JDK-8183747 com/sun/jndi/ldap/LdapTimeoutTest.java failed intermittently
JDK-8183746 [TEST_BUG] com/sun/jndi/ldap/LdapTimeoutTest.java fails at handleNamingException
JDK-8183745 [TEST_BUG] com/sun/jndi/ldap/LdapTimeoutTest.java failed intermittently
JDK-8183744 [TEST_BUG] com/sun/jndi/ldap/LdapTimeoutTest.java fails intermittently
JDK-8183742 Synthetic bridge constructor in ArrayList$Itr blocks inlining
JDK-8183740 Add invalid network / computer name cases to isReachable known failure switch
JDK-8183739 InetAddress.isReachable returns true for non existing IP addresses
JDK-8183738 [TEST_BUG] Test JarURLConnectionUseCaches.java fails at windows: failed to clean up files after test
JDK-8183737 JarURLConnection does not handle useCaches correctly
JDK-8183736 [macosx] two JNI locals to delete in AWTWindow.m, CGraphicsEnv.m
JDK-8183735 [macosx] modal dialog can skip the activation/focus events
JDK-8183734 CertificateException missing cause of underlying exception
JDK-8183733 [TEST_BUG] java/net/SetFactoryPermission/SetFactoryPermission.java should be added into :needs_compact2 group
JDK-8183732 [TEST_BUG] javax/xml/bind/marshal/8134111/UnmarshalTest.java should be added into :needs_jre group
JDK-8183731 Base64.Encoder.wrap(os).write(byte[],int,int) with incorrect arguments should not produce output
JDK-8183730 Avoid repeated "Please insert a smart card" popup windows
JDK-8183729 java.beans.MethodRef#get throws NullPointerException
JDK-8183728 [macosx] Cursor not updating correctly after closing a modal dialog
JDK-8183727 Small flaw when integrating 8160174 to JDK8
JDK-8183726 Finalizing one key of a KeyPair invalidates the other key
JDK-8183725 (smartcardio) CardTerminal.connect() throws CardException instead of CardNotPresentException
JDK-8183724 ISO 4217 amendment 160
JDK-8183723 java.net.NetworkInterface - fixes and improvements for network interface listing
JDK-8183722 ZoneOffset.ofHoursMinutesSeconds() does not reject invalid input
JDK-8183721 TextArea.replaceRange() and insert() are broken with setText(null)
JDK-8183720 [TEST_BUG] sun/security/krb5/auto/UnboundSSL.java fails
JDK-8183719 Update GIFlib library to the latest up-to-date
JDK-8183718 Duplicate entry in http.nonProxyHosts will ignore subsequent entries
JDK-8183717 Memory leak in com.apple.laf.AquaProgressBarUI: removed progress bar still referenced
JDK-8183716 [macosx] Press "To Back" button on the Dialog,the Dialog moves behind the Frame
JDK-8183715 [TEST_BUG] sun/net/www/protocol/http/HttpInputStream.java fails intermittently
JDK-8183714 Tests added in JDK-8163518 fail on some platforms
JDK-8183713 Integer overflow in StringBufferInputStream.read() and CharArrayReader.read/skip()
JDK-8183712 Unexpected NPE still possible on some Kerberos ticket calls
JDK-8183711 Update KerberosTicket to describe behavior if it has been destroyed and fix NullPointerExceptions
JDK-8183710 Remove dependency on sun.misc.RegexpPool and friends
JDK-8183705 sun.net.ftp.impl.FtpClient.nameList(String path) handles "null" incorrectly
JDK-8183704 (tz) Support tzdata2016f
JDK-8183703 JDK should be updated to use LittleCMS 2.8
JDK-8183702 JVM crashed with font manager on Solaris 12
JDK-8183701 (fs) LinuxWatchService can reports events against wrong directory
JDK-8183700 "text/uri-list" dataflavor concats the first two strings
JDK-8183699 Memory leak in com.apple.laf.ScreenMenu: removed JMenuItems are still referenced
JDK-8183698 Publishing two webservices on same port fails with "java.net.BindException: Address already in use"
JDK-8183697 java.lang.VerifyError: (class: GregorSamsa, method: template$dot$0$outline$1 signature: (LGregorSamsa$48;)V) Register 10 contains wrong type
JDK-8183696 Make XSL generated namespace prefixes local to transformation process
JDK-8183695 XSLTC transformer swallows empty namespace declaration which is needed to undeclare default namespace
JDK-8183694 Fix PermGen memory leaks caused by static final Exceptions
JDK-8183693 XmlGregorianCalendarImpl.getTimeZone() bug when offset is less than 10 minutes
JDK-8183686 REGRESSION: 8u91 update of 32 bit JRE removes preferences of the 64 bit JRE
JDK-8183684 FlightRecorderOptions settings for defaultrecording ignored.
JDK-8183680 PPC64: "mbind: Invalid argument" when -XX:+UseNUMA is used
JDK-8183679 PutfieldError failed with UnsupportedClassVersionError
JDK-8183678 Null pointer dereference of CodeCache::find_blob() result
JDK-8183677 Null pointer dereference in LoadNode::Identity()
JDK-8183676 Null pointer dereference in Matcher::xform()
JDK-8183675 Null pointer dereference in Matcher::ReduceInst()
JDK-8183674 Null pointer dereference in InitializeNode::complete_stores
JDK-8183673 Null pointer dereferences of ConstMethod::method()
JDK-8183672 compiler/dependencies/MonomorphicObjectCall/TestMonomorphicObjectCall.java fails product
JDK-8183671 Interned string and symbol table leak memory during parallel unlinking
JDK-8183670 HotSpot VM fails to start when AggressiveHeap is set
JDK-8183669 Exception "Duplicate field name&signature in class file" should report the name and signature of the field
JDK-8183668 C1: NPE is thrown instead of LinkageError when accessing inaccessible field on NULL receiver
JDK-8183667 Weblogic12medrec assert(handler_address == SharedRuntime::compute_compiled_exc_handler(nm, pc, exception, force_unwind, true)) failed: Must be the same
JDK-8183665 nmethod's exception cache not multi-thread safe
JDK-8183664 Range check dependent CastII/ConvI2L is prematurely eliminated
JDK-8183663 C1 value numbering handling of Unsafe.get*Volatile is incorrect
JDK-8183662 hs_err improvement: Add event logging for class redefinition to the hs_err file
JDK-8183661 SA does not work if executable is DSO
JDK-8183660 Infinite loop in handle_wrong_method in jmod
JDK-8183659 Crash in klassItable::initialize_itable_for_interface when running SelectionResolution InvokeInterfaceICCE.java
JDK-8183658 need more workarounds for suspend equivalent condition issue
JDK-8183657 [linux] Experimental support for cgroup memory limits in container (ie Docker) environments
JDK-8183656 C2: anti dependence missed because store hidden by membar
JDK-8183654 Scanning method file for initialized final field updates can fail for non-existent fields
JDK-8183653 assert(c == Bytecodes::_putfield) failed: must be putfield
JDK-8183652 Compilers accept modification of final fields outside initializer methods
JDK-8183651 G1 crashes if active_processor_count changes during startup
JDK-8183650 Cache initial active_processor_count
JDK-8183649 Update OS detection code to recognize Windows Server 2016
JDK-8183648 CMS: Crash in CardTableModRefBSForCTRS::process_chunk_boundaries
JDK-8183647 unexpected profiling mismatch in c1 generated code
JDK-8183646 C2: Handle "wide" aliases for unsafe accesses
JDK-8183645 C2: opaque unsafe access triggers an assert
JDK-8183644 C2: Type speculation produces mismatched unsafe accesses
JDK-8183643 [REDO] failed: no mismatched stores, except on raw memory: StoreB StoreI
JDK-8183642 Crash in HotSpot with jvm.dll+0x42b48 ciObjectFactory::create_new_metadata
JDK-8183641 C2 compilation fails with SIGSEGV
JDK-8183640 nmethod::oops_do_marking_epilogue always runs verification code
JDK-8183639 Cyclic interface initialization causes JVM crash
JDK-8183638 Utils.tryFindJvmPid sometimes find incorrect pid
JDK-8183637 Unsafe_DefineClass0 accesses raw oops while in _thread_in_native
JDK-8183636 Enable 8130150 and 8081778 intrinsics by default
JDK-8183634 Runtime.availableProcessors() ignores Linux taskset command
JDK-8183633 Long pause in ParOldGC, because ParallelTaskTerminator peeks wrong TaskQueueSet
JDK-8183631 missing precedence edge for anti_dependence
JDK-8183630 Random infrequent null pointer exceptions in javac
JDK-8183629 Unrecognized VM option 'UseCountedLoopSafepoints'
JDK-8183628 jvm crashes when -XX:+UseCountedLoopSafepoints is enabled
JDK-8183627 Threads may do significant work out of the non-shared overflow buffer
JDK-8183626 Performance regression: bimorphic inlining may be bypassed by type speculation
JDK-8183624 PPC64: Support AES intrinsics
JDK-8183623 Fix for JDK-8147451 failed: Crash in Method::checked_resolve_jmethod_id(_jmethodID*)
JDK-8183621 JRE 6u121 causes applet to fail with: Reset deny session certificate store
JDK-8183620 backout changes for 8176516 (backport of 8173791)
JDK-8183617 Fedora Linux issue with jnlp-servlet.jar demo source code license
JDK-8183616 JNLP fails to get loaded with old javaws when multiple jres (jre9 and jre8u111) installed
JDK-8183612 Registered JREs match to different 'osname'
JDK-8183607 java.lang.SecurityException: Failed to extract baseline.versions error
JDK-8183605 Side effects of using url schema handler.
JDK-8183604 [macos] JVM continuously throw a NullPointerException on new MacOS 10.12
JDK-8183595 Selecting 32/64 bit resources failed if user has installed both jre's
JDK-8183594 dtjava - chrome / edge browser - "Java Plug-in is not supported by this browser. More info" message box blocking content
JDK-8183592 Deadlock in Java Web Start application involving JNLPClassLoader
JDK-8183588 PPC64/s390x/aarch64: Poor StrictMath performance due to non-optimized compilation
JDK-8183587 ASSEMBLY_EXCEPTION contains historical company name
JDK-8183585 Build needs additional flags to compile with GCC 6
JDK-8183494 missing LNT entry for finally block
JDK-8183493 jdeps to detect MR jar file and output a warning
JDK-8183487 Regression since 8u60: System.getenv doesn't return env var set in JNI code
JDK-8183486 [macos] javafx.print.PrinterJob.showPrintDialog() hangs on macOS
JDK-8183485 SocketInputStream.socketRead0 can hang even with soTimeout set
JDK-8183484 MoveToOtherScreenTest fails due wrong key attribute
JDK-8183483 IllegalArgumentException: adding a component to a container on a different GraphicsDevice
JDK-8183482 [macosx] JList, VO can't access non-visible list items
JDK-8183481 [macosx] Custom Swing text components need to allow standard accessibility
JDK-8183480 Android Studio 2.x crashes with NPE at sun.lwawt.macosx.CAccessibility.getAccessibleIndexInParent
JDK-8183478 NPE in AccessBridge while editing JList model
JDK-8183477 [macosx] PrintRequestAttributeSet breaks page size set using PageFormat
JDK-8183476 [macosx] PrinterJob's native Print Dialog does not reflect specified Copies or Page Ranges
JDK-8183474 After updating to Java8u131, the bind to rmiregistry is rejected by registryFilter even though registryFilter is set
JDK-8183468 JFileChooser with Windows look and feel crashes on win 10
JDK-8183466 [macos] JComboBox doesn't display popup in mixed JavaFX Swing Application on 8u131 and Mac OS 10.12
JDK-8183464 Improved algorithm constraints checking
JDK-8183463 sun.management.LazyCompositeData.isTypeMatched() fails for composite types with items of ArrayType
JDK-8183462 Race Condition in java.lang.reflect.WeakCache
JDK-8183460 Menu is activated after using mnemonic Alt/Key combination
JDK-8183459 New tests from 8144566 fail with "No expected Server Name Indication"
JDK-8183458 Custom HostnameVerifier disables SNI extension
JDK-8183457 java.nio.Bits.unaligned() doesn't return true on ppc
JDK-8183454 (tz) Support tzdata2017b
JDK-8183449 Failed to load RSA private key from pkcs12
JDK-8183443 In java 8, the marshalling with JAX-WS does not escape carriage return
JDK-8183442 SAXParseException when sending soap message
JDK-8183437 Mach 5 builds failed on Windows/install repo after JDK-8173207
JDK-8183435 Crash in ClassLoaderData/JNIHandleBlock::oops_do during concurrent marking
JDK-8183434 Add a new CPU family (S_family) for SPARC S7 and above processors
JDK-8183433 java in ldoms, with cpu-arch=generic has problems
JDK-8183432 Use new API to get cache line sizes
JDK-8183431 Remove assertions in 8u that were removed by 8056124 in 9.
JDK-8183430 expose L1_data_cache_line_size for diagnostic/sanity checks
JDK-8183429 remove legacy code in SPARC's VM_Version::platform_features
JDK-8183428 HotSpot leaking memory in long-running requests
JDK-8183426 [TESTBUG] 8174164 fix missed the test
JDK-8183425 SafePointNode::_replaced_nodes breaks with irreducible loops
JDK-8183415 WebStart does not clean up jnlp file after closing
JDK-8182303 New defaults for DSA keys in jarsigner and keytool
JDK-8182062 Missing @bug for tests added with JDK-8165367
JDK-8181975 Run sun/security/pkcs11 tests on Mac
JDK-8181717 Check the AlgorithmParameters in algorithm constraints
JDK-8181445 Test the jdk.tls.namedGroups System Property
JDK-8181131 Use short name of SupportedEllipticCurvesExtension.java
JDK-8180596 Additional tests for JEP 288: Disable SHA-1 Certificates
JDK-8179236 Missing copyright headers for some files
JDK-8178682 Negotiated Finite Field Diffie-Hellman Ephemeral Parameters for TLS
JDK-8177509 Update copyright header for files modified in 2017
JDK-8177485 Minor optimizations to ISO10126PADDING
JDK-8177411 lookupDefaultPrintService returns null on Solaris 11 when default printer is set using lpoptions command
JDK-8177410 Performance problems in dialogs with large tables when JAB activated
JDK-8177409 Text is displayed in bold when fonts are installed into symlinked folder
JDK-8177408 [macosx] Chinese text shows as Latin w/ openVanilla input method
JDK-8177404 [REDO] MemberNameTable doesn't purge stale entries
JDK-8177403 Crash in rebuild_cpu_to_node_map
JDK-8177300 CosNaming's implementation doesn't comply with the specification
JDK-8177149 sun/net/www/http/HttpClient/B8025710.java should run in ovm mode
JDK-8176164 Update copyright header for files modified in 2016
JDK-8175158 Ucrypto Library leaks native memory
JDK-8175157 Double icons with JMenuItem setHorizontalTextPosition on Win 10
JDK-8175156 Deleting a file from either the open or save java.awt.FileDialog hangs.
JDK-8175151 Instance field load is replaced by wrong data Phi
JDK-8173296 Resizing dialog which is JWindow parent makes JVM crash
JDK-8167597 Apply algorithm constraints to timestamped code
JDK-8166362 [TEST_BUG] test sun/net/www/http/HttpClient/B8025710.java failing with cert error in 8u121 b01
JDK-8163480 Ship the unlimited policy files in JDK Updates

Committer push log

Kevin Walls, Oracle

Bug Summary
JDK-8157548 JVM crashes sometimes while starting