PUSHES REPORT: 8u192

This report shows who pushed the backports to the given release. This usually shows who did the backporting, testing, and review work.

Report generated: Mon Nov 08 19:44:58 CET 2021

Distribution by priority

Count Priority
6 P1
68 P2
98 P3
77 P4
5 P5

Distribution by components

Count Component
254 100% Total
74 29.1% hotspot
35 13.8% hotspot/runtime
22 8.7% hotspot/compiler
9 3.5% hotspot/gc
4 1.6% hotspot/jvmti
2 0.8% hotspot/svc
1 0.4% hotspot/svc-agent
1 0.4% hotspot
53 20.9% security-libs
23 9.1% security-libs/java.security
13 5.1% security-libs/javax.net.ssl
8 3.1% security-libs/javax.crypto
4 1.6% security-libs/javax.crypto:pkcs11
3 1.2% security-libs
1 0.4% security-libs/jdk.security
1 0.4% security-libs/org.ietf.jgss
45 17.7% client-libs
20 7.9% client-libs/java.awt
10 3.9% client-libs/2d
10 3.9% client-libs/javax.swing
5 2.0% client-libs/javax.accessibility
34 13.4% core-libs
10 3.9% core-libs/java.time
5 2.0% core-libs/java.net
4 1.6% core-libs/java.rmi
4 1.6% core-libs/javax.naming
2 0.8% core-libs/java.nio
2 0.8% core-libs/java.util.jar
1 0.4% core-libs/jdk.nashorn
1 0.4% core-libs/java.io:serialization
1 0.4% core-libs/java.util.logging
1 0.4% core-libs/java.util:collections
1 0.4% core-libs
1 0.4% core-libs/java.lang:reflect
1 0.4% core-libs/java.lang
33 13.0% infrastructure
32 12.6% infrastructure/build
1 0.4% infrastructure
7 2.8% xml
4 1.6% xml/jax-ws
2 0.8% xml/jaxb
1 0.4% xml/jaxp
3 1.2% core-svc
2 0.8% core-svc/debugger
1 0.4% core-svc/java.lang.management
3 1.2% tools
1 0.4% tools/javac
1 0.4% tools/javadoc(tool)
1 0.4% tools/launcher
1 0.4% other-libs
1 0.4% other-libs/corba
1 0.4% performance
1 0.4% performance

Distribution by affiliation

Count Committer
254 100% Total
192 75.6% Oracle
107 42.1% Robert Mckenna
43 16.9% Kevin Walls
16 6.3% David Buck
6 2.4% Sean Coffey
5 2.0% Alexey Ivanov
4 1.6% Anton Litvinov
2 0.8% Aleksej Efimov
2 0.8% Erik Joelsson
2 0.8% Poonam Bajaj Parhar
2 0.8% Dmitry Markov
1 0.4% Jonathan Gibbons
1 0.4% Hannes Wallnoefer
1 0.4% Vladimir Ivanov
20 7.9% Red Hat
9 3.5% Andrew Hughes
7 2.8% Aleksey Shipilev
1 0.4% Andrew Haley
1 0.4% Severin Gehwolf
1 0.4% Mario Torre
1 0.4% Roland Westrelin
17 6.7% IBM
17 6.7% Ramanand Patil
13 5.1% Google
13 5.1% Ivan Gerasimov
10 3.9% Independent
10 3.9% Abhijit Saha
2 0.8% SAP
2 0.8% Christoph Langer

Chronological push log:

Days Ago Committer Affiliation Bug Summary
1203 Ramanand Patil IBM JDK-8134124 sun/security/tools/jarsigner/warnings.sh fails when using Hindi locale
1207 David Buck Oracle JDK-8206405 G1 doesn't honor request to disable class unloading
1208 Erik Joelsson Oracle JDK-8207853 Need to regenerate configure in jdk8u-dev
1208 Erik Joelsson Oracle JDK-8207852 Add --with-debug-symbols=[none|internal|external|zipped]
1208 Severin Gehwolf Red Hat JDK-8207402 Stray *.debuginfo files when not stripping debug info
1210 Anton Litvinov Oracle JDK-8207685 When determining the ciphersuite lists there is no debug output for disabled suites.
1210 Sean Coffey Oracle JDK-8201541 Debug exception stacks should be clearer
1214 Ramanand Patil IBM JDK-8207232 Handshake messages can be strictly ordered
1216 Andrew Haley Red Hat JDK-8206406 StubCodeDesc constructor publishes partially-constructed objects on StubCodeDesc::_list
1216 Kevin Walls Oracle JDK-8205677 [8u] casts and type change for 8u to enable later Windows compilers
1217 Robert Mckenna Oracle JDK-8206914 add jdk8u-dev test failures to ProblemList.txt
1218 Kevin Walls Oracle JDK-8206454 [8u] os::current_stack_pointer() fails to compile on later Windows compilers (warning C4172: returning address of local variable)
1218 Ramanand Patil IBM JDK-8206907 Remove exclusion range for phonetic chars in windows fontconfig.properties
1220 Poonam Bajaj Parhar Oracle JDK-8205629 Improve docker container detection and resource configuration usage
1221 Andrew Hughes Red Hat JDK-8206481 ArrayIndexOutOfBoundsException at sun.java2d.pisces.Dasher.goTo(Dasher.java:151)
1221 Aleksey Shipilev Red Hat JDK-8206425 .gnu_debuglink sections added unconditionally when no debuginfo is stripped
1223 David Buck Oracle JDK-8198556 ConstantPool::_resolved_references is missing in heap dump
1228 Andrew Hughes Red Hat JDK-8206111 GTK+ L&F JTextComponent not respecting desktop caret blink rate
1229 Jonathan Gibbons Oracle JDK-8206010 Javadoc crashes when method name ends with "Property"
1230 Kevin Walls Oracle JDK-8204872 [8u] VS2017: more instances of "error C3680: cannot concatenate user-defined string literals with mismatched literal suffix identifiers"
1230 Andrew Hughes Red Hat JDK-8205931 Zero: S390 31bit atomic_copy64 inline assembler is wrong
1230 Andrew Hughes Red Hat JDK-8205930 Zero's atomic_copy64() should use SPE instructions on linux-powerpcspe
1230 Andrew Hughes Red Hat JDK-8205929 Zero: segfaults on Power PC 32-bit
1231 Kevin Walls Oracle JDK-8205440 [8u] DWORD64 required for later Windows compilers
1231 Ramanand Patil IBM JDK-8205674 HashMap: Entry.setValue may not work after Iterator.remove() called for previous entries
1231 Kevin Walls Oracle JDK-8205635 runtime/NMT/MallocSiteHashOverflow.java failing in nightlies
1235 Dmitry Markov Oracle JDK-8205529 Shift or Capslock not working in Textfield after accented keystrokes
1235 Kevin Walls Oracle JDK-8205522 VS2017 (C4838, C4312) Various conversion issues with gtest tests
1237 Kevin Walls Oracle JDK-8205431 TOOLCHAIN_FIND_COMPILER unexpectedly resolves symbolic links
1237 Kevin Walls Oracle JDK-8205430 Only display resolved symlink for compiler, do not change path
1237 Andrew Hughes Red Hat JDK-8205425 compile.cpp verify_graph_edges uses "bool" as "int"
1238 Kevin Walls Oracle JDK-8205354 Fix os_windows siglabel
1238 Kevin Walls Oracle JDK-8205196 Inconsistent types for ideal_reg
1241 Kevin Walls Oracle JDK-8205127 VS2017 (C4334) Result of 32-bit Shift Implicitly Converted to 64 bits
1242 Aleksey Shipilev Red Hat JDK-8205104 EXTRA_LDFLAGS not consistently being used
1242 Kevin Walls Oracle JDK-8205086 Hotspot compile warning: "Invalid suffix on literal; C++11 requires a space between literal and identifier"
1242 Kevin Walls Oracle JDK-8205073 VS2017 (C2065) 'timezone': Undeclared Identifier in share/runtime/os.cpp
1243 Ivan Gerasimov Google JDK-8204343 Release session if initialization of SunPKCS11 Signature fails
1243 Ramanand Patil IBM JDK-8203910 Incorrect usage of Iterator in Java 8 In com.sun.jndi.ldap.EventSupport.removeNamingListener
1244 Kevin Walls Oracle JDK-8204968 VS2017 Multiple Type Cast Conversion Compilation Errors
1244 Mario Torre Red Hat JDK-8204962 AWT java apps fail to start when some minimal fonts are present
1244 Kevin Walls Oracle JDK-8204926 Wrong cast in metadata_at_put
1244 Alexey Ivanov Oracle JDK-8179675 Build with error on windows with new Cygwin grep
1245 Ivan Gerasimov Google JDK-8204702 javax/xml/crypto/dsig/SecurityManager/XMLDSigWithSecMgr.java test failed with AccessControlException
1248 Kevin Walls Oracle JDK-8204649 Add build support for VS 2015/2017
1250 Kevin Walls Oracle JDK-8204567 VS2017 Addition of Global Delete Operator with Size Parameter Conflicts with Arena's Chunk Provided One
1252 David Buck Oracle JDK-8204053 libsaproc.so not linked with -z,noexecstack
1252 Ramanand Patil IBM JDK-8203934 (tz) Upgrade time-zone data to tzdata2018e
1257 Ivan Gerasimov Google JDK-8204185 sun/security/ssl/CertPathRestrictions/TLSRestrictions.java failed with unexpected Exception intermittently
1257 Ivan Gerasimov Google JDK-8204129 ObjectInputStream filterCheck method throws NullPointerException
1257 Alexey Ivanov Oracle JDK-8204171 Fix broken CL version detection in configure for some Visual Studio configurations
1257 David Buck Oracle JDK-8203845 backport of JDK-8034788 inadvertently rolled back JDK-8187045 changes to toolchain.m4
1263 Alexey Ivanov Oracle JDK-8203790 MSVCP dependency introduced in awt.dll
1267 Kevin Walls Oracle JDK-8203493 Enable use of devkits for Windows.
1267 Kevin Walls Oracle JDK-8203349 8u hotspot should recognise later Windows compilers
1270 Vladimir Ivanov Oracle JDK-8203388 Crash in C2 escape analysis with assert: "node should be registered"
1271 Kevin Walls Oracle JDK-8203351 Source changes needed to build JDK 9 with Visual Studio 2013 (VS2013)
1273 Robert Mckenna Oracle JDK-8202996 Remove debug print statements from RMI fix
1278 Aleksey Shipilev Red Hat JDK-8202916 Missing G1 barrier in Unsafe_GetObjectVolatile
1284 Ramanand Patil IBM JDK-8202648 Backout JDK-8152974
1284 Sean Coffey Oracle JDK-8202645 [Zero] Reduce limits of max heap size for boot JDK on s390
1284 Aleksey Shipilev Red Hat JDK-8202643 libfontmanager must be built with LDFLAGS allowing unresolved symbols
1284 Aleksey Shipilev Red Hat JDK-8202600 [Zero] Undefined behaviour in src/os_cpu/linux_zero/vm/os_linux_zero.cpp
1286 Ramanand Patil IBM JDK-8200577 Images are not scaled correctly in JEditorPane
1287 Ivan Gerasimov Google JDK-8193171 keytool -list displays "JKS" for a PKCS12 keystore.
1287 David Buck Oracle JDK-8202470 Build failure with SS12u4
1291 David Buck Oracle JDK-8202376 Fix for Solaris Studio C++ 5.13, CHECK_UNHANDLED_OOPS breaks PPC build
1291 David Buck Oracle JDK-8202375 Solaris Studio 12.4 C++ 5.13, CHECK_UNHANDLED_OOPS use of class oop's copy constructor definitions causing error level diagnostic
1291 Christoph Langer SAP JDK-8202369 Inet4AddressImpl_getLocalHostName reverse lookup on Solaris only
1293 Ramanand Patil IBM JDK-8202251 Fastdebug VM crashes with "ExceptionMark destructor expects no pending exceptions" error
1294 Anton Litvinov Oracle JDK-8202206 Touch keyboard is not shown, if text component gets focus from other text component
1294 Alexey Ivanov Oracle JDK-8201557 Fix potential crash in BufImg_SetupICM
1294 Alexey Ivanov Oracle JDK-8201802 Improve releasing native resources of BufImgSurfaceData.ICMColorData
1295 David Buck Oracle JDK-8202153 adlc fails to compile with SS12u4
1295 Aleksej Efimov Oracle JDK-8196491 Newlines in JAXB string values of SOAP-requests are escaped to " "
1295 Kevin Walls Oracle JDK-8182730 Use SW prefetch instructions instead of BIS for allocation prefetches on SPARC Core C4
1299 Ramanand Patil IBM JDK-8201423 (tz) Upgrade time-zone data to tzdata2018d
1299 Kevin Walls Oracle JDK-8202020 Build the freetype library during configure on Windows
1299 Kevin Walls Oracle JDK-8202019 Windows/MSYS builds broken
1299 Kevin Walls Oracle JDK-8201798 Incremental HotSpot builds broken on Windows
1299 Robert Mckenna Oracle JDK-8189789 tomcat gzip-compressed response bodies appear to be broken in update 151
1300 Abhijit Saha Independent JDK-8201699 increase java.util.logging.FileHandler MAX_LOCKS limit
1300 Abhijit Saha Independent JDK-8201694 Class name repeated in output of Type.toString()
1300 Abhijit Saha Independent JDK-8201690 [Windows] java.awt.IllegalComponentStateException: component must be showing on the screen to determine its location
1300 Abhijit Saha Independent JDK-8201688 JDWP exit error JVMTI_ERROR_WRONG_PHASE(112)
1300 Abhijit Saha Independent JDK-8201686 JDK 8u131 socketRead0 hang at SSL read
1300 Abhijit Saha Independent JDK-8201685 Relax RMI Registry Serial Filter to allow arrays of any type
1300 Abhijit Saha Independent JDK-8201680 Improve javax.crypto.BadPaddingException messages
1300 Abhijit Saha Independent JDK-8201677 Change of behavior in the getMessage () method of the SOAPMessageContextImpl class
1300 Abhijit Saha Independent JDK-8201674 [TEST_BUG] CompressedClassSpaceSizeInJmapHeap.java fails if SA not available
1300 Abhijit Saha Independent JDK-8201672 Time related C1 intrinsics produce inconsistent results when floating around
1301 Kevin Walls Oracle JDK-8201662 libjsig compilation is missing EXTRA_CFLAGS on macosx
1302 Kevin Walls Oracle JDK-8201586 Cleanup and fix sysroot and devkit handling on Linux and Solaris
1302 Aleksey Shipilev Red Hat JDK-8201583 JVMTI tagged object access needs G1 pre-barrier
1302 Aleksey Shipilev Red Hat JDK-8201581 Montgomery multiply intrinsic should use correct name
1302 Ramanand Patil IBM JDK-8200578 AWT hang occurrs when sequenced events arrive out of sequence
1306 Kevin Walls Oracle JDK-8201501 Configure fails in cygwin if current dir is in /home/user
1306 Kevin Walls Oracle JDK-8201500 Warn instead of fail when calling the configure wrapper directly
1306 Kevin Walls Oracle JDK-8201499 Improvements in autoconf integration
1306 Aleksej Efimov Oracle JDK-8067239 [TESTBUG] javax/xml/bind/marshal/8036981/Test.java failed
1306 Kevin Walls Oracle JDK-8201481 Add "reconfigure" target for re-creating a configuration
1307 Ivan Gerasimov Google JDK-8200479 [TEST_BUG] java/security/Signature/SignatureLength.java fails
1311 Kevin Walls Oracle JDK-8201277 New cygwin grep does not match \r as newline
1312 Kevin Walls Oracle JDK-8201253 Clean up Visual Studio detection logic
1312 Ramanand Patil IBM JDK-8200226 scroll position in ScrollPane is reset after calling validate()
1313 Kevin Walls Oracle JDK-8201191 Must keep microsoft VS_PATH on PATH after toolchain detection
1313 Kevin Walls Oracle JDK-8201190 Rewrite toolchain.m4 to support multiple toolchains per platform
1318 Poonam Bajaj Parhar Oracle JDK-8200548 Performance drop with Java JDK 1.8.0_162-b32
1320 David Buck Oracle JDK-8200414 Crash with assert(handler_address == SharedRuntime::compute_compiled_exc_handler(..) failed: Must be the same
1322 Sean Coffey Oracle JDK-8164019 Introduce system property to control enabled ciphersuites
1323 Ramanand Patil IBM JDK-8197919 NullPointerExcpn-java.awt.image.FilteredImageSource.startProduction JDK-8079607
1326 Ramanand Patil IBM JDK-8194642 Improve OOM error reporting for JDK8
1326 David Buck Oracle JDK-8200154 Hotspot crash on Cassandra 3.11.1 startup with libnuma 2.0.3
1328 Kevin Walls Oracle JDK-8199935 Configure should handle overrides of tools better
1329 Roland Westrelin Red Hat JDK-8199864 IfNode::range_check_trap_proj() should handle dying subgraph with single if proj
1329 Kevin Walls Oracle JDK-8199805 disable ccache by default
1334 Kevin Walls Oracle JDK-8199694 hs_err improvement: Print exact compressed oops mode and the heap base value.
1334 Kevin Walls Oracle JDK-8199693 hs_err improvement: Add time zone information in the hs_err file
1334 Kevin Walls Oracle JDK-8168695 hs_err improvement: Print if we have seen any OutOfMemoryErrors or StackOverflowErrors
1335 Anton Litvinov Oracle JDK-8199610 Touch keyboard does not hide, when a text component looses focus
1336 Ivan Gerasimov Google JDK-8199492 Compilation errors in jdk.crypto.mscapi with VS 2017
1336 Ivan Gerasimov Google JDK-8199491 Native implementation of sunmscapi should use operator new (nothrow) for allocations
1340 Sean Coffey Oracle JDK-8199418 Kerberos krb5 authentication: AuthList's put method leads to performance issue
1342 Anton Litvinov Oracle JDK-8198996 Touch keyboard is shown for a non-focusable text component
1343 Sean Coffey Oracle JDK-8199134 Impact of noncloneable MessageDigest implementation
1343 Christoph Langer SAP JDK-8197943 Unable to use JDWP API in JDK 8 to debug JDK 9 VM
1348 Dmitry Markov Oracle JDK-8198851 On Windows Swing changes keyboard layout on a window activation
1348 Ramanand Patil IBM JDK-8198880 [TEST_BUG] PreserveFPRegistersTest.java runs out of memory in the nightlies
1349 Andrew Hughes Red Hat JDK-8198813 linux-zero does not build without precompiled header
1354 Andrew Hughes Red Hat JDK-8196952 Bad primeCertainty value setting in DSAParameterGenerator
1356 Andrew Hughes Red Hat JDK-8198454 Zero port of 8174962: Better interface invocations
1361 Ivan Gerasimov Google JDK-8198298 EndEntityChecker should not process custom extensions after PKIX validation
1363 Ivan Gerasimov Google JDK-8197952 sun/security/mscapi/SignedObjectChain.java fails on Windows
1368 Sean Coffey Oracle JDK-8196854 TestFlushableGZIPOutputStream failing with IndexOutOfBoundsException
1368 Ivan Gerasimov Google JDK-8197457 SupportedDSAParamGen.java failed with timeout
1369 Ivan Gerasimov Google JDK-8197386 sun/security/pkcs11/ec/ReadCertificates.java fails intermittently
1369 Robert Mckenna Oracle JDK-8197383 missing LNT entry for finally block
1369 Robert Mckenna Oracle JDK-8197382 Increase the number of clones in the CloneableDigest
1369 Robert Mckenna Oracle JDK-8197381 Create an alternative fix for JDK-8167102, whose fix was backed out
1369 Robert Mckenna Oracle JDK-8197379 keytool fails to format resource strings for keys for some languages after JDK-8171319
1369 Robert Mckenna Oracle JDK-8197378 test tck.java.time.zone.TCKZoneRules is broken by tzdata2017c
1369 Robert Mckenna Oracle JDK-8197377 com/sun/crypto/provider/KeyAgreement/SupportedDHParamGens.java failed with timeout
1369 Robert Mckenna Oracle JDK-8197374 [TEST_BUG] sun/security/pkcs11/KeyPairGenerator/TestDH2048.java fails on Solaris x64 5.10
1369 Robert Mckenna Oracle JDK-8197372 Text in native popup is not always updated with Sogou IME
1369 Robert Mckenna Oracle JDK-8197371 src/jdk.management/share/native/libmanagement_ext/GcInfoBuilder.c doesn't handle JNI exceptions properly
1369 Robert Mckenna Oracle JDK-8197370 [macos] Font2DTest demo started failing for Arabic range from JDK 8 u162 b01 on Mac
1369 Robert Mckenna Oracle JDK-8197369 Fix compatibility issue in AlgorithmChecker for 3rd party JCE providers
1369 Robert Mckenna Oracle JDK-8197368 sun/security/provider/NSASuiteB/TestDSAGenParameterSpec.java timeouts intermittently
1369 Robert Mckenna Oracle JDK-8197361 [testlibrary] TestSocketFactory should allow triggers before match/replace
1369 Robert Mckenna Oracle JDK-8197360 [testlibrary] rmi TestSocketFactory does not flush
1369 Robert Mckenna Oracle JDK-8197356 New defaults for DSA keys in jarsigner and keytool
1369 Robert Mckenna Oracle JDK-8197353 DNS provider cleanups
1369 Robert Mckenna Oracle JDK-8197352 Backport jdk/test/lib/testlibrary/CompilerUtils.java to jdk8u which is helpful in test development
1369 Robert Mckenna Oracle JDK-8197350 keytool should not warn if signature algorithm used in cacerts is weak
1369 Robert Mckenna Oracle JDK-8197349 keytool should print out warnings when reading or generating cert/cert req using weak algorithms
1369 Robert Mckenna Oracle JDK-8197348 Keytool, print key algorithm of certificate or key entry
1369 Robert Mckenna Oracle JDK-8197342 [macos] javafx.print.PrinterJob.showPrintDialog() hangs on macOS
1369 Robert Mckenna Oracle JDK-8197341 SocketInputStream.socketRead0 can hang even with soTimeout set
1369 Robert Mckenna Oracle JDK-8197340 MoveToOtherScreenTest fails due wrong key attribute
1369 Robert Mckenna Oracle JDK-8197339 Failed to load RSA private key from pkcs12
1369 Robert Mckenna Oracle JDK-8197338 IllegalArgumentException: adding a component to a container on a different GraphicsDevice
1369 Robert Mckenna Oracle JDK-8197337 [macosx] JList, VO can't access non-visible list items
1369 Robert Mckenna Oracle JDK-8197336 [macosx] Custom Swing text components need to allow standard accessibility
1369 Robert Mckenna Oracle JDK-8197335 Android Studio 2.x crashes with NPE at sun.lwawt.macosx.CAccessibility.getAccessibleIndexInParent
1369 Robert Mckenna Oracle JDK-8197333 NPE in AccessBridge while editing JList model
1369 Robert Mckenna Oracle JDK-8197332 [macosx] PrintRequestAttributeSet breaks page size set using PageFormat
1369 Robert Mckenna Oracle JDK-8197331 [macosx] PrinterJob's native Print Dialog does not reflect specified Copies or Page Ranges
1369 Robert Mckenna Oracle JDK-8197330 Run sun/security/pkcs11 tests on Mac
1369 Robert Mckenna Oracle JDK-8197329 Test the jdk.tls.namedGroups System Property
1369 Robert Mckenna Oracle JDK-8197326 Use short name of SupportedEllipticCurvesExtension.java
1369 Robert Mckenna Oracle JDK-8197318 lookupDefaultPrintService returns null on Solaris 11 when default printer is set using lpoptions command
1369 Robert Mckenna Oracle JDK-8197317 Performance problems in dialogs with large tables when JAB activated
1369 Robert Mckenna Oracle JDK-8197316 Text is displayed in bold when fonts are installed into symlinked folder
1369 Robert Mckenna Oracle JDK-8197315 [macosx] Chinese text shows as Latin w/ openVanilla input method
1369 Robert Mckenna Oracle JDK-8197313 IllegalArgumentException: jdk.tls.namedGroups
1369 Robert Mckenna Oracle JDK-8197312 Menu is activated after using mnemonic Alt/Key combination
1369 Robert Mckenna Oracle JDK-8197311 sun/net/www/http/HttpClient/B8025710.java should run in ovm mode
1369 Robert Mckenna Oracle JDK-8197310 [TEST_BUG] test sun/net/www/http/HttpClient/B8025710.java failing with cert error in 8u121 b01
1369 Robert Mckenna Oracle JDK-8197307 FtpURLConnection connection leak on FileNotFoundException
1369 Robert Mckenna Oracle JDK-8197306 Double icons with JMenuItem setHorizontalTextPosition on Win 10
1369 Robert Mckenna Oracle JDK-8197305 Deleting a file from either the open or save java.awt.FileDialog hangs.
1369 Robert Mckenna Oracle JDK-8197304 With JDK 1.7 text field does not obtain focus when using mnemonic Alt/Key combin
1369 Robert Mckenna Oracle JDK-8197301 [macosx] Activating a JDialog puts to back another dialog
1369 Robert Mckenna Oracle JDK-8197300 Deadlock in com.sun.jndi.ldap.pool.Connections
1369 Robert Mckenna Oracle JDK-8197297 The new menu can't be shown on the menubar after clicking the "Add" button.
1369 Robert Mckenna Oracle JDK-8197296 IME Composition Window is displayed at incorrect location
1369 Robert Mckenna Oracle JDK-8197295 Resizing dialog which is JWindow parent makes JVM crash
1369 Robert Mckenna Oracle JDK-8197294 closed/java/awt/MenuBar/MenuBarStress1/MenuBarStress1.java hangs on win 64 bit with jdk8
1369 Robert Mckenna Oracle JDK-8197292 Certificates not being blocked by jdk.tls.disabledAlgorithms property
1369 Robert Mckenna Oracle JDK-8197291 ReflectionFactory support for IIOP and custom serialization
1369 Robert Mckenna Oracle JDK-8197286 Chrome interop regression with JDK-8148516
1369 Robert Mckenna Oracle JDK-8197231 (tz) Support tzdata2017c
1369 Robert Mckenna Oracle JDK-8197227 Restrict the use of EXPORT cipher suites
1369 Robert Mckenna Oracle JDK-8197223 [TEST_BUG] Cipher tests fail when running with unlimited policy
1369 Robert Mckenna Oracle JDK-8197204 Jar file verification failing with SecurityException: digest missing xxx
1369 Robert Mckenna Oracle JDK-8197199 Missing @bug for tests added with JDK-8165367
1369 Robert Mckenna Oracle JDK-8197197 (tz) Support tzdata2017b
1369 Robert Mckenna Oracle JDK-8197191 Check the AlgorithmParameters in algorithm constraints
1369 Robert Mckenna Oracle JDK-8197187 Negotiated Finite Field Diffie-Hellman Ephemeral Parameters for TLS
1369 Robert Mckenna Oracle JDK-8197185 Additional tests for JEP 288: Disable SHA-1 Certificates
1369 Robert Mckenna Oracle JDK-8197164 Improved algorithm constraints checking
1369 Robert Mckenna Oracle JDK-8197162 (tz) Support tzdata2017a
1369 Robert Mckenna Oracle JDK-8197161 (tz) Support tzdata2016j
1369 Robert Mckenna Oracle JDK-8197147 [macosx] Cursor management unification
1369 Robert Mckenna Oracle JDK-8197146 (tz) Support tzdata2016i
1369 Robert Mckenna Oracle JDK-8197114 Apply algorithm constraints to timestamped code
1369 Robert Mckenna Oracle JDK-8197104 Transport Layer Security (TLS) Session Hash and Extended Master Secret Extension
1369 Robert Mckenna Oracle JDK-8197097 Support DHE sizes up to 8192-bits and DSA sizes up to 3072-bits
1369 Robert Mckenna Oracle JDK-8197094 Enable unlimited cryptographic policy by default in Oracle JDK builds
1369 Robert Mckenna Oracle JDK-8197086 Regression since 8u60: System.getenv doesn't return env var set in JNI code
1369 Robert Mckenna Oracle JDK-8197082 Minor optimizations to ISO10126PADDING
1369 Robert Mckenna Oracle JDK-8197079 Verifying ECDSA signatures permits trailing bytes
1369 Robert Mckenna Oracle JDK-8197284 XSOM parser incorrectly processes type names with whitespaces
1369 Robert Mckenna Oracle JDK-8197283 In java 8, the marshalling with JAX-WS does not escape carriage return
1369 Robert Mckenna Oracle JDK-8197282 SAXParseException when sending soap message
1369 Robert Mckenna Oracle JDK-8197280 Make XSL generated namespace prefixes local to transformation process
1369 Robert Mckenna Oracle JDK-8197278 InitialBootClassLoaderMetaspaceSize and CompressedClassSpaceSize should be checked consistent from MaxMetaspaceSize
1369 Robert Mckenna Oracle JDK-8197277 Enable AssumeMP by default on SPARC machines
1369 Robert Mckenna Oracle JDK-8197276 Interned string and symbol table leak memory during parallel unlinking
1369 Robert Mckenna Oracle JDK-8197275 Crash in HotSpot with jvm.dll+0x42b48 ciObjectFactory::create_new_metadata
1369 Robert Mckenna Oracle JDK-8197274 C2 compilation fails with SIGSEGV
1369 Robert Mckenna Oracle JDK-8197272 OOM ERRORS + SERVICE-THREAD TAKES A PROCESSOR TO 100%
1369 Robert Mckenna Oracle JDK-8197271 Crash in ClassLoaderData/JNIHandleBlock::oops_do during concurrent marking
1369 Robert Mckenna Oracle JDK-8197270 Add a new CPU family (S_family) for SPARC S7 and above processors
1369 Robert Mckenna Oracle JDK-8197269 java in ldoms, with cpu-arch=generic has problems
1369 Robert Mckenna Oracle JDK-8197268 Use new API to get cache line sizes
1369 Robert Mckenna Oracle JDK-8197267 Remove assertions in 8u that were removed by 8056124 in 9.
1369 Robert Mckenna Oracle JDK-8197266 expose L1_data_cache_line_size for diagnostic/sanity checks
1369 Robert Mckenna Oracle JDK-8197265 remove legacy code in SPARC's VM_Version::platform_features
1369 Robert Mckenna Oracle JDK-8197264 HotSpot leaking memory in long-running requests
1369 Robert Mckenna Oracle JDK-8197260 [REDO] MemberNameTable doesn't purge stale entries
1369 Robert Mckenna Oracle JDK-8197259 [linux] Experimental support for cgroup memory limits in container (ie Docker) environments
1369 Robert Mckenna Oracle JDK-8197257 G1 crashes if active_processor_count changes during startup
1369 Robert Mckenna Oracle JDK-8197256 Cache initial active_processor_count
1369 Robert Mckenna Oracle JDK-8197255 Crash in rebuild_cpu_to_node_map
1369 Robert Mckenna Oracle JDK-8197252 Instance field load is replaced by wrong data Phi
1369 Robert Mckenna Oracle JDK-8197250 Runtime.availableProcessors() ignores Linux taskset command
1369 Robert Mckenna Oracle JDK-8197249 JVM crashes sometimes while starting
1370 David Buck Oracle JDK-8152757 C1: G1 barriers don't preserve FP registers
1371 Robert Mckenna Oracle JDK-8196873 com.sun.jndi.ldap.pool.PoolCleaner should clear its context class loader
1371 David Buck Oracle JDK-8196857 (ch) linux io_util_md: Operation not supported exception after 8168628
1371 David Buck Oracle JDK-8196856 (fc) SIGBUS when extending file size to map it
1372 Ramanand Patil IBM JDK-8196658 (tz) Upgrade time-zone data to tzdata2018c
1374 Ivan Gerasimov Google JDK-8196358 Adding 256 units of IsoFields.QUARTER_YEARS broken
1376 David Buck Oracle JDK-8196542 Add option to disable stack overflow checking in primordial thread for use with JNI_CreateJavaJVM
1383 Hannes Wallnoefer Oracle JDK-8196143 Nashorn: "duplicate code" assertion when binding a vararg function that just passes arguments along
1385 Ramanand Patil IBM JDK-8196038 JDK part of JavaFX-Swing dialogs appearing behind main stage
1389 David Buck Oracle JDK-8195773 NMT is not enabled if NMT option is specified after class path specifiers
1392 David Buck Oracle JDK-8195140 [linux] Not all libraries in the VM are linked with -z noexecstack
1397 Robert Mckenna Oracle JDK-8194931 Update copyright headers of files in src tree that are missing Classpath exception
1399 Kevin Walls Oracle JDK-8194772 RedefineClasses() tests fail assert(((Metadata*)obj)->is_valid()) failed: obj is valid
1399 Kevin Walls Oracle JDK-8194771 Clean up code that saves the previous versions of redefined classes
1399 Kevin Walls Oracle JDK-8194770 speculative traps break when classes are redefined
1399 Kevin Walls Oracle JDK-8170994 SIGSEGV in ReceiverTypeData::clean_weak_klass_links

No changesets log

JDK-8215278 JSSE should create a single instance of the cacerts KeyStore
JDK-8215277 SessionId.hashCode generates too many collisions
JDK-8215191 Support TLS v1.2 algorithm in SunPKCS11 provider
JDK-8215190 Unable to enter zero width non-joiner (ZWNJ) symbol in Swing text component
JDK-8215189 Unaligned memory access in Bits.c
JDK-8215187 Window of a newly launched Oracle Forms applet loses focus
JDK-8215186 Running application under 1.8u172 via a DRS rules with the 1.8u192 plugin fail with java.lang.NoSuchMethodError
JDK-8213758 JWS: Application does not launch on when jnlp.delete.jnlp.file is enabled
JDK-8212951 Swing apps are slow if displaying from a remote source to many local displays
JDK-8212950 WARNING: Could not open/create prefs root node Software\JavaSoft\Prefs
JDK-8211912 Instead of circle rendered in appl window, but ellipse is produced JEditor Pane
JDK-8211897 [macosx] Printing attributes break page size set via "java.awt.print.Book" object
JDK-8211896 Further improvements to cipher buffer management
JDK-8211895 Better management of CipherCore buffers
JDK-8211894 Better management of internal KeyStore buffers
JDK-8211683 LDAPS communication failure with jdk 1.8.0_181
JDK-8210662 [8u] Backport of 8034788 breaks GCC version detection
JDK-8210570 Typo in URL for XML section in developer guides
JDK-8210568 Document jdk.tls.legacyAlgorithms security property
JDK-8210567 Deployment.properties file example is incorrect
JDK-8210136 VerifyCACerts.java failed with "At least one cacert test failed"
JDK-8210135 Disable all DES cipher suites
JDK-8209803 Use DWARF debug symbols for Linux 32-bit as default
JDK-8209481 [L10N]Truncation issue happens on the final dialog for pt on Mac
JDK-8209474 [TESTBUG] Create tests for JDK-8146115 container awareness and resource configuration
JDK-8209373 Remove SECOM root (secomevrootca1)
JDK-8209372 Remove several Symantec Root CAs
JDK-8209371 Upgrade JDK to libpng 1.6.35
JDK-8208817 Remove Baltimore Cybertrust Code Signing CA
JDK-8208802 READING attributes are not available on TSF
JDK-8208801 8u131 Win 10, issue with wrong position of Sogou IME popup
JDK-8208800 keytool should remember real storetype if it is not provided
JDK-8208798 jarsigner treats timestamped signed jar invalid after the signer cert expires
JDK-8208797 Use PKIXValidator in jarsigner
JDK-8208795 test/sun/security/tools/jarsigner/concise_jarsigner.sh failing (cert expired?)
JDK-8208794 jarsigner should emit warning if weak algorithms or keysizes are used
JDK-8208793 Two security tools tests do not run with only JRE
JDK-8208792 Feed some text to STDIN in ProcessTools.executeProcess()
JDK-8208503 Drag and drop of text contents and URL links functionalities are broken in Webview
JDK-8208150 Taking screenshots on x11 composite desktop produce wrong result
JDK-8207831 Rendering issues with MathML token elements
JDK-8207661 jre/bin/javaw.exe is missing from server-jre for windows since 8u171
JDK-8207660 JDK installation uninstalls public JRE
JDK-8207652 Long JNLP file is not parsed correctly and ends with javaws path
JDK-8207651 Java Web Start application with file extension association is removed from cache when invoked for the second time from browser
JDK-8207650 Java incorrectly requires "HttpOnly" cookie attribute to be case sensitive
JDK-8207649 Security check failure for main jar downlaod with jnlp.versionEnabled and Deployment Rule Set feature
JDK-8207647 JRE bundled in App-V package will not start Java Web Start applications
JDK-8207271 Upgrade GStreamer to 1.14
JDK-8206390 WebEngine document becomes null after PAGE_REPLACED event
JDK-8206090 Update to 606.1 version of WebKit
JDK-8205343 bug in backport of JDK-8185002
JDK-8204687 Missing Classpath exception in PrismLoaderGlue.stg file
JDK-8204508 Robot ScreenCapture fails on HiDPI system
JDK-8204224 JavaFX WebView crashes when visiting certain web sites
JDK-8203898 openjdk aarch64: jdk/test/com/sun/net/httpserver/Test6a.java fails with --enable-unlimited-crypto
JDK-8203880 [Linux] Link libgcc and libstdc++ statically to support gcc-7.x
JDK-8203841 cacerts/VerifyCACerts.java fails with java.lang.Exception: At least one cacert test failed
JDK-8203777 Allow cacerts test to pass when GTECyberTrust root expires
JDK-8203429 Update OpenJFX license files to match OpenJDK
JDK-8202977 upgradeJDK.sh script should validate provided source jdk repository
JDK-8202636 Update libxslt to version 1.1.32
JDK-8202593 webPage.executeCommand("removeFormat", null) removes the style of the body element
JDK-8202197 FreeNullICM test should be removed
JDK-8202109 Table auto resize ignores column resize policy
JDK-8201790 Update SQLite to version 3.23.0
JDK-8201755 Supported Encodings page for Java SE 8 is out of date
JDK-8201754 Links to jaxp.java.net in Java SE docs will be broken when java.net is shut down
JDK-8201753 Typo in one of the content link of "Location-Independent Access to Resources" doc
JDK-8201732 meta-index in 1.8.0_152 does not include jfxrt.jar entries
JDK-8201725 Java RPMs should allow for side-by-side installation of JDK and JRE, 32 and 64 bit, and only one update for each major version
JDK-8201724 Simplify build system building rpms
JDK-8201715 When in is present "progress-class" attribute javaws cannot start
JDK-8201713 Desktop shortcut of Web Start application is broken after JRE update
JDK-8201651 Better error handling during JNLP2Manager initialisation
JDK-8201619 [TESTBUG] Bad HG merge causes some web tests to be skipped by mistake
JDK-8201535 ShowDocument fails with URL using jnlp or jnlps protocol
JDK-8201523 RadioMenuItem fires extra NULL value in property
JDK-8199504 [macOS] Corrupt Thai characters displayed in word wrapped label
JDK-8199304 javaws.exe failed to launch UTF-8 encoded JNLP file
JDK-8198594 Intermittent crash when using WebView from JFXPanel application
JDK-8198320 MediaPlayer crashes when playing m3u8 files on macOS High Sierra 10.13.2
JDK-8197950 Update libxml2 to version 2.9.7
JDK-8197247 Update copyright date to 2018 for developer guides
JDK-8197242 Sun Provider's PKCS12 KeyStore should document that KeyBag type is not supported
JDK-8197237 typo "Collectdions" in page title of collections framework documentation
JDK-8197236 CosNaming's implementation doesn't comply with the specification
JDK-8197106 Ucrypto Library leaks native memory
JDK-8197077 undo 8189805: 64 and 32 bit RPMS must co-exist
JDK-8197073 64 and 32 bit RPMS must co-exist
JDK-8197064 Mach 5 builds failed on Windows/install repo after JDK-8173207
JDK-8197063 Integrate new version of Java VisualVM based on VisualVM 1.3.9 into JDK
JDK-8197055 Java installer leaves cached files on host after update
JDK-8197044 FlightRecorderOptions settings for defaultrecording ignored.
JDK-8197041 JNLP files won't launch from IE11 on Windows 10 Creators Update
JDK-8197033 64 bit java install not setting jnlp associate if lower 32bit versions exist
JDK-8197027 webstart app fails with CouldNotLoadArgumentException when account in Japanese
JDK-8197024 [CPU17_04] Need to update securitypack.jar with baseline.versions file having jdk9 entry
JDK-8197019 JRE 6u121 causes applet to fail with: Reset deny session certificate store
JDK-8197005 WebStart does not clean up jnlp file after closing
JDK-8196958 Cherry pick GTK WebKit 2.18.6 changes
JDK-8196482 Add a regression test case for JDK-8183100
JDK-8196406 windows x86 webview-icu isAlphaNumericString crash
JDK-8196075 DRS - cert based run rule not working when running offline
JDK-8195822 Cherry pick GTK WebKit 2.18.5 changes
JDK-8194996 [OS X] Remove redundant files
JDK-8193711 Launching JWS applet the default download progress dialog only shows if the java console is enabled
JDK-8191194 Java Fx-Swing dialogs appearing behind main stage
JDK-8179532 buffer size calculation issue in NativeGCMCipher
JDK-8162786 Release Note: Support for Customization of Default Enabled Cipher Suites via System Properties

Committer push log

Aleksej Efimov, Oracle

Bug Summary
JDK-8067239 [TESTBUG] javax/xml/bind/marshal/8036981/Test.java failed
JDK-8196491 Newlines in JAXB string values of SOAP-requests are escaped to " "

Alexey Ivanov, Oracle

Bug Summary
JDK-8179675 Build with error on windows with new Cygwin grep
JDK-8204171 Fix broken CL version detection in configure for some Visual Studio configurations
JDK-8201557 Fix potential crash in BufImg_SetupICM
JDK-8201802 Improve releasing native resources of BufImgSurfaceData.ICMColorData
JDK-8203790 MSVCP dependency introduced in awt.dll

Anton Litvinov, Oracle

Bug Summary
JDK-8199610 Touch keyboard does not hide, when a text component looses focus
JDK-8202206 Touch keyboard is not shown, if text component gets focus from other text component
JDK-8198996 Touch keyboard is shown for a non-focusable text component
JDK-8207685 When determining the ciphersuite lists there is no debug output for disabled suites.

Andrew Hughes, Red Hat

Bug Summary
JDK-8206481 ArrayIndexOutOfBoundsException at sun.java2d.pisces.Dasher.goTo(Dasher.java:151)
JDK-8196952 Bad primeCertainty value setting in DSAParameterGenerator
JDK-8205425 compile.cpp verify_graph_edges uses "bool" as "int"
JDK-8206111 GTK+ L&F JTextComponent not respecting desktop caret blink rate
JDK-8198813 linux-zero does not build without precompiled header
JDK-8198454 Zero port of 8174962: Better interface invocations
JDK-8205930 Zero's atomic_copy64() should use SPE instructions on linux-powerpcspe
JDK-8205931 Zero: S390 31bit atomic_copy64 inline assembler is wrong
JDK-8205929 Zero: segfaults on Power PC 32-bit

Andrew Haley, Red Hat

Bug Summary
JDK-8206406 StubCodeDesc constructor publishes partially-constructed objects on StubCodeDesc::_list

Abhijit Saha, Independent

Bug Summary
JDK-8201674 [TEST_BUG] CompressedClassSpaceSizeInJmapHeap.java fails if SA not available
JDK-8201690 [Windows] java.awt.IllegalComponentStateException: component must be showing on the screen to determine its location
JDK-8201677 Change of behavior in the getMessage () method of the SOAPMessageContextImpl class
JDK-8201694 Class name repeated in output of Type.toString()
JDK-8201680 Improve javax.crypto.BadPaddingException messages
JDK-8201699 increase java.util.logging.FileHandler MAX_LOCKS limit
JDK-8201686 JDK 8u131 socketRead0 hang at SSL read
JDK-8201688 JDWP exit error JVMTI_ERROR_WRONG_PHASE(112)
JDK-8201685 Relax RMI Registry Serial Filter to allow arrays of any type
JDK-8201672 Time related C1 intrinsics produce inconsistent results when floating around

Christoph Langer, SAP

Bug Summary
JDK-8202369 Inet4AddressImpl_getLocalHostName reverse lookup on Solaris only
JDK-8197943 Unable to use JDWP API in JDK 8 to debug JDK 9 VM

Sean Coffey, Oracle

Bug Summary
JDK-8202645 [Zero] Reduce limits of max heap size for boot JDK on s390
JDK-8201541 Debug exception stacks should be clearer
JDK-8199134 Impact of noncloneable MessageDigest implementation
JDK-8164019 Introduce system property to control enabled ciphersuites
JDK-8199418 Kerberos krb5 authentication: AuthList's put method leads to performance issue
JDK-8196854 TestFlushableGZIPOutputStream failing with IndexOutOfBoundsException

David Buck, Oracle

Bug Summary
JDK-8196857 (ch) linux io_util_md: Operation not supported exception after 8168628
JDK-8196856 (fc) SIGBUS when extending file size to map it
JDK-8195140 [linux] Not all libraries in the VM are linked with -z noexecstack
JDK-8196542 Add option to disable stack overflow checking in primordial thread for use with JNI_CreateJavaJVM
JDK-8202153 adlc fails to compile with SS12u4
JDK-8203845 backport of JDK-8034788 inadvertently rolled back JDK-8187045 changes to toolchain.m4
JDK-8202470 Build failure with SS12u4
JDK-8152757 C1: G1 barriers don't preserve FP registers
JDK-8198556 ConstantPool::_resolved_references is missing in heap dump
JDK-8200414 Crash with assert(handler_address == SharedRuntime::compute_compiled_exc_handler(..) failed: Must be the same
JDK-8202376 Fix for Solaris Studio C++ 5.13, CHECK_UNHANDLED_OOPS breaks PPC build
JDK-8206405 G1 doesn't honor request to disable class unloading
JDK-8200154 Hotspot crash on Cassandra 3.11.1 startup with libnuma 2.0.3
JDK-8204053 libsaproc.so not linked with -z,noexecstack
JDK-8195773 NMT is not enabled if NMT option is specified after class path specifiers
JDK-8202375 Solaris Studio 12.4 C++ 5.13, CHECK_UNHANDLED_OOPS use of class oop's copy constructor definitions causing error level diagnostic

Dmitry Markov, Oracle

Bug Summary
JDK-8198851 On Windows Swing changes keyboard layout on a window activation
JDK-8205529 Shift or Capslock not working in Textfield after accented keystrokes

Erik Joelsson, Oracle

Bug Summary
JDK-8207852 Add --with-debug-symbols=[none|internal|external|zipped]
JDK-8207853 Need to regenerate configure in jdk8u-dev

Hannes Wallnoefer, Oracle

Bug Summary
JDK-8196143 Nashorn: "duplicate code" assertion when binding a vararg function that just passes arguments along

Ivan Gerasimov, Google

Bug Summary
JDK-8200479 [TEST_BUG] java/security/Signature/SignatureLength.java fails
JDK-8196358 Adding 256 units of IsoFields.QUARTER_YEARS broken
JDK-8199492 Compilation errors in jdk.crypto.mscapi with VS 2017
JDK-8198298 EndEntityChecker should not process custom extensions after PKIX validation
JDK-8204702 javax/xml/crypto/dsig/SecurityManager/XMLDSigWithSecMgr.java test failed with AccessControlException
JDK-8193171 keytool -list displays "JKS" for a PKCS12 keystore.
JDK-8199491 Native implementation of sunmscapi should use operator new (nothrow) for allocations
JDK-8204129 ObjectInputStream filterCheck method throws NullPointerException
JDK-8204343 Release session if initialization of SunPKCS11 Signature fails
JDK-8197952 sun/security/mscapi/SignedObjectChain.java fails on Windows
JDK-8197386 sun/security/pkcs11/ec/ReadCertificates.java fails intermittently
JDK-8204185 sun/security/ssl/CertPathRestrictions/TLSRestrictions.java failed with unexpected Exception intermittently
JDK-8197457 SupportedDSAParamGen.java failed with timeout

Jonathan Gibbons, Oracle

Bug Summary
JDK-8206010 Javadoc crashes when method name ends with "Property"

Kevin Walls, Oracle

Bug Summary
JDK-8203349 8u hotspot should recognise later Windows compilers
JDK-8205677 [8u] casts and type change for 8u to enable later Windows compilers
JDK-8205440 [8u] DWORD64 required for later Windows compilers
JDK-8206454 [8u] os::current_stack_pointer() fails to compile on later Windows compilers (warning C4172: returning address of local variable)
JDK-8204872 [8u] VS2017: more instances of "error C3680: cannot concatenate user-defined string literals with mismatched literal suffix identifiers"
JDK-8201481 Add "reconfigure" target for re-creating a configuration
JDK-8204649 Add build support for VS 2015/2017
JDK-8202020 Build the freetype library during configure on Windows
JDK-8194771 Clean up code that saves the previous versions of redefined classes
JDK-8201253 Clean up Visual Studio detection logic
JDK-8201586 Cleanup and fix sysroot and devkit handling on Linux and Solaris
JDK-8201501 Configure fails in cygwin if current dir is in /home/user
JDK-8199935 Configure should handle overrides of tools better
JDK-8199805 disable ccache by default
JDK-8203493 Enable use of devkits for Windows.
JDK-8205354 Fix os_windows siglabel
JDK-8205086 Hotspot compile warning: "Invalid suffix on literal; C++11 requires a space between literal and identifier"
JDK-8199693 hs_err improvement: Add time zone information in the hs_err file
JDK-8199694 hs_err improvement: Print exact compressed oops mode and the heap base value.
JDK-8168695 hs_err improvement: Print if we have seen any OutOfMemoryErrors or StackOverflowErrors
JDK-8201499 Improvements in autoconf integration
JDK-8205196 Inconsistent types for ideal_reg
JDK-8201798 Incremental HotSpot builds broken on Windows
JDK-8201662 libjsig compilation is missing EXTRA_CFLAGS on macosx
JDK-8201191 Must keep microsoft VS_PATH on PATH after toolchain detection
JDK-8201277 New cygwin grep does not match \r as newline
JDK-8205430 Only display resolved symlink for compiler, do not change path
JDK-8194772 RedefineClasses() tests fail assert(((Metadata*)obj)->is_valid()) failed: obj is valid
JDK-8201190 Rewrite toolchain.m4 to support multiple toolchains per platform
JDK-8205635 runtime/NMT/MallocSiteHashOverflow.java failing in nightlies
JDK-8170994 SIGSEGV in ReceiverTypeData::clean_weak_klass_links
JDK-8203351 Source changes needed to build JDK 9 with Visual Studio 2013 (VS2013)
JDK-8194770 speculative traps break when classes are redefined
JDK-8205431 TOOLCHAIN_FIND_COMPILER unexpectedly resolves symbolic links
JDK-8182730 Use SW prefetch instructions instead of BIS for allocation prefetches on SPARC Core C4
JDK-8205073 VS2017 (C2065) 'timezone': Undeclared Identifier in share/runtime/os.cpp
JDK-8205127 VS2017 (C4334) Result of 32-bit Shift Implicitly Converted to 64 bits
JDK-8205522 VS2017 (C4838, C4312) Various conversion issues with gtest tests
JDK-8204567 VS2017 Addition of Global Delete Operator with Size Parameter Conflicts with Arena's Chunk Provided One
JDK-8204968 VS2017 Multiple Type Cast Conversion Compilation Errors
JDK-8201500 Warn instead of fail when calling the configure wrapper directly
JDK-8202019 Windows/MSYS builds broken
JDK-8204926 Wrong cast in metadata_at_put

Mario Torre, Red Hat

Bug Summary
JDK-8204962 AWT java apps fail to start when some minimal fonts are present

Poonam Bajaj Parhar, Oracle

Bug Summary
JDK-8205629 Improve docker container detection and resource configuration usage
JDK-8200548 Performance drop with Java JDK 1.8.0_162-b32

Robert Mckenna, Oracle

Bug Summary
JDK-8197146 (tz) Support tzdata2016i
JDK-8197161 (tz) Support tzdata2016j
JDK-8197162 (tz) Support tzdata2017a
JDK-8197197 (tz) Support tzdata2017b
JDK-8197231 (tz) Support tzdata2017c
JDK-8197259 [linux] Experimental support for cgroup memory limits in container (ie Docker) environments
JDK-8197370 [macos] Font2DTest demo started failing for Arabic range from JDK 8 u162 b01 on Mac
JDK-8197342 [macos] javafx.print.PrinterJob.showPrintDialog() hangs on macOS
JDK-8197301 [macosx] Activating a JDialog puts to back another dialog
JDK-8197315 [macosx] Chinese text shows as Latin w/ openVanilla input method
JDK-8197147 [macosx] Cursor management unification
JDK-8197336 [macosx] Custom Swing text components need to allow standard accessibility
JDK-8197337 [macosx] JList, VO can't access non-visible list items
JDK-8197331 [macosx] PrinterJob's native Print Dialog does not reflect specified Copies or Page Ranges
JDK-8197332 [macosx] PrintRequestAttributeSet breaks page size set using PageFormat
JDK-8197260 [REDO] MemberNameTable doesn't purge stale entries
JDK-8197223 [TEST_BUG] Cipher tests fail when running with unlimited policy
JDK-8197374 [TEST_BUG] sun/security/pkcs11/KeyPairGenerator/TestDH2048.java fails on Solaris x64 5.10
JDK-8197310 [TEST_BUG] test sun/net/www/http/HttpClient/B8025710.java failing with cert error in 8u121 b01
JDK-8197360 [testlibrary] rmi TestSocketFactory does not flush
JDK-8197361 [testlibrary] TestSocketFactory should allow triggers before match/replace
JDK-8197270 Add a new CPU family (S_family) for SPARC S7 and above processors
JDK-8206914 add jdk8u-dev test failures to ProblemList.txt
JDK-8197185 Additional tests for JEP 288: Disable SHA-1 Certificates
JDK-8197335 Android Studio 2.x crashes with NPE at sun.lwawt.macosx.CAccessibility.getAccessibleIndexInParent
JDK-8197114 Apply algorithm constraints to timestamped code
JDK-8197352 Backport jdk/test/lib/testlibrary/CompilerUtils.java to jdk8u which is helpful in test development
JDK-8197274 C2 compilation fails with SIGSEGV
JDK-8197256 Cache initial active_processor_count
JDK-8197292 Certificates not being blocked by jdk.tls.disabledAlgorithms property
JDK-8197191 Check the AlgorithmParameters in algorithm constraints
JDK-8197286 Chrome interop regression with JDK-8148516
JDK-8197294 closed/java/awt/MenuBar/MenuBarStress1/MenuBarStress1.java hangs on win 64 bit with jdk8
JDK-8196873 com.sun.jndi.ldap.pool.PoolCleaner should clear its context class loader
JDK-8197377 com/sun/crypto/provider/KeyAgreement/SupportedDHParamGens.java failed with timeout
JDK-8197271 Crash in ClassLoaderData/JNIHandleBlock::oops_do during concurrent marking
JDK-8197275 Crash in HotSpot with jvm.dll+0x42b48 ciObjectFactory::create_new_metadata
JDK-8197255 Crash in rebuild_cpu_to_node_map
JDK-8197381 Create an alternative fix for JDK-8167102, whose fix was backed out
JDK-8197300 Deadlock in com.sun.jndi.ldap.pool.Connections
JDK-8197305 Deleting a file from either the open or save java.awt.FileDialog hangs.
JDK-8197353 DNS provider cleanups
JDK-8197306 Double icons with JMenuItem setHorizontalTextPosition on Win 10
JDK-8197277 Enable AssumeMP by default on SPARC machines
JDK-8197094 Enable unlimited cryptographic policy by default in Oracle JDK builds
JDK-8197266 expose L1_data_cache_line_size for diagnostic/sanity checks
JDK-8197339 Failed to load RSA private key from pkcs12
JDK-8197369 Fix compatibility issue in AlgorithmChecker for 3rd party JCE providers
JDK-8197307 FtpURLConnection connection leak on FileNotFoundException
JDK-8197257 G1 crashes if active_processor_count changes during startup
JDK-8197264 HotSpot leaking memory in long-running requests
JDK-8197338 IllegalArgumentException: adding a component to a container on a different GraphicsDevice
JDK-8197313 IllegalArgumentException: jdk.tls.namedGroups
JDK-8197296 IME Composition Window is displayed at incorrect location
JDK-8197164 Improved algorithm constraints checking
JDK-8197283 In java 8, the marshalling with JAX-WS does not escape carriage return
JDK-8197382 Increase the number of clones in the CloneableDigest
JDK-8197278 InitialBootClassLoaderMetaspaceSize and CompressedClassSpaceSize should be checked consistent from MaxMetaspaceSize
JDK-8197252 Instance field load is replaced by wrong data Phi
JDK-8197276 Interned string and symbol table leak memory during parallel unlinking
JDK-8197204 Jar file verification failing with SecurityException: digest missing xxx
JDK-8197269 java in ldoms, with cpu-arch=generic has problems
JDK-8197249 JVM crashes sometimes while starting
JDK-8197379 keytool fails to format resource strings for keys for some languages after JDK-8171319
JDK-8197350 keytool should not warn if signature algorithm used in cacerts is weak
JDK-8197349 keytool should print out warnings when reading or generating cert/cert req using weak algorithms
JDK-8197348 Keytool, print key algorithm of certificate or key entry
JDK-8197318 lookupDefaultPrintService returns null on Solaris 11 when default printer is set using lpoptions command
JDK-8197280 Make XSL generated namespace prefixes local to transformation process
JDK-8197312 Menu is activated after using mnemonic Alt/Key combination
JDK-8197082 Minor optimizations to ISO10126PADDING
JDK-8197199 Missing @bug for tests added with JDK-8165367
JDK-8197383 missing LNT entry for finally block
JDK-8197340 MoveToOtherScreenTest fails due wrong key attribute
JDK-8197187 Negotiated Finite Field Diffie-Hellman Ephemeral Parameters for TLS
JDK-8197356 New defaults for DSA keys in jarsigner and keytool
JDK-8197333 NPE in AccessBridge while editing JList model
JDK-8197272 OOM ERRORS + SERVICE-THREAD TAKES A PROCESSOR TO 100%
JDK-8197317 Performance problems in dialogs with large tables when JAB activated
JDK-8197291 ReflectionFactory support for IIOP and custom serialization
JDK-8197086 Regression since 8u60: System.getenv doesn't return env var set in JNI code
JDK-8197267 Remove assertions in 8u that were removed by 8056124 in 9.
JDK-8202996 Remove debug print statements from RMI fix
JDK-8197265 remove legacy code in SPARC's VM_Version::platform_features
JDK-8197295 Resizing dialog which is JWindow parent makes JVM crash
JDK-8197227 Restrict the use of EXPORT cipher suites
JDK-8197330 Run sun/security/pkcs11 tests on Mac
JDK-8197250 Runtime.availableProcessors() ignores Linux taskset command
JDK-8197282 SAXParseException when sending soap message
JDK-8197341 SocketInputStream.socketRead0 can hang even with soTimeout set
JDK-8197371 src/jdk.management/share/native/libmanagement_ext/GcInfoBuilder.c doesn't handle JNI exceptions properly
JDK-8197311 sun/net/www/http/HttpClient/B8025710.java should run in ovm mode
JDK-8197368 sun/security/provider/NSASuiteB/TestDSAGenParameterSpec.java timeouts intermittently
JDK-8197097 Support DHE sizes up to 8192-bits and DSA sizes up to 3072-bits
JDK-8197378 test tck.java.time.zone.TCKZoneRules is broken by tzdata2017c
JDK-8197329 Test the jdk.tls.namedGroups System Property
JDK-8197372 Text in native popup is not always updated with Sogou IME
JDK-8197316 Text is displayed in bold when fonts are installed into symlinked folder
JDK-8197297 The new menu can't be shown on the menubar after clicking the "Add" button.
JDK-8189789 tomcat gzip-compressed response bodies appear to be broken in update 151
JDK-8197104 Transport Layer Security (TLS) Session Hash and Extended Master Secret Extension
JDK-8194931 Update copyright headers of files in src tree that are missing Classpath exception
JDK-8197268 Use new API to get cache line sizes
JDK-8197326 Use short name of SupportedEllipticCurvesExtension.java
JDK-8197079 Verifying ECDSA signatures permits trailing bytes
JDK-8197304 With JDK 1.7 text field does not obtain focus when using mnemonic Alt/Key combin
JDK-8197284 XSOM parser incorrectly processes type names with whitespaces

Roland Westrelin, Red Hat

Bug Summary
JDK-8199864 IfNode::range_check_trap_proj() should handle dying subgraph with single if proj

Ramanand Patil, IBM

Bug Summary
JDK-8196658 (tz) Upgrade time-zone data to tzdata2018c
JDK-8201423 (tz) Upgrade time-zone data to tzdata2018d
JDK-8203934 (tz) Upgrade time-zone data to tzdata2018e
JDK-8198880 [TEST_BUG] PreserveFPRegistersTest.java runs out of memory in the nightlies
JDK-8200578 AWT hang occurrs when sequenced events arrive out of sequence
JDK-8202648 Backout JDK-8152974
JDK-8202251 Fastdebug VM crashes with "ExceptionMark destructor expects no pending exceptions" error
JDK-8207232 Handshake messages can be strictly ordered
JDK-8205674 HashMap: Entry.setValue may not work after Iterator.remove() called for previous entries
JDK-8200577 Images are not scaled correctly in JEditorPane
JDK-8194642 Improve OOM error reporting for JDK8
JDK-8203910 Incorrect usage of Iterator in Java 8 In com.sun.jndi.ldap.EventSupport.removeNamingListener
JDK-8196038 JDK part of JavaFX-Swing dialogs appearing behind main stage
JDK-8197919 NullPointerExcpn-java.awt.image.FilteredImageSource.startProduction JDK-8079607
JDK-8206907 Remove exclusion range for phonetic chars in windows fontconfig.properties
JDK-8200226 scroll position in ScrollPane is reset after calling validate()
JDK-8134124 sun/security/tools/jarsigner/warnings.sh fails when using Hindi locale

Severin Gehwolf, Red Hat

Bug Summary
JDK-8207402 Stray *.debuginfo files when not stripping debug info

Aleksey Shipilev, Red Hat

Bug Summary
JDK-8206425 .gnu_debuglink sections added unconditionally when no debuginfo is stripped
JDK-8202600 [Zero] Undefined behaviour in src/os_cpu/linux_zero/vm/os_linux_zero.cpp
JDK-8205104 EXTRA_LDFLAGS not consistently being used
JDK-8201583 JVMTI tagged object access needs G1 pre-barrier
JDK-8202643 libfontmanager must be built with LDFLAGS allowing unresolved symbols
JDK-8202916 Missing G1 barrier in Unsafe_GetObjectVolatile
JDK-8201581 Montgomery multiply intrinsic should use correct name

Vladimir Ivanov, Oracle

Bug Summary
JDK-8203388 Crash in C2 escape analysis with assert: "node should be registered"