PUSHES REPORT: 8u202

This report shows who pushed the backports to the given release. This usually shows who did the backporting, testing, and review work.

Report generated: Mon Nov 08 19:47:54 CET 2021

Distribution by priority

Count Priority
1 P1
26 P2
58 P3
39 P4

Distribution by components

Count Component
124 100% Total
38 30.6% hotspot
12 9.7% hotspot/compiler
11 8.9% hotspot/runtime
6 4.8% hotspot/gc
3 2.4% hotspot/jvmti
3 2.4% hotspot
2 1.6% hotspot/svc-agent
1 0.8% hotspot/svc
29 23.4% security-libs
11 8.9% security-libs/java.security
5 4.0% security-libs/javax.net.ssl
4 3.2% security-libs/javax.crypto
3 2.4% security-libs/javax.crypto:pkcs11
2 1.6% security-libs/javax.xml.crypto
2 1.6% security-libs/org.ietf.jgss
1 0.8% security-libs/jdk.security
1 0.8% security-libs/org.ietf.jgss:krb5
25 20.2% client-libs
13 10.5% client-libs/java.awt
6 4.8% client-libs/javax.swing
2 1.6% client-libs/2d
2 1.6% client-libs/javax.sound
1 0.8% client-libs
1 0.8% client-libs/javax.imageio
17 13.7% core-libs
6 4.8% core-libs/java.nio
3 2.4% core-libs/java.time
3 2.4% core-libs/javax.naming
2 1.6% core-libs/java.io
1 0.8% core-libs/java.net
1 0.8% core-libs/java.util
1 0.8% core-libs/java.util:i18n
10 8.1% infrastructure
10 8.1% infrastructure/build
2 1.6% tools
1 0.8% tools/javac
1 0.8% tools/launcher
1 0.8% core-svc
1 0.8% core-svc/debugger
1 0.8% other-libs
1 0.8% other-libs/other
1 0.8% xml
1 0.8% xml/jax-ws

Distribution by affiliation

Count Committer
124 100% Total
92 74.2% Oracle
45 36.3% Aleksej Efimov
15 12.1% David Buck
7 5.6% Sean Coffey
7 5.6% Robert Mckenna
5 4.0% Kevin Walls
5 4.0% Dmitry Markov
4 3.2% Prasadarao Koppula
1 0.8% Philip Race
1 0.8% Thomas Schatzl
1 0.8% Poonam Bajaj Parhar
1 0.8% Anton Litvinov
13 10.5% Red Hat
6 4.8% Severin Gehwolf
2 1.6% Andrew Hughes
2 1.6% Roland Westrelin
1 0.8% Andrew Haley
1 0.8% Zhengyu Gu
1 0.8% Mario Torre
9 7.3% Amazon
6 4.8% Paul Hohensee
3 2.4% Sergey Bylokhov
6 4.8% Google
6 4.8% Ivan Gerasimov
3 2.4% IBM
3 2.4% Ramanand Patil
1 0.8% SAP
1 0.8% Christoph Langer

Chronological push log:

Days Ago Committer Affiliation Bug Summary
1028 Aleksej Efimov Oracle JDK-8214370 (tz) Upgrade time-zone data to tzdata2018g
1028 Aleksej Efimov Oracle JDK-8214369 Era.getDisplayName doesn't work with non-IsoChronology
1028 Aleksej Efimov Oracle JDK-8213805 Disable anon and NULL cipher suites
1028 Aleksej Efimov Oracle JDK-8213684 sun/security/tools/jarsigner/warnings/NoTimestampTest.java fails after JDK-8027781
1028 Aleksej Efimov Oracle JDK-8213683 New jarsigner timestamp warning is grammatically incorrect
1028 Aleksej Efimov Oracle JDK-8213682 jarsigner should print when a timestamp will expire
1028 Aleksej Efimov Oracle JDK-8213677 Remove exclusion range for phonetic chars in windows fontconfig.properties
1028 Aleksej Efimov Oracle JDK-8213676 Images are not scaled correctly in JEditorPane
1028 Aleksej Efimov Oracle JDK-8214880 Unaligned memory access in Bits.c
1105 Sean Coffey Oracle JDK-8213152 CipherCore performance improvement
1105 Kevin Walls Oracle JDK-8213143 OpenJDK fails to start in Windows 7 and 8.1 after upgrading compiler to VC 2017
1110 Kevin Walls Oracle JDK-8211933 [8u] hotspot adlc needs to link statically with libstdc++ for gcc7.3
1111 Paul Hohensee Amazon JDK-8212821 CHECK_ must be used in the rhs of an assignment statement within a block (round 2)
1111 Roland Westrelin Red Hat JDK-8212908 assert failure in coalesce.cpp: attempted to spill a non-spillable item
1111 Roland Westrelin Red Hat JDK-8212907 Anti-dependency on membar causes crash in register allocator due to invalid instruction scheduling
1112 Ivan Gerasimov Google JDK-8212869 sun/security/pkcs11/KeyStore/SecretKeysBasic.sh failed due to libnss3 version cannot be parsed
1112 Ivan Gerasimov Google JDK-8212868 Outputs more details for PKCS11 tests if the NSS lib version cannot be determined
1113 Paul Hohensee Amazon JDK-8212768 TestKeyPairGenerator.java fails on Solaris because private exponent needs to comply with FIPS 186-4
1113 David Buck Oracle JDK-8181822 C2: Mixed unsafe oop accesses break alias analysis
1113 David Buck Oracle JDK-8212747 JDWP Transport Listener: dt_socket thread crash
1115 Ivan Gerasimov Google JDK-8212709 Backout backport of JDK-8211394 from jdk 8u-dev
1116 Robert Mckenna Oracle JDK-8212699 Cannot connect to IPv6 host when exists any active network interface without IPv6 address
1116 Paul Hohensee Amazon JDK-8212696 CHECK_ must be used in the rhs of an assignment statement within a block
1118 Philip Race Oracle JDK-8207322 [Client-Libs] Backport GTK3 support on Linux to 8u
1119 Aleksej Efimov Oracle JDK-8212525 Disable all DES cipher suites
1119 Aleksej Efimov Oracle JDK-8212524 Upgrade JDK to libpng 1.6.35
1119 Aleksej Efimov Oracle JDK-8212520 Backout JDK-8152974
1119 Aleksej Efimov Oracle JDK-8212519 AWT hang occurrs when sequenced events arrive out of sequence
1119 Aleksej Efimov Oracle JDK-8212518 Kerberos krb5 authentication: AuthList's put method leads to performance issue
1119 Aleksej Efimov Oracle JDK-8212517 On Windows Swing changes keyboard layout on a window activation
1119 Aleksej Efimov Oracle JDK-8212516 JDK part of JavaFX-Swing dialogs appearing behind main stage
1119 Aleksej Efimov Oracle JDK-8212515 EndEntityChecker should not process custom extensions after PKIX validation
1119 Aleksej Efimov Oracle JDK-8212514 READING attributes are not available on TSF
1119 Aleksej Efimov Oracle JDK-8212513 8u131 Win 10, issue with wrong position of Sogou IME popup
1119 Aleksej Efimov Oracle JDK-8212512 (ch) linux io_util_md: Operation not supported exception after 8168628
1119 Aleksej Efimov Oracle JDK-8212511 (fc) SIGBUS when extending file size to map it
1119 Aleksej Efimov Oracle JDK-8212510 Impact of noncloneable MessageDigest implementation
1119 Aleksej Efimov Oracle JDK-8212509 When determining the ciphersuite lists there is no debug output for disabled suites.
1119 Aleksej Efimov Oracle JDK-8212506 NMT is not enabled if NMT option is specified after class path specifiers
1119 Aleksej Efimov Oracle JDK-8212505 keytool should remember real storetype if it is not provided
1119 Aleksej Efimov Oracle JDK-8212502 Use PKIXValidator in jarsigner
1119 Aleksej Efimov Oracle JDK-8212500 test/sun/security/tools/jarsigner/concise_jarsigner.sh failing (cert expired?)
1119 Aleksej Efimov Oracle JDK-8212499 jarsigner should emit warning if weak algorithms or keysizes are used
1119 Aleksej Efimov Oracle JDK-8212498 Two security tools tests do not run with only JRE
1119 Aleksej Efimov Oracle JDK-8212497 Feed some text to STDIN in ProcessTools.executeProcess()
1119 Aleksej Efimov Oracle JDK-8212460 Handshake messages can be strictly ordered
1119 Aleksej Efimov Oracle JDK-8212442 (tz) Upgrade time-zone data to tzdata2018d
1119 Aleksej Efimov Oracle JDK-8212426 jarsigner treats timestamped signed jar invalid after the signer cert expires
1119 Aleksej Efimov Oracle JDK-8212495 Newlines in JAXB string values of SOAP-requests are escaped to " "
1119 Aleksej Efimov Oracle JDK-8212494 Improve docker container detection and resource configuration usage
1119 Aleksej Efimov Oracle JDK-8212493 Crash with assert(handler_address == SharedRuntime::compute_compiled_exc_handler(..) failed: Must be the same
1119 Aleksej Efimov Oracle JDK-8212492 Hotspot crash on Cassandra 3.11.1 startup with libnuma 2.0.3
1119 Aleksej Efimov Oracle JDK-8212491 Performance drop with Java JDK 1.8.0_162-b32
1119 Aleksej Efimov Oracle JDK-8212490 JVM crash during gc doing concurrent marking
1119 Aleksej Efimov Oracle JDK-8212489 [TEST_BUG] CompressedClassSpaceSizeInJmapHeap.java fails if SA not available
1119 Aleksej Efimov Oracle JDK-8212487 RedefineClasses() tests fail assert(((Metadata*)obj)->is_valid()) failed: obj is valid
1119 Aleksej Efimov Oracle JDK-8212486 SIGSEGV in ReceiverTypeData::clean_weak_klass_links
1119 Aleksej Efimov Oracle JDK-8212485 Clean up code that saves the previous versions of redefined classes
1119 Aleksej Efimov Oracle JDK-8212484 speculative traps break when classes are redefined
1119 Aleksej Efimov Oracle JDK-8212414 [linux] Not all libraries in the VM are linked with -z noexecstack
1119 Paul Hohensee Amazon JDK-8212241 Use THREAD instead of CHECK_NULL in return statements
1120 Christoph Langer SAP JDK-8212180 [macosx] Cycling through windows (JFrames) does not work with keyboard shortcut
1120 David Buck Oracle JDK-8212166 improve Test6857159.java
1120 David Buck Oracle JDK-8211928 Test6857159.java times out
1121 Andrew Hughes Red Hat JDK-8212163 ppc: enhancement of CRC32 intrinsic
1121 Andrew Hughes Red Hat JDK-8212162 ppc: implement CRC32 intrinsic
1125 Severin Gehwolf Red Hat JDK-8212010 SA: jhsdb jstack --mixed throws UnmappedAddressException on i686
1125 Severin Gehwolf Red Hat JDK-8212009 [Zero] atomic_copy64: Use ldrexd for atomic reads on ARMv7
1129 Robert Mckenna Oracle JDK-8211790 Create test to cover JDK-8205330 InitialDirContext ctor sometimes throws NPE if the server has sent a disconnection
1129 Robert Mckenna Oracle JDK-8211789 InitialDirContext ctor sometimes throws NPE if the server has sent a disconnection
1129 Robert Mckenna Oracle JDK-8211788 (fc) FileChannel.map and RandomAccessFile.setLength should not preallocate space
1130 Severin Gehwolf Red Hat JDK-8073327 src.zip should include all sources
1130 Severin Gehwolf Red Hat JDK-8211774 PPC64: User-visible arch directory and os.arch value on ppc64le cause issues with Java tooling
1130 Sean Coffey Oracle JDK-8211729 jdk/javax/xml/crypto/dsig/GenerationTests.java slow on linux
1130 Poonam Bajaj Parhar Oracle JDK-8211738 G1 Full GC not purging code root memory and hence causing memory leak
1131 Ramanand Patil IBM JDK-8211710 Instead of circle rendered in appl window, but ellipse is produced JEditor Pane
1131 Dmitry Markov Oracle JDK-8210891 Remove unused extutil.h from JDK8u sources
1132 Prasadarao Koppula Oracle JDK-8211434 LDAPS communication failure with jdk 1.8.0_181
1132 Sergey Bylokhov Amazon JDK-8211406 Clip.isRunning() may return true after Clip.stop() was called
1132 Sergey Bylokhov Amazon JDK-8211405 Race condition in AudioClip.loop()
1133 David Buck Oracle JDK-8210697 jhsdb dumps core on Solaris 12 when loading dumped core
1137 Kevin Walls Oracle JDK-8211252 HotSpot vm_version.cpp should recognise updated VS2017
1139 David Buck Oracle JDK-8206472 Various test fail with OOME on win x86
1140 Robert Mckenna Oracle JDK-8210350 -Wl,-z,defs JDK 8 build failure
1140 Sergey Bylokhov Amazon JDK-8211074 Swing apps are slow if displaying from a remote source to many local displays
1141 Severin Gehwolf Red Hat JDK-8211056 -Wl,-z,defs JDK 8 build failure
1144 Ramanand Patil IBM JDK-8211001 [macos] Problem with input of yen symbol
1145 Prasadarao Koppula Oracle JDK-8210937 KDC might issue a renewable ticket even if not requested
1145 Prasadarao Koppula Oracle JDK-8210936 GSSCredential.getRemainingLifetime() returns negative value for TTL > 24 days.
1145 Zhengyu Gu Red Hat JDK-8210933 SIGSEGV on write to NativeCallStack::EMPTY_STACK
1146 David Buck Oracle JDK-8210914 No debug info for assembler files
1146 David Buck Oracle JDK-8210913 WARNING: Could not open/create prefs root node Software\JavaSoft\Prefs
1146 Dmitry Markov Oracle JDK-8210909 SunLayoutEngine.isAAT() font is expensive on MacOS
1150 Dmitry Markov Oracle JDK-8201801 RTL language (Hebrew) is presented from left to right
1151 Paul Hohensee Amazon JDK-8209863 Add a test to verify that -XX:+EnableTracing works
1159 Andrew Haley Red Hat JDK-8210423 [8u] Backport of 8034788 breaks GCC version detection
1159 Prasadarao Koppula Oracle JDK-8210460 Cannot call setSeed on NativePRNG on Mac if EGD is /dev/urandom
1165 Sean Coffey Oracle JDK-8210273 javac incorrectly copies over interior type annotations to bridge method
1166 Anton Litvinov Oracle JDK-8209438 [macosx] Printing attributes break page size set via "java.awt.print.Book" object
1172 Paul Hohensee Amazon JDK-8209948 JVM crashes with -XX:+EnableTracing
1172 Sean Coffey Oracle JDK-8209936 Further improvements to cipher buffer management
1174 Sean Coffey Oracle JDK-8206911 javax/xml/crypto/dsig/GenerationTests.java fails in 8u-dev
1175 Robert Mckenna Oracle JDK-8209184 JCK Test Failure due to ResourceBundle
1179 Dmitry Markov Oracle JDK-8209644 OS X: requestFocus() does not work properly for embedded frame
1179 Dmitry Markov Oracle JDK-8209643 OS X: keyboard input in textfield is not possible if the window contained textfield is owned by EmbeddedFrame
1179 David Buck Oracle JDK-8209618 Use DWARF debug symbols for Linux 32-bit as default
1183 David Buck Oracle JDK-8182461 IndexOutOfBoundsException when reading indexed color BMP
1185 Kevin Walls Oracle JDK-8209359 [8u] hotspot needs to recognise cl.exe 19.13 to build with VS2017.
1189 David Buck Oracle JDK-8209089 [TESTBUG] hotspot/test/compiler/whitebox/IsMethodCompilableTest.java test fails with -XX:CompileThreshold=1
1193 Sean Coffey Oracle JDK-8208760 Better management of CipherCore buffers
1193 Sean Coffey Oracle JDK-8208759 Better management of internal KeyStore buffers
1194 Kevin Walls Oracle JDK-8208696 VS2017 Hotspot Defined vsnprintf Function Causes C2084 Already Defined Compilation Error
1195 David Buck Oracle JDK-8208629 hsdis disassembler plugin does not compile with binutils 2.29+
1195 David Buck Oracle JDK-8208628 non-ASCII characters in hsdis UPL text
1196 Ivan Gerasimov Google JDK-8207752 Native handle leak in java.io.WinNTFileSystem.list()
1196 Ivan Gerasimov Google JDK-8207196 (fs) Native memory leak in WindowsNativeDispatcher.LookupPrivilegeValue0
1196 Ivan Gerasimov Google JDK-8207195 Memory leak when malloc fails within WITH_UNICODE_STRING block
1197 Thomas Schatzl Oracle JDK-8208494 Compilation errors with clang-4.0
1200 Robert Mckenna Oracle JDK-8208403 sun/security/tools/jarsigner/warnings.sh fails when using Hindi locale
1200 David Buck Oracle JDK-8208357 update HSDIS plugin license to UPL
1201 Ramanand Patil IBM JDK-8206918 [TESTBUG] Create tests for JDK-8146115 container awareness and resource configuration
1201 David Buck Oracle JDK-8208282 jdb error: InvalidTypeException: Can't assign double[][][] to double[][][]
1202 Severin Gehwolf Red Hat JDK-8208175 (fs) Mount point not found for a file which is present in overlayfs
1207 Mario Torre Red Hat JDK-8207958 Taking screenshots on x11 composite desktop produce wrong result

No changesets log

JDK-8219444 AWT hang occurs when sequenced events arrive out of sequence in multiple AppContexts.
JDK-8219072 Release Note: GTK+ 3.20 and Later Unsupported by Swing
JDK-8217683 Webstart app popup on wrong screen in a one-screen setup changing to multi-monitor
JDK-8217681 Error while opening the JFileChooser when desktop contains shortcuts pointing to deleted files
JDK-8217680 "-XX:OnOutOfMemoryError" uses fork instead of vfork
JDK-8216165 JSSE should create a single instance of the cacerts KeyStore
JDK-8216164 SessionId.hashCode generates too many collisions
JDK-8216163 Support TLS v1.2 algorithm in SunPKCS11 provider
JDK-8216162 Unable to enter zero width non-joiner (ZWNJ) symbol in Swing text component
JDK-8216160 Window of a newly launched Oracle Forms applet loses focus
JDK-8215147 Unable to render cmyk jpeg image
JDK-8214127 FX samples cannot load media from download.java.net over http
JDK-8213796 Running application under 1.8u172 via a DRS rules with the 1.8u192 plugin fail with java.lang.NoSuchMethodError
JDK-8213793 [macOS] Crash on focus loss from dialog on macOS 10.14 Mojave
JDK-8213693 Document that % and " characters are not supported in keys and values of a property for Java Web Start
JDK-8213691 Typo within section "22.2.3 File Names"
JDK-8213689 Improve concurrency in closed test ResumeEndpointId.java
JDK-8213642 JDK8 RPM postinstall scriptlet assumes /usr/share/man/man1 exists
JDK-8213485 Release Note: GTK3 Supported on Linux
JDK-8213036 FX: Update copyright year in docs, readme files to 2019
JDK-8212968 Fix for JDK-8189783 fails
JDK-8212632 Launcher can not find path to libpackager.so
JDK-8212477 Typo in URL for XML section in developer guides
JDK-8212475 Document jdk.tls.legacyAlgorithms security property
JDK-8212474 Deployment.properties file example is incorrect
JDK-8212470 Supported Encodings page for Java SE 8 is out of date
JDK-8212469 Links to jaxp.java.net in Java SE docs will be broken when java.net is shut down
JDK-8212468 Typo in one of the content link of "Location-Independent Access to Resources" doc
JDK-8212463 VerifyCACerts.java failed with "At least one cacert test failed"
JDK-8212462 cacerts/VerifyCACerts.java fails with java.lang.Exception: At least one cacert test failed
JDK-8212457 JWS: Application does not launch on when jnlp.delete.jnlp.file is enabled
JDK-8212443 Allow cacerts test to pass when GTECyberTrust root expires
JDK-8212422 Remove SECOM root (secomevrootca1)
JDK-8212421 Remove several Symantec Root CAs
JDK-8212420 Remove Baltimore Cybertrust Code Signing CA
JDK-8212403 [L10N]Truncation issue happens on the final dialog for pt on Mac
JDK-8212375 JDK installation uninstalls public JRE
JDK-8212374 jre/bin/javaw.exe is missing from server-jre for windows since 8u171
JDK-8212361 meta-index in 1.8.0_152 does not include jfxrt.jar entries
JDK-8212347 javaws.exe failed to launch UTF-8 encoded JNLP file
JDK-8212346 Security check failure for main jar downlaod with jnlp.versionEnabled and Deployment Rule Set feature
JDK-8212345 Long JNLP file is not parsed correctly and ends with javaws path
JDK-8212344 Java incorrectly requires "HttpOnly" cookie attribute to be case sensitive
JDK-8212343 Java Web Start application with file extension association is removed from cache when invoked for the second time from browser
JDK-8212340 JRE bundled in App-V package will not start Java Web Start applications
JDK-8212333 When in is present "progress-class" attribute javaws cannot start
JDK-8212191 Update libjpeg to version 9c
JDK-8212147 [JavaFX] Backport GTK3 support on Linux to 8u
JDK-8212139 FX 8u-dev fails to build on Oracle Linux 6 after fix for JDK-8206246
JDK-8212106 JavaFX build fails with gcc 6
JDK-8210938 Implement Accelerated composition for WebView
JDK-8210450 WebKit build fails with newer versions of VS 2017
JDK-8210282 Bump minimum gradle version to 4.8 for JDK 11
JDK-8210281 Fix gradle deprecation warnings
JDK-8210277 GlassClipboard.cpp fails to compile with newer versions of VS2017
JDK-8210216 Build of 8u-dev fails on 32-bit Linux after fix for JDK-8207159
JDK-8210166 Ensemble: Update version of Lucene to 7.4.0
JDK-8210159 [WebView] Canvas.toDataURL with image/jpeg MIME type fails
JDK-8210156 WebView image capture fails with standalone FX due to dependency on javafx.swing
JDK-8210038 JNLP 'arch' attribute fails with NPE in SingleInstanceServiceImpl
JDK-8209940 Update ICU to version 62.1
JDK-8209648 Update copyright header for files modified in 2018
JDK-8209599 Cherry pick GTK WebKit 2.20.4 changes
JDK-8209559 Incorrect copyright header for some Ensemble samples
JDK-8209493 [macOS] Distorted complex text rendering
JDK-8209050 [WebView] IllegalStateException when invoking print API with html form controls
JDK-8208781 Update FX build to use gradle 4.8
JDK-8208387 One time crash on exit in JNIEnv_::CallObjectMethod
JDK-8208381 Drag and drop of text contents and URL links functionalities are broken in Webview
JDK-8206246 [JavaFX] Backport GTK3 support on Linux to 8u

Committer push log

Aleksej Efimov, Oracle

Bug Summary
JDK-8212512 (ch) linux io_util_md: Operation not supported exception after 8168628
JDK-8212511 (fc) SIGBUS when extending file size to map it
JDK-8212442 (tz) Upgrade time-zone data to tzdata2018d
JDK-8214370 (tz) Upgrade time-zone data to tzdata2018g
JDK-8212513 8u131 Win 10, issue with wrong position of Sogou IME popup
JDK-8212414 [linux] Not all libraries in the VM are linked with -z noexecstack
JDK-8212489 [TEST_BUG] CompressedClassSpaceSizeInJmapHeap.java fails if SA not available
JDK-8212519 AWT hang occurrs when sequenced events arrive out of sequence
JDK-8212520 Backout JDK-8152974
JDK-8212485 Clean up code that saves the previous versions of redefined classes
JDK-8212493 Crash with assert(handler_address == SharedRuntime::compute_compiled_exc_handler(..) failed: Must be the same
JDK-8212525 Disable all DES cipher suites
JDK-8213805 Disable anon and NULL cipher suites
JDK-8212515 EndEntityChecker should not process custom extensions after PKIX validation
JDK-8214369 Era.getDisplayName doesn't work with non-IsoChronology
JDK-8212497 Feed some text to STDIN in ProcessTools.executeProcess()
JDK-8212460 Handshake messages can be strictly ordered
JDK-8212492 Hotspot crash on Cassandra 3.11.1 startup with libnuma 2.0.3
JDK-8213676 Images are not scaled correctly in JEditorPane
JDK-8212510 Impact of noncloneable MessageDigest implementation
JDK-8212494 Improve docker container detection and resource configuration usage
JDK-8212499 jarsigner should emit warning if weak algorithms or keysizes are used
JDK-8213682 jarsigner should print when a timestamp will expire
JDK-8212426 jarsigner treats timestamped signed jar invalid after the signer cert expires
JDK-8212516 JDK part of JavaFX-Swing dialogs appearing behind main stage
JDK-8212490 JVM crash during gc doing concurrent marking
JDK-8212518 Kerberos krb5 authentication: AuthList's put method leads to performance issue
JDK-8212505 keytool should remember real storetype if it is not provided
JDK-8213683 New jarsigner timestamp warning is grammatically incorrect
JDK-8212495 Newlines in JAXB string values of SOAP-requests are escaped to " "
JDK-8212506 NMT is not enabled if NMT option is specified after class path specifiers
JDK-8212517 On Windows Swing changes keyboard layout on a window activation
JDK-8212491 Performance drop with Java JDK 1.8.0_162-b32
JDK-8212514 READING attributes are not available on TSF
JDK-8212487 RedefineClasses() tests fail assert(((Metadata*)obj)->is_valid()) failed: obj is valid
JDK-8213677 Remove exclusion range for phonetic chars in windows fontconfig.properties
JDK-8212486 SIGSEGV in ReceiverTypeData::clean_weak_klass_links
JDK-8212484 speculative traps break when classes are redefined
JDK-8213684 sun/security/tools/jarsigner/warnings/NoTimestampTest.java fails after JDK-8027781
JDK-8212500 test/sun/security/tools/jarsigner/concise_jarsigner.sh failing (cert expired?)
JDK-8212498 Two security tools tests do not run with only JRE
JDK-8214880 Unaligned memory access in Bits.c
JDK-8212524 Upgrade JDK to libpng 1.6.35
JDK-8212502 Use PKIXValidator in jarsigner
JDK-8212509 When determining the ciphersuite lists there is no debug output for disabled suites.

Anton Litvinov, Oracle

Bug Summary
JDK-8209438 [macosx] Printing attributes break page size set via "java.awt.print.Book" object

Andrew Hughes, Red Hat

Bug Summary
JDK-8212163 ppc: enhancement of CRC32 intrinsic
JDK-8212162 ppc: implement CRC32 intrinsic

Andrew Haley, Red Hat

Bug Summary
JDK-8210423 [8u] Backport of 8034788 breaks GCC version detection

Christoph Langer, SAP

Bug Summary
JDK-8212180 [macosx] Cycling through windows (JFrames) does not work with keyboard shortcut

Sean Coffey, Oracle

Bug Summary
JDK-8208760 Better management of CipherCore buffers
JDK-8208759 Better management of internal KeyStore buffers
JDK-8213152 CipherCore performance improvement
JDK-8209936 Further improvements to cipher buffer management
JDK-8210273 javac incorrectly copies over interior type annotations to bridge method
JDK-8206911 javax/xml/crypto/dsig/GenerationTests.java fails in 8u-dev
JDK-8211729 jdk/javax/xml/crypto/dsig/GenerationTests.java slow on linux

David Buck, Oracle

Bug Summary
JDK-8209089 [TESTBUG] hotspot/test/compiler/whitebox/IsMethodCompilableTest.java test fails with -XX:CompileThreshold=1
JDK-8181822 C2: Mixed unsafe oop accesses break alias analysis
JDK-8208629 hsdis disassembler plugin does not compile with binutils 2.29+
JDK-8212166 improve Test6857159.java
JDK-8182461 IndexOutOfBoundsException when reading indexed color BMP
JDK-8208282 jdb error: InvalidTypeException: Can't assign double[][][] to double[][][]
JDK-8212747 JDWP Transport Listener: dt_socket thread crash
JDK-8210697 jhsdb dumps core on Solaris 12 when loading dumped core
JDK-8210914 No debug info for assembler files
JDK-8208628 non-ASCII characters in hsdis UPL text
JDK-8211928 Test6857159.java times out
JDK-8208357 update HSDIS plugin license to UPL
JDK-8209618 Use DWARF debug symbols for Linux 32-bit as default
JDK-8206472 Various test fail with OOME on win x86
JDK-8210913 WARNING: Could not open/create prefs root node Software\JavaSoft\Prefs

Dmitry Markov, Oracle

Bug Summary
JDK-8209643 OS X: keyboard input in textfield is not possible if the window contained textfield is owned by EmbeddedFrame
JDK-8209644 OS X: requestFocus() does not work properly for embedded frame
JDK-8210891 Remove unused extutil.h from JDK8u sources
JDK-8201801 RTL language (Hebrew) is presented from left to right
JDK-8210909 SunLayoutEngine.isAAT() font is expensive on MacOS

Ivan Gerasimov, Google

Bug Summary
JDK-8207196 (fs) Native memory leak in WindowsNativeDispatcher.LookupPrivilegeValue0
JDK-8212709 Backout backport of JDK-8211394 from jdk 8u-dev
JDK-8207195 Memory leak when malloc fails within WITH_UNICODE_STRING block
JDK-8207752 Native handle leak in java.io.WinNTFileSystem.list()
JDK-8212868 Outputs more details for PKCS11 tests if the NSS lib version cannot be determined
JDK-8212869 sun/security/pkcs11/KeyStore/SecretKeysBasic.sh failed due to libnss3 version cannot be parsed

Kevin Walls, Oracle

Bug Summary
JDK-8211933 [8u] hotspot adlc needs to link statically with libstdc++ for gcc7.3
JDK-8209359 [8u] hotspot needs to recognise cl.exe 19.13 to build with VS2017.
JDK-8211252 HotSpot vm_version.cpp should recognise updated VS2017
JDK-8213143 OpenJDK fails to start in Windows 7 and 8.1 after upgrading compiler to VC 2017
JDK-8208696 VS2017 Hotspot Defined vsnprintf Function Causes C2084 Already Defined Compilation Error

Mario Torre, Red Hat

Bug Summary
JDK-8207958 Taking screenshots on x11 composite desktop produce wrong result

Paul Hohensee, Amazon

Bug Summary
JDK-8209863 Add a test to verify that -XX:+EnableTracing works
JDK-8212696 CHECK_ must be used in the rhs of an assignment statement within a block
JDK-8212821 CHECK_ must be used in the rhs of an assignment statement within a block (round 2)
JDK-8209948 JVM crashes with -XX:+EnableTracing
JDK-8212768 TestKeyPairGenerator.java fails on Solaris because private exponent needs to comply with FIPS 186-4
JDK-8212241 Use THREAD instead of CHECK_NULL in return statements

Prasadarao Koppula, Oracle

Bug Summary
JDK-8210460 Cannot call setSeed on NativePRNG on Mac if EGD is /dev/urandom
JDK-8210936 GSSCredential.getRemainingLifetime() returns negative value for TTL > 24 days.
JDK-8210937 KDC might issue a renewable ticket even if not requested
JDK-8211434 LDAPS communication failure with jdk 1.8.0_181

Poonam Bajaj Parhar, Oracle

Bug Summary
JDK-8211738 G1 Full GC not purging code root memory and hence causing memory leak

Philip Race, Oracle

Bug Summary
JDK-8207322 [Client-Libs] Backport GTK3 support on Linux to 8u

Robert Mckenna, Oracle

Bug Summary
JDK-8211788 (fc) FileChannel.map and RandomAccessFile.setLength should not preallocate space
JDK-8210350 -Wl,-z,defs JDK 8 build failure
JDK-8212699 Cannot connect to IPv6 host when exists any active network interface without IPv6 address
JDK-8211790 Create test to cover JDK-8205330 InitialDirContext ctor sometimes throws NPE if the server has sent a disconnection
JDK-8211789 InitialDirContext ctor sometimes throws NPE if the server has sent a disconnection
JDK-8209184 JCK Test Failure due to ResourceBundle
JDK-8208403 sun/security/tools/jarsigner/warnings.sh fails when using Hindi locale

Roland Westrelin, Red Hat

Bug Summary
JDK-8212907 Anti-dependency on membar causes crash in register allocator due to invalid instruction scheduling
JDK-8212908 assert failure in coalesce.cpp: attempted to spill a non-spillable item

Ramanand Patil, IBM

Bug Summary
JDK-8211001 [macos] Problem with input of yen symbol
JDK-8206918 [TESTBUG] Create tests for JDK-8146115 container awareness and resource configuration
JDK-8211710 Instead of circle rendered in appl window, but ellipse is produced JEditor Pane

Sergey Bylokhov, Amazon

Bug Summary
JDK-8211406 Clip.isRunning() may return true after Clip.stop() was called
JDK-8211405 Race condition in AudioClip.loop()
JDK-8211074 Swing apps are slow if displaying from a remote source to many local displays

Severin Gehwolf, Red Hat

Bug Summary
JDK-8208175 (fs) Mount point not found for a file which is present in overlayfs
JDK-8211056 -Wl,-z,defs JDK 8 build failure
JDK-8212009 [Zero] atomic_copy64: Use ldrexd for atomic reads on ARMv7
JDK-8211774 PPC64: User-visible arch directory and os.arch value on ppc64le cause issues with Java tooling
JDK-8212010 SA: jhsdb jstack --mixed throws UnmappedAddressException on i686
JDK-8073327 src.zip should include all sources

Thomas Schatzl, Oracle

Bug Summary
JDK-8208494 Compilation errors with clang-4.0

Zhengyu Gu, Red Hat

Bug Summary
JDK-8210933 SIGSEGV on write to NativeCallStack::EMPTY_STACK