PUSHES REPORT: 8u25

This report shows who pushed the backports to the given release. This usually shows who did the backporting, testing, and review work.

Report generated: Wed Dec 01 01:54:49 CET 2021

Distribution by priority

Count Priority

Distribution by components

Count Component
0 100% Total

Distribution by affiliation

Count Committer
0 100% Total

Chronological push log:

Days Ago Committer Affiliation Bug Summary

No changesets log

JDK-8093412 [LineChart] Calling setForceZeroInRange doesn't update LineChart
JDK-8067789 JavaWS fails with proxy autoconfig due to missing "dnsResolve"
JDK-8065101 JavaWS fails with proxy autoconfig due to missing "resolve" permission
JDK-8059075 NPE seen in XMLDocumentFragmentScannerImpl.setProperty since 7u40b33
JDK-8057960 api/javax_swing/JScrollPane/indexTGF.html#UpdateUI failed with MotifLookAndFeel on all platform
JDK-8057809 [macosx] Endless loop in EDT on Mac
JDK-8057805 JCK8's api/javax_swing/JDesktopPane/descriptions.html#getset failed with GTKLookAndFeel on Linux and Solaris run
JDK-8056282 [headless] DataTransferer.getInstance throws ClassCastException in headless mode
JDK-8055849 VerifyError on backward branch
JDK-8055717 Increment hsx 25.25 build to b02 for 8u25-b11
JDK-8055712 Webstart cache path error for Java >= 7u65
JDK-8054525 Regression in verifier for method call from inside of a branch
JDK-8054117 Collections.checkedList(empty list).replaceAll((UnaryOperator)null) doesn't throw NPE after JDK-8047795
JDK-8052373 Fix bad field access check in C1 and C2
JDK-8052372 new hotspot build - hs25.20-b23
JDK-8052371 AIX: Change "8030763: Validate global memory allocation" breaks the HotSpot build
JDK-8052369 One More File for JavaFX client authentication dialog is not a JavaFX-based dialog
JDK-8052368 JavaFX client authentication dialog is not a JavaFX-based dialog
JDK-8051999 regression - java_arguments not accepted after Update to 7u65
JDK-8051891 SWT cannot load native look&feel
JDK-8051651 require patching and bsdiff for all install builds
JDK-8051358 Step 6:There are java.io.FileNotFoundException and ava.lang.ClassNotFoundException thrown in java console after clicking "Continue" Button,and there is no security dialog with "Run" Button .
JDK-8050945 (smartcardio) Need a flag to invert the Card.disconnect(reset) argument
JDK-8050944 Collections.checkedList checking bypassed by List.replaceAll
JDK-8050943 8u20 l10n resource file translation update 2 - jaxp
JDK-8050940 Deployment .jar files are missing in JAVA_HOME\lib, when installer calls RegisterDeployEx() from deploy.dll
JDK-8050939 msi uninstaller not localized
JDK-8050872 CheckedQueue.offer calls wrong method on wrapped queue
JDK-8050312 java/net/URLPermission/nstest/lookup.sh NoClassDefFoundError when run in concurrent mode
JDK-8050311 AWT crashes inside CCombinedSegTable::In called from Java_sun_awt_windows_WDefaultFontCharset_canConvert
JDK-8050310 [macosx] javax.swing.PopupFactory issue with null owner
JDK-8050308 out-of-date dialogs are not displayed correctly in sv
JDK-8050299 VPAT: "Uninstall out-of-date versions" dialogs - JAWS issues
JDK-8050292 RPM internal names must match the standard bundle file name patterns
JDK-8050288 new hotspot build - hs25.20-b22
JDK-8050074 TEST BUG: NativeErrors.java uses wrong path name in exec
JDK-8050043 Ensure ClassLoaderDataGraph::classes_unloading_do only delivers klasses from CLDs with non-reclaimed class loader oops
JDK-8050042 host_klass invariant fails when verifying newly loaded JSR-292 anonymous classes
JDK-8050041 new hotspot build - hs25.20-b21
JDK-8050040 Broken exception site list GUI- Unable to add a site to the list
JDK-8050038 deploy.dll needs to stop copying javaws.exe to the system dir
JDK-8050035 8u20: FX app fails to connect domain:80 while this domain is allowed in cross domain file
JDK-8050034 Multiple applet jars are reported to Java Usage Tracker incorrectly
JDK-8049191 Fix typos and errors in "Java Networking and Proxies" document
JDK-8049189 javac crashes when encountering an unresolvable interface
JDK-8049182 Remove AppInfo.getFutureBlock*** methods
JDK-8049181 Java Control Panel doesn't display correctly in high resolution
JDK-8048498 Run & debug single Nashorn test
JDK-8048497 API for debugging Nashorn
JDK-8048496 __stack__ becomes visible in Error properties
JDK-8048495 megamorphic getter for scope objects does not call __noSuchProperty__ hook
JDK-8048494 Nashorn cannot execute node.js's express module
JDK-8048493 StringIndexOutOfBoundException in NativeRegExp.appendReplacement
JDK-8048492 ant makefile should have a target to generate javadoc only for jdk.nashorn.api and sub-packages
JDK-8048491 javac crashes with a NullPointerException during bounds checking
JDK-8048490 Add test for JDK-8037385
JDK-8048489 Lambda returning implicitly-typed lambdas considered pertinent to applicability
JDK-8048488 javac crash with FunctionDescriptorLookupError for invalid functional interface
JDK-8048487 Type parameter annotations don't work with multiple type parameters
JDK-8048486 Slow javac compile times in JDK 8
JDK-8048485 Access control in enhanced for
JDK-8048484 Receiver parameter not supported on local class constructor
JDK-8048483 javac allows illegal receiver parameters
JDK-8048482 Types.wildLowerBound and cvarLowerBound should call unannotatedType()
JDK-8048481 Revert some inference fixes in JDK-8033718
JDK-8048480 Covariance of return type implied by upper bounding on type parameter is ignored
JDK-8048479 constant pool errors with -target 1.7 and static default methods
JDK-8048478 Reduce the size of the endPosTable
JDK-8048477 javac fails with StackOverflowException
JDK-8048476 javac test langtools/tools/javac/util/StringUtilsTest.java fails
JDK-8048475 tools/javac/NoStringToLower.java fails due to enforcement no use of String.toLowerCase on non-langtools classes
JDK-8048474 Flags.java uses String.toLowerCase without specifying Locale
JDK-8048473 Type inference of non-existent method references crashes the compiler
JDK-8048472 Fix for 8042785 causes regression tests to fail with java.lang.VerifyError
JDK-8048471 For some sources compiler compiles for ever
JDK-8048470 javac, bridge methods are not getting the flags from the original method
JDK-8048469 Java 8 compiler throws NullPointerException depending location in source file
JDK-8048468 Javac generates invalid signatures for local types
JDK-8048467 javac: AssertionError during LVT generation, wrong variable ranges
JDK-8048465 [TEST_BUG] : Incorrect BIT_FLAG is being set for Solaris
JDK-8048461 [TEST_BUG] The FileDialog window is different from the case KeyboardInteractionTest.html description.
JDK-8048449 (process) ProcessEnvironment_md.c not compiling on 8uX
JDK-8048448 Check jdk/src/windows/native/java/lang/ProcessImpl_md.c for JNI pending exceptions
JDK-8048447 JNI exception pending in src/jdk/src/windows/native/sun/net/www/protocol/http/ntlm/NTLMAuthSequence.c
JDK-8048446 Check jdk/src/windows/native/java/io/WinNTFileSystem_md.c for JNI pending exceptions
JDK-8048445 (prefs) Check jdk/src/windows/native/java/util/WindowsPreference.c for JNI pending exceptions
JDK-8048444 Check jdk/src/windows/native/java/lang/ProcessEnvironment_md.c for JNI pending exceptions
JDK-8048443 Performance of java.time could be better
JDK-8048442 Unable to parse an Instant from fields
JDK-8048441 JDI shared memory transport failed with "Observed abandoned IP mutex"
JDK-8048440 Test jdk/net/Sockets/Test.java fails to compile after fix JDK-8046588
JDK-8048439 [macosx] Crash when setting display mode
JDK-8048438 SecretKeyBasic.sh needs to avoid NSS libnss3 and libsoftokn3 version mismatches
JDK-8048437 PKCS11/NSS tests failing intermittently on Windows
JDK-8048436 Security tests fail on 32 bit linux platform
JDK-8048435 (reflect) getMethods returns default methods that are not members of the class
JDK-8048434 VM anonymous class members can't be statically invocable
JDK-8048433 [JLightweightFrame] support scaled painting
JDK-8048432 [JLightweightFrame] support default JViewport BLIT_SCROLL_MODE
JDK-8048431 White flashing when opening Dialogs and Menus using Nimbus with dark background
JDK-8048429 Deserialization of empty java.awt.geom.Path2D will cause an exception
JDK-8048428 [OGL] clip is ignored during surface->sw blit
JDK-8048427 JDK 9 client build failure on Solaris
JDK-8048426 [OGL] Translucent VolatileImages don't paint correctly
JDK-8048425 [OGL] surface->sw blit is extremely slow
JDK-8048423 HashMap.put with null key may throw NullPointerException
JDK-8048422 Wrong dateformat for locale es_DO
JDK-8048421 test for SO_FLOW_SLA availability does not check for EACCESS
JDK-8048420 [asm] refresh internal ASM version to v5.0.3
JDK-8048419 UTC+02:00 time zones are not detected correctly on Windows
JDK-8048418 AnnotatedType.getType() of a Executable parameters may return wrong type
JDK-8048417 JSR292: invokeSpecial: InternalError attempting to lookup a method
JDK-8048416 Behavior difference when connect() is interrupted by signal on AIX
JDK-8048415 [TESTBUG] Test sun/security/tools/policytool/i18n.sh fails after clicking 'Done' button in test frame
JDK-8048414 Generate nroff for Java tools documentation for 8u20 release
JDK-8048413 Broken links in jre.api.net.socketoptions
JDK-8048412 New jdk.net classes have @since 1.9 tags in 8u20
JDK-8048411 sun.security.krb5.KdcComm interprets kdc_timeout as msec instead of sec
JDK-8048409 Java 7 jarsigner displays warning about cert policy tree
JDK-8048408 Problem reading the contents of some zip files
JDK-8048407 Bug in zlib 1.2.5 prevents inflation of some gzipped files (zlib 1.2.8 port)
JDK-8048406 WaitForMultipleObjects() return value not handled appropriately
JDK-8048405 LambdaMetafactory.altMetafactory javadoc refers to wrong method
JDK-8048404 Can't exit color chooser dialog when running as an applet
JDK-8048403 IsoFields.WEEK_BASED_YEAR adjustInto incorrect
JDK-8048402 JRuby test_respond_to.rb asserts with: MT-unsafe modification of inline cache
JDK-8048401 Applet menus not rendering when browser is full screen on Mac
JDK-8048400 (fc) Provide native implementation of FileChannel.transferTo for AIX
JDK-8048399 (smartcardio) Native memory should be handled more accurately
JDK-8048398 Windows build failure (j2pcsc.dll : fatal error unresolved external symbol throwByName)
JDK-8048395 com.sun.jndi.ldap.Connection:ReadTimeout should abandon ldap request
JDK-8048394 14 stuck threads waiting for notification on LDAPRequest
JDK-8048393 Test closed/java/awt/dnd/FileDialogDropTargetTest/FileDialogDropTargetTest.java fails on Solaris zones virtual hosts
JDK-8048392 java.awt.Desktop: Enable check for supported URI schemes on Linux
JDK-8048391 leak in Java_sun_awt_X11_XlibWrapper_getStringBytes?
JDK-8048390 Use JComboBox as it's own ActionListener leads to unexpected behaviour
JDK-8048389 REGRESSION: test/closed/javax/swing/AbstractButton/4246045/bug4246045.java fails
JDK-8048387 AWT_TopLevels/TopLevelEvents/Automated/WindowIconifyDeiconifyEventsTest02 fails on Ubuntu 12.04 Unity shell
JDK-8048385 JNI exception pending in jdk/src/windows/native/sun/net/dns/ResolverConfigurationImpl.c
JDK-8048384 Check src/windows/native/sun/nio/fs/WindowsNativeDispatcher.c for JNI pending exceptions
JDK-8048383 Check jdk/src/windows/native/java/io/io_util_md.c for JNI pending exceptions
JDK-8048382 ImageIcon constructor throws an NPE and hangs when passed a null String parameter
JDK-8048381 Dvorak keyboard mapping not honored when ctrl key pressed
JDK-8048380 JNI exception pending in jdk/src/windows/native/java/net/DualStackPlainDatagramSocketImpl.c
JDK-8048378 (smartcardio) Card.disconnect(boolean reset) does not reset when reset is true
JDK-8048377 (smartcardio) Card.transmitControlCommand() does not work on Mac OS X
JDK-8048376 (smartcardio) javax.smartcardio.CardTerminals.list() fails on MacOSX
JDK-8048375 javax.smartcardio does not detect cards on Mac OS X
JDK-8048374 [macosx] Transparency demo is not correctly dragged on the second monitor
JDK-8048373 JAF initialisation in SAAJ clashing with the one in javax.mail
JDK-8048372 G1: Enabled G1CollectedHeap::stop()
JDK-8048371 Build failure from multiple ptrace.h
JDK-8048370 assert(ex_map->jvms()->same_calls_as(_exceptions->jvms())) failed: all collected exceptions must come from the same place
JDK-8048369 new hotspot build - hs25.20-b20
JDK-8048368 org.omg.CORBA.ORBSingletonClass loading no longer uses context class loader
JDK-8047283 SDK installer can not run on windows zh_CN and ja
JDK-8047282 Install build fails on Ubuntu with sh error in compile_async.sh
JDK-8047279 8u20-b10: Jre can't be installed to folders containing non-ASCII chara
JDK-8047278 VPAT: "Uninstall out-of-date versions" dialogs - keyboard a11y issue
JDK-8047277 [MSI] FIU dialog appears when uninstall MSI with Java App running
JDK-8047275 [MSI] Some files left after uninstalled 32bit JRE if 64bit JRE exists
JDK-8047271 Segmentation fault in JVM (easily reproducible)
JDK-8047270 [TESTBUG] runtime/Thread/TestThreadDumpMonitorContention.java failed error_cnt=12
JDK-8047269 compiler/whitebox/IsMethodCompilableTest.java fails with 'private int SimpleTestCase$Helper.method() is still compilable after 3 iterations'
JDK-8047267 assert(capacity_until_gc >= committed_bytes) failed
JDK-8047266 Fastdebug build failing on jdk9/hs/ control jobs after pulling some hs-comp changes
JDK-8047264 G1: Missing post barrier in processing of j.l.ref.Reference objects
JDK-8047263 OSR methods may not be recompiled at proper compilation level after deoptimization
JDK-8047262 Tests get ClassNotFoundException: com.oracle.java.testlibrary.StreamPumper
JDK-8047261 new hotspot build - hs25.20-b19
JDK-8047259 Provide API to check if a given DRS allows or blocks a given application
JDK-8047257 Automate Securitypack.jar creation
JDK-8047255 SecurityBaseLine test doesn't fully restore the baseline configuration after completion
JDK-8047252 jfxrt.jar has a duplicate JSObject class without getWindow(Applet)
JDK-8047251 Add more things to ignore to .hgignore
JDK-8047249 NPE in sun.lwawt.macosx.CEmbeddedFrame.getLayerPtr during applet startup
JDK-8047248 ExtensionInstallerService.updateProgress() doesn't force the progress bar to be visible after calling hideProgressBar() as specified
JDK-8047245 App gets blocked instead of showing multiple click dialog when no ocsp and crl info in certificate
JDK-8046814 Browser throws ClassNotFoundException when javaws.args present in deployment.properties on Windows
JDK-8046582 REGRESSION: Hotspot causes segmentation fault in jdk8ux, but not in jdk7ux
JDK-8046581 Stack trace sometimes shows 'locked' instead of 'waiting to lock'
JDK-8046580 TestStringDeduplicationMemoryUsage test failing
JDK-8046577 jprt bundles have libjsig.dylib in different place on OSX
JDK-8046576 OptimizePtrCompare too aggressive when allocations are present
JDK-8046575 new hotspot build - hs25.20-b18
JDK-8045996 closed/javax/swing/JComboBox/6246463/bug6246463.java deadlocks on MacOS
JDK-8045994 [TEST_BUG] child.exe remains after execution java/awt/dnd/ Win32TYMEDSelectionTest and Win32DropTYMEDSelectionTest
JDK-8045990 Test closed/java/awt/Choice/ChoiceLocationTest/ChoiceLocationTest.html should be removed
JDK-8045985 TestClassUnloadEvent.java got too many vm/class/unload events
JDK-8045982 TestDynamicRequestable fails intermittently
JDK-8045981 Test TestStringConstantPoolDiskRecordingNoEmptyOnRotation times out sometimes
JDK-8045975 closed/sun/management/snmp/generic/GenericTest.sh fails intermittently
JDK-8045973 Fix snmp tests connection timeout problem.
JDK-8045970 [TEST_BUG] lambda SAND framework needs adjustments.
JDK-8045959 JAB throw NPE when trying to do reference increment on a NULL object
JDK-8045958 oracle/jrockit/jfr/JIInliner.java imports wrong ASM
JDK-8045957 Two nsk/hprof/options/cpu failed with Stack Overflow in JFR on Linux-amd64 in Promotion testing of JDK8 b123
JDK-8045954 Add lint check fixes to Java Access Bridge files
JDK-8045947 Java Usage Tracker: need to escape separator chars
JDK-8045920 jds catch breaks the installer.exe
JDK-8045913 msi installers should support rollback
JDK-8045898 enterprise MSI PIT has 2 major issues
JDK-8045896 Registry key shows incorrect location of jvm.dll on Win 7 64 bit installation
JDK-8045890 uninstaller not removing AU2.0
JDK-8045879 replace AU dialog (AUWelcome) with HtmlUI
JDK-8045875 unpack200.exe calls are broken on windows
JDK-8045874 need to turn on new patching mechanism during install runtime
JDK-8045872 non-windows build is broken
JDK-8045869 8u5 JDK welcome dialog: Update text is missed
JDK-8045867 fully commit to new msi design
JDK-8045840 jdk9/dev build fails in install on solaris after JDK_MINOR_VERSION was changed to 9
JDK-8045837 need to fix new msi wrapper extraction issue
JDK-8045835 Need msi with one-file-per-componet
JDK-8045830 Java items on Start Menu still exist even after all JREs from the system are removed.
JDK-8045828 [macosx] The JRE installer does not look right with 8 b100 promotion build.
JDK-8045825 AU should be easier to setup after a DS build
JDK-8045823 The new au64 project has several issues
JDK-8045820 [MSI] Start menu is not created when install MSI with NOSTARTMENU=0
JDK-8045817 Fail to install on MacOS 10.10
JDK-8045816 [MSI] Access Bridge is installed when install test jre with STATIC=1 after higher version installed
JDK-8045811 need to consolidate our registry manipulation approach
JDK-8045810 Registry class enhancements
JDK-8045799 8u20 Patch Installer Failure
JDK-8045796 Integrate new version of Java VisualVM based on VisualVM 1.3.7 into JDK
JDK-8045793 ErrorHandling macros log wrong source position
JDK-8045792 zh-SG (Chinese Singapore) locale should be handled as Chinese Simplified
JDK-8045791 html_ui: implement automatic selection of the locale
JDK-8045785 Unittests for new functionality in FileUtils is required
JDK-8045779 DOM Serializer prints stack traces to System.err
JDK-8045778 test needs to be removed from jaxp repo
JDK-8045777 Spec: javax.xml.stream.XMLEventFactory/XMLOutputFactory/XMLInputFactory.newFactory(String, ClassLoader) referring to ServiceLoader.load(Class, ClassLoader)
JDK-8045774 unexcepted behavior of LineBorder while using Boolean variable true
JDK-8045773 stream with sorted() causes downstream ops not to be lazy
JDK-8045771 Subtag syntax check is incomplete in Locale.LanguageRange
JDK-8045770 (process) Improve subprocess handling on Solaris
JDK-8045769 Paths.get("").normalize() throws ArrayIndexOutOfBoundsException
JDK-8045768 Files.createDirectories throws exception with confusing message for root directories that exist
JDK-8045767 [macosx] JOptionPane dialogs show wrong icons
JDK-8045764 Issue for negative byte major record version
JDK-8045762 Improve performance of IP address parsing
JDK-8045761 Avoid provoking NumberFormatException when initializing InetAddrCachePolicy
JDK-8045760 java/net/Inet4Address/textToNumericFormat.java fails on Solaris and Mac
JDK-8045759 JAB: mneumonics not read for textboxes
JDK-8045758 ArrayList(c) should avoid inflation if c is empty
JDK-8045753 Windows build failed after JDK-8030787
JDK-8045751 test/sun/net/www/http/HttpClient/B8025710.java fails with cannot find keystore
JDK-8045742 The scrollbar in JScrollPane has no right border if used WindowsLookAndFeel
JDK-8045741 Proxied HTTPS connections reused by HttpClient can send CONNECT to the server
JDK-8045740 Improve synchronization in ZipFile.read()
JDK-8045739 Exception thrown when drag and drop between two components is executed quickly
JDK-8045738 Remove java/lang/reflect/Method/invoke/TestPrivateInterfaceMethodReflect.java from exclude list
JDK-8045737 com.sun.jarsigner.ContentSignerParameters.getTSAPolicyID() should be a default method
JDK-8045736 Classes with overriden methods with covariant returns return random read methods
JDK-8045735 CopyOnWriteArrayList.COWSubList.subList does not validate range properly
JDK-8045734 java.time.format.DateTimeFormatter doesn't set zone when parsing
JDK-8045728 JAB:Multiselection Ctrl+CursorUp/Down and ActivateDescenderPropertyChanged event
JDK-8045727 Java Access Bridge version strings need to be fixed
JDK-8045723 A sentence is truncated in the API doc for j.u.Locale.LanguageRange.parse(String, Map).
JDK-8045720 ArrayIndexOutOfBoundsException in JTable while clearing data in JTable
JDK-8045719 [OGL] Image painting is broken if 'sun.java2d.accthreshold' is set to 0
JDK-8045718 [macosx] Calling JNI functions in the scope of Get/ReleasePrimitiveArrayCritical
JDK-8045717 [macosx] Toolkit.sync should be implemented
JDK-8045716 [macosx] Scrollbars looks bad under retina in Motif and Metal L&F
JDK-8045715 Focus border of JButton.buttonType=roundRect is cut off
JDK-8045714 Javadoc cleanup of javax.sound.midi.spi package
JDK-8045713 [macosx] failure in Window.initGC on Mac with monitor sleeping
JDK-8045711 [macosx] java.awt.List: method select(int) doesn't work before be visible
JDK-8045710 Typo correction needed s/Classlaoder/Classloader/
JDK-8045709 Cleanup of java.awt and java.awt.peer packages
JDK-8045708 [macosx] Applet graphics corrupted when applet width/height exceeds screen dimensions
JDK-8045707 [macosx] a constrain of the top level window should be improved
JDK-8045706 [macosx] Full screen not working properly on 7u45 and jdk8
JDK-8045705 Consider removal of code disabling JIT in Toolkit.getDefaultToolkit
JDK-8045704 Label.toString performance improvement
JDK-8045703 [macosx] LWToolkit should not depends from the macosx.
JDK-8045684 [macosx] Http-Images are not fully loaded when using ImageIcon
JDK-8045683 In Java 8 java.awt.datatransfer.DataFlavor.equals is no longer symmetric
JDK-8045682 test/sun/management/jmxremote/LocalRMIServerSocketFactoryTest.java doesn't clean-up
JDK-8045680 AIX: Provide better time zone mappings (i.e. tzmappings file)
JDK-8045679 [macosx] Combo box consuming escape key events
JDK-8045678 [macosx] Fullscreen button freezes application when started with -splash
JDK-8045674 In TextField can only select text visible or to the left of the cursor
JDK-8045673 AnnotatedType.getType() of a TypeVariable boundary without annotations return null
JDK-8045670 Update java/lang/management/MemoryMXBean tests to ignore GC setting by jtreg
JDK-8045669 LowMemoryTestConcMarkSweepGC.sh fails intermittently with timeout
JDK-8045667 '}' left in the spec for j.u.Random.doubles(..)
JDK-8045666 Unsynchronized code path from javax.crypto.Cipher to the WeakHashMap used by JceSecurity to store codebase mappings
JDK-8045663 (tz) Support tzdata2014c
JDK-8045662 UTF-8 decoder fails to handle some edge cases correctly
JDK-8045661 String.toLowerCase regression - violates Unicode standard
JDK-8045657 [TEST_BUG] closed/java/awt/Window/AlwaysOnTop/TestAlwaysOnTopBeforeShow.java still failed
JDK-8045656 Nimbus JList selection colors persist across L&F changes
JDK-8045655 [TEST_BUG] frames didn't closed after execution some awt/dnd/ tests
JDK-8045650 Missing licence headers in test for JDK-8033113
JDK-8045649 wsimport fails on WSDL:header parameter name customization
JDK-8045646 XAWT: Native components should not paint native part on UPDATE event
JDK-8045645 AbstractMap unnecessarily initializes two volatiles to null
JDK-8045644 sun_awt_X11_GtkFileDialogPeer.h can be removed
JDK-8045643 Cleanup of sun.awt.windows package
JDK-8045642 [macosx] NPE in AquaSingleImagePainter.paint()
JDK-8045641 SelectionVisible test should test multiline selection in case of TextArea
JDK-8045640 Broken links in ConcurrentMap javadoc
JDK-8045639 DateTimeFormatter withResolverFields() fails to accept null
JDK-8045638 java.time add @param tags to readObject
JDK-8045637 DateTimeFormatter spec includes irrelevant detail on parsing pattern
JDK-8045636 Instant spec includes incorrect assertion wrt valid range
JDK-8045635 Error message typo in TemporalAccessor
JDK-8045634 Typo in java.time.Clock
JDK-8045633 Typo in java.time.format.Parsed error message
JDK-8045632 DateTimeFormatter fixed width adjacent value parsing does not match spec
JDK-8045631 ChronoLocalDate refers to generics that have been removed
JDK-8045630 LocalTime with(MILLI_OF_DAY/MICRO_OF_DAY) incorrect
JDK-8045629 Introspector throws NullPointerException for subclasses' mismatched get/setter
JDK-8045628 Remove testcase from npt utf.c
JDK-8045627 [macosx] JTree icon is not rendered in high resolution on Retina
JDK-8045626 [macosx] Components cannot be rendered in HiDPI to BufferedImage
JDK-8045625 [macosx] JFileChooser current filter nullified by addChoosableFileFilter
JDK-8045624 (prefs) Check src/solaris/native/java/util/FileSystemPreferences.c for JNI pending exceptions
JDK-8045620 JAX-WS conformance tests fail when running JCK-devtools-8 suite against RI in EBCDIC emulation mode
JDK-8045616 c.s.j.r.i.ClientNotifForwarder$LinearExecutor prone to data races
JDK-8045615 [macosx] setResizable(false) makes a frame slide down
JDK-8045614 Time display for Spanish(Chile, Ecuador ) locale doesn't show 24-hour format
JDK-8045613 [TESTBUG] Several regression tests fail to compile in JDK 8u20 nightly build
JDK-8045611 JLabel/JToolTip throw ClassCastException for "a" </td> </tr> <tr> <td><a href="https://bugs.openjdk.java.net/browse/JDK-8045610">JDK-8045610</a></td> <td>[macosx] Native memory leak in Java_sun_lwawt_macosx_CImage_nativeGetNSImageRepresentationSizes</td> </tr> <tr> <td><a href="https://bugs.openjdk.java.net/browse/JDK-8045609">JDK-8045609</a></td> <td>[macosx] Loading resolution variants by demand</td> </tr> <tr> <td><a href="https://bugs.openjdk.java.net/browse/JDK-8045608">JDK-8045608</a></td> <td>[macosx] Get MultiResolution image from native system</td> </tr> <tr> <td><a href="https://bugs.openjdk.java.net/browse/JDK-8045607">JDK-8045607</a></td> <td>AIOB while parsing CRL for revoked certificate</td> </tr> <tr> <td><a href="https://bugs.openjdk.java.net/browse/JDK-8045584">JDK-8045584</a></td> <td>[TESTBUG] improvements of test j.l.i.MethodHandles</td> </tr> <tr> <td><a href="https://bugs.openjdk.java.net/browse/JDK-8045583">JDK-8045583</a></td> <td>Applet/browser deadlocks, when IIS integrated authentication is used</td> </tr> <tr> <td><a href="https://bugs.openjdk.java.net/browse/JDK-8045582">JDK-8045582</a></td> <td>(sctp) SIGBUS in SctpChannelImpl receive</td> </tr> <tr> <td><a href="https://bugs.openjdk.java.net/browse/JDK-8045579">JDK-8045579</a></td> <td>MethodHandles.catchException doesn't handle VarargsCollector right (8034120 failed)</td> </tr> <tr> <td><a href="https://bugs.openjdk.java.net/browse/JDK-8045578">JDK-8045578</a></td> <td>MethodHandles.catchException doesn't handle VarargsCollector right</td> </tr> <tr> <td><a href="https://bugs.openjdk.java.net/browse/JDK-8045577">JDK-8045577</a></td> <td>Improve performance of catchException combinator</td> </tr> <tr> <td><a href="https://bugs.openjdk.java.net/browse/JDK-8045576">JDK-8045576</a></td> <td>[TEST_BUG] java/awt/Paint/bug8024864.java fails on Windows 7</td> </tr> <tr> <td><a href="https://bugs.openjdk.java.net/browse/JDK-8045575">JDK-8045575</a></td> <td>Test java/lang/ProcessBuilder/CloseRace.java fails</td> </tr> <tr> <td><a href="https://bugs.openjdk.java.net/browse/JDK-8045574">JDK-8045574</a></td> <td>(process) Enhancement of handling async close of ProcessInputStream</td> </tr> <tr> <td><a href="https://bugs.openjdk.java.net/browse/JDK-8045573">JDK-8045573</a></td> <td>Editable combos in table do not behave as expected</td> </tr> <tr> <td><a href="https://bugs.openjdk.java.net/browse/JDK-8045572">JDK-8045572</a></td> <td>Optimize Arrays.asList(...).forEach</td> </tr> <tr> <td><a href="https://bugs.openjdk.java.net/browse/JDK-8045571">JDK-8045571</a></td> <td>Methods j.u.Arrays.spliterator/stream(X[], int, int) throw IAE instead of specified AIOOBE when endIndex < startIndex</td> </tr> <tr> <td><a href="https://bugs.openjdk.java.net/browse/JDK-8045570">JDK-8045570</a></td> <td>PIT: access problem to a PrinterJob on OS X </td> </tr> <tr> <td><a href="https://bugs.openjdk.java.net/browse/JDK-8045569">JDK-8045569</a></td> <td>TEST_BUG: java/awt/event/KeyEvent/SwallowKeyEvents/SwallowKeyEvents.java fails (Invalid key code)</td> </tr> <tr> <td><a href="https://bugs.openjdk.java.net/browse/JDK-8045568">JDK-8045568</a></td> <td>[TEST_BUG] java/awt/Toolkit/Headless/WrappedToolkitTest/WrappedToolkitTest.sh fails with exit code 2</td> </tr> <tr> <td><a href="https://bugs.openjdk.java.net/browse/JDK-8045566">JDK-8045566</a></td> <td>[asm] refresh internal ASM version</td> </tr> <tr> <td><a href="https://bugs.openjdk.java.net/browse/JDK-8045565">JDK-8045565</a></td> <td>Certpath validation fails if validity period of root cert does not include validity period of intermediate cert</td> </tr> <tr> <td><a href="https://bugs.openjdk.java.net/browse/JDK-8045564">JDK-8045564</a></td> <td>D3D: rendering with XOR composite causes InternalError.</td> </tr> <tr> <td><a href="https://bugs.openjdk.java.net/browse/JDK-8045562">JDK-8045562</a></td> <td>krb5.conf does not accept directive lines before the first section</td> </tr> <tr> <td><a href="https://bugs.openjdk.java.net/browse/JDK-8045558">JDK-8045558</a></td> <td>PPC64: Fix AIX build in ppc-aix-port/stage after syncing 7133499 and 8028293 from jdk8u</td> </tr> <tr> <td><a href="https://bugs.openjdk.java.net/browse/JDK-8045557">JDK-8045557</a></td> <td>AIX: (ch) Fix synchronization issue in AixPollPort.java</td> </tr> <tr> <td><a href="https://bugs.openjdk.java.net/browse/JDK-8045556">JDK-8045556</a></td> <td>PPC64: Addons and fixes for AIX to pass the jdk regression tests</td> </tr> <tr> <td><a href="https://bugs.openjdk.java.net/browse/JDK-8045555">JDK-8045555</a></td> <td>PPC64: Make the various POLL constants system dependant</td> </tr> <tr> <td><a href="https://bugs.openjdk.java.net/browse/JDK-8045554">JDK-8045554</a></td> <td>PPC64: implement printing on AIX</td> </tr> <tr> <td><a href="https://bugs.openjdk.java.net/browse/JDK-8045553">JDK-8045553</a></td> <td>PPC64: Updated the JDK regression tests to run on AIX</td> </tr> <tr> <td><a href="https://bugs.openjdk.java.net/browse/JDK-8045552">JDK-8045552</a></td> <td>PPC64: 8027566 changes broke AIX build after sync</td> </tr> <tr> <td><a href="https://bugs.openjdk.java.net/browse/JDK-8045551">JDK-8045551</a></td> <td>PPC64: Basic changes and files to build the class library on AIX</td> </tr> <tr> <td><a href="https://bugs.openjdk.java.net/browse/JDK-8045550">JDK-8045550</a></td> <td>PPC64: 8025715 changes broke AIX build after sync</td> </tr> <tr> <td><a href="https://bugs.openjdk.java.net/browse/JDK-8045549">JDK-8045549</a></td> <td>PPC64: Enable new build on AIX (jdk part)</td> </tr> <tr> <td><a href="https://bugs.openjdk.java.net/browse/JDK-8045548">JDK-8045548</a></td> <td>XSLT string-length returns incorrect length when string includes complementary chars</td> </tr> <tr> <td><a href="https://bugs.openjdk.java.net/browse/JDK-8045547">JDK-8045547</a></td> <td>XML parser returns incorrect parsing results</td> </tr> <tr> <td><a href="https://bugs.openjdk.java.net/browse/JDK-8045546">JDK-8045546</a></td> <td>[TEST_BUG] test/sun/util/calendar/zi/Zoneinfo.java incorrectly calculates raw GMT offset change time</td> </tr> <tr> <td><a href="https://bugs.openjdk.java.net/browse/JDK-8045545">JDK-8045545</a></td> <td>(tz) Support tzdata2014a</td> </tr> <tr> <td><a href="https://bugs.openjdk.java.net/browse/JDK-8045544">JDK-8045544</a></td> <td>issue with the crypto / sec zip unzipping in the jdk8 build</td> </tr> <tr> <td><a href="https://bugs.openjdk.java.net/browse/JDK-8045539">JDK-8045539</a></td> <td>[macosx] Cleanup "may not respond to selector" warnings in native code</td> </tr> <tr> <td><a href="https://bugs.openjdk.java.net/browse/JDK-8045538">JDK-8045538</a></td> <td>[macosx] Dragging images from the browser does not work</td> </tr> <tr> <td><a href="https://bugs.openjdk.java.net/browse/JDK-8045536">JDK-8045536</a></td> <td>[TEST_BUG] [macosx] java/awt/dnd/Button2DragTest sometimes fail</td> </tr> <tr> <td><a href="https://bugs.openjdk.java.net/browse/JDK-8045534">JDK-8045534</a></td> <td>[macosx] Popups appear behind taskbar</td> </tr> <tr> <td><a href="https://bugs.openjdk.java.net/browse/JDK-8045533">JDK-8045533</a></td> <td>[macosx] Setting popupmenu on TrayIcon do not work if done *after* adding TrayIcon</td> </tr> <tr> <td><a href="https://bugs.openjdk.java.net/browse/JDK-8045531">JDK-8045531</a></td> <td>[macosx] Support apple.awt.use-file-dialog-packages property</td> </tr> <tr> <td><a href="https://bugs.openjdk.java.net/browse/JDK-8045530">JDK-8045530</a></td> <td>[macosx] java.util.NoSuchElementException at java.util.LinkedList.getFirst</td> </tr> <tr> <td><a href="https://bugs.openjdk.java.net/browse/JDK-8045529">JDK-8045529</a></td> <td>[macosx] Cannot select from JComboBox in a JWindow</td> </tr> <tr> <td><a href="https://bugs.openjdk.java.net/browse/JDK-8045528">JDK-8045528</a></td> <td>fatal error has been detected by the Java Runtime Environment (access violation)</td> </tr> <tr> <td><a href="https://bugs.openjdk.java.net/browse/JDK-8045527">JDK-8045527</a></td> <td>Better memory allocation for file descriptors greater than 1024 on macosx</td> </tr> <tr> <td><a href="https://bugs.openjdk.java.net/browse/JDK-8045526">JDK-8045526</a></td> <td>Incorrect license header for a test class</td> </tr> <tr> <td><a href="https://bugs.openjdk.java.net/browse/JDK-8045525">JDK-8045525</a></td> <td>[macosx] Checkmarks of JCheckBoxMenuItems aren't rendered in high resolution on Retina</td> </tr> <tr> <td><a href="https://bugs.openjdk.java.net/browse/JDK-8045524">JDK-8045524</a></td> <td>JNU_CHECK_EXCEPTION should support c++ JNI syntax</td> </tr> <tr> <td><a href="https://bugs.openjdk.java.net/browse/JDK-8045522">JDK-8045522</a></td> <td>Update mapfile for libjfr</td> </tr> <tr> <td><a href="https://bugs.openjdk.java.net/browse/JDK-8045521">JDK-8045521</a></td> <td>Keep track of file paths in file streams and channels for instrumentation purposes</td> </tr> <tr> <td><a href="https://bugs.openjdk.java.net/browse/JDK-8045520">JDK-8045520</a></td> <td>Simplify instrumentation of FileInputStream and RandomAccessFile</td> </tr> <tr> <td><a href="https://bugs.openjdk.java.net/browse/JDK-8045518">JDK-8045518</a></td> <td>[macosx] CPlatformWindow.setWindowState throws RuntimeException, if windowState=ICONIFIED:MAXIMIZED_BOTH</td> </tr> <tr> <td><a href="https://bugs.openjdk.java.net/browse/JDK-8045517">JDK-8045517</a></td> <td>(fc) FileChannel.read not preempted by asynchronous close on OS X</td> </tr> <tr> <td><a href="https://bugs.openjdk.java.net/browse/JDK-8045516">JDK-8045516</a></td> <td>TEST_BUG: java/nio/channels/Selector/SelectAfterRead.java fails intermittently</td> </tr> <tr> <td><a href="https://bugs.openjdk.java.net/browse/JDK-8045515">JDK-8045515</a></td> <td>Macros for checking and returning on exceptions</td> </tr> <tr> <td><a href="https://bugs.openjdk.java.net/browse/JDK-8045514">JDK-8045514</a></td> <td>assert in j.l.instrument agents during shutdown when daemon thread is running</td> </tr> <tr> <td><a href="https://bugs.openjdk.java.net/browse/JDK-8045511">JDK-8045511</a></td> <td>SQE test CertPath/CertPathBuilderTest/* failed with java.lang.IndexOutOfBoundsException</td> </tr> <tr> <td><a href="https://bugs.openjdk.java.net/browse/JDK-8045510">JDK-8045510</a></td> <td>Certificate Path Building problem with AKI serial number</td> </tr> <tr> <td><a href="https://bugs.openjdk.java.net/browse/JDK-8045508">JDK-8045508</a></td> <td>[TEST_BUG] java/awt/DataFlavor/MissedHtmlAndRtfBug/MissedHtmlAndRtfBug.html: test frames remain after test execution</td> </tr> <tr> <td><a href="https://bugs.openjdk.java.net/browse/JDK-8045507">JDK-8045507</a></td> <td>ExclusiveBind.java has a race condition</td> </tr> <tr> <td><a href="https://bugs.openjdk.java.net/browse/JDK-8045506">JDK-8045506</a></td> <td>sun/management/jmxremote/startstop/JMXStartStopTest.java should report port in use</td> </tr> <tr> <td><a href="https://bugs.openjdk.java.net/browse/JDK-8045505">JDK-8045505</a></td> <td>backport of 8031737 to jdk8u breaks linux buld.</td> </tr> <tr> <td><a href="https://bugs.openjdk.java.net/browse/JDK-8045504">JDK-8045504</a></td> <td>Bold fonts everywhere in GTK L&F on Ubuntu with JDK 7</td> </tr> <tr> <td><a href="https://bugs.openjdk.java.net/browse/JDK-8045503">JDK-8045503</a></td> <td>[macosx] TwentyThousandTest test intermittently hangs</td> </tr> <tr> <td><a href="https://bugs.openjdk.java.net/browse/JDK-8045502">JDK-8045502</a></td> <td>some jtreg tests fail with permission denied</td> </tr> <tr> <td><a href="https://bugs.openjdk.java.net/browse/JDK-8045500">JDK-8045500</a></td> <td>CHECK_NULL and CHECK_EXCEPTION macros cleanup</td> </tr> <tr> <td><a href="https://bugs.openjdk.java.net/browse/JDK-8045499">JDK-8045499</a></td> <td>Add a test to verify that Logger.getLogger & LogManager.getLogManager don't throw NPE when System.out == null</td> </tr> <tr> <td><a href="https://bugs.openjdk.java.net/browse/JDK-8045498">JDK-8045498</a></td> <td>javax.print.PrintService does not find any CUPS-Printers on Linux</td> </tr> <tr> <td><a href="https://bugs.openjdk.java.net/browse/JDK-8045497">JDK-8045497</a></td> <td>Native Windows ccache might still get unsupported ticket</td> </tr> <tr> <td><a href="https://bugs.openjdk.java.net/browse/JDK-8045496">JDK-8045496</a></td> <td>test/java/util/logging/SimpleLogManager might let Loggers be gc'ed too early.</td> </tr> <tr> <td><a href="https://bugs.openjdk.java.net/browse/JDK-8045495">JDK-8045495</a></td> <td>BigInteger a.multiply(a) should use squaring code</td> </tr> <tr> <td><a href="https://bugs.openjdk.java.net/browse/JDK-8045493">JDK-8045493</a></td> <td>java/lang/management/MemoryMXBean/MemoryManagement is not robust when getMax() returns -1</td> </tr> <tr> <td><a href="https://bugs.openjdk.java.net/browse/JDK-8045492">JDK-8045492</a></td> <td>(tz) Support tzdata2013i</td> </tr> <tr> <td><a href="https://bugs.openjdk.java.net/browse/JDK-8045491">JDK-8045491</a></td> <td>[macosx] AquaIcon HiDPI support</td> </tr> <tr> <td><a href="https://bugs.openjdk.java.net/browse/JDK-8045490">JDK-8045490</a></td> <td>Custom cursor HiDPI support</td> </tr> <tr> <td><a href="https://bugs.openjdk.java.net/browse/JDK-8045489">JDK-8045489</a></td> <td>[macosx] Support automatic @2x images loading on Mac OS X</td> </tr> <tr> <td><a href="https://bugs.openjdk.java.net/browse/JDK-8045488">JDK-8045488</a></td> <td>Robot moves mouse to point which differs from set in mouseMove on Unity shell</td> </tr> <tr> <td><a href="https://bugs.openjdk.java.net/browse/JDK-8045487">JDK-8045487</a></td> <td>java/lang/management/ThreadMXBean/Locks.java: Thread WaitingThread is expected to wait on Object but got null Thread.State = RUNNABLE</td> </tr> <tr> <td><a href="https://bugs.openjdk.java.net/browse/JDK-8045485">JDK-8045485</a></td> <td>[pack200] should support the new zip64 format.</td> </tr> <tr> <td><a href="https://bugs.openjdk.java.net/browse/JDK-8045483">JDK-8045483</a></td> <td>Collections.sort(List l, Comparator) should defer to List.sort(Comparator )</td> </tr> <tr> <td><a href="https://bugs.openjdk.java.net/browse/JDK-8045482">JDK-8045482</a></td> <td>java.exe consumes argument intended for launched java class</td> </tr> <tr> <td><a href="https://bugs.openjdk.java.net/browse/JDK-8045479">JDK-8045479</a></td> <td>javax/management/monitor/StartStopTest.java fails intermittently</td> </tr> <tr> <td><a href="https://bugs.openjdk.java.net/browse/JDK-8045478">JDK-8045478</a></td> <td>Intermittent test failures in sun/management/jmxremote/startstop/JMXStartStopTest.sh</td> </tr> <tr> <td><a href="https://bugs.openjdk.java.net/browse/JDK-8045477">JDK-8045477</a></td> <td>java/lang/management/ThreadMXBean/ThreadBlockedCount.java fails intermittently again</td> </tr> <tr> <td><a href="https://bugs.openjdk.java.net/browse/JDK-8045476">JDK-8045476</a></td> <td>sun/management/jmxremote/bootstrap/CustomLauncherTest.java fails on some platforms: Unable to locate 'libjvm.so'</td> </tr> <tr> <td><a href="https://bugs.openjdk.java.net/browse/JDK-8045474">JDK-8045474</a></td> <td>java/lang/management/ThreadMXBean/ThreadBlockedCount.java fails: Blocked thread has 4 blocked counts. Expected 3</td> </tr> <tr> <td><a href="https://bugs.openjdk.java.net/browse/JDK-8045473">JDK-8045473</a></td> <td>Logger created in test/tools/jar/UpdateManifest.java might get gc'ed too early.</td> </tr> <tr> <td><a href="https://bugs.openjdk.java.net/browse/JDK-8045472">JDK-8045472</a></td> <td>java/util/logging/ParentLoggersTest.java: checkLoggers: getLoggerNames() returned unexpected loggers</td> </tr> <tr> <td><a href="https://bugs.openjdk.java.net/browse/JDK-8045471">JDK-8045471</a></td> <td>Add new j.u.l deadlock test for JDK-8027670 and JDK-8029281</td> </tr> <tr> <td><a href="https://bugs.openjdk.java.net/browse/JDK-8045470">JDK-8045470</a></td> <td>Htmleditorkit parser doesn't handle leading slash (/)</td> </tr> <tr> <td><a href="https://bugs.openjdk.java.net/browse/JDK-8045469">JDK-8045469</a></td> <td>Some messages in jconsole in 7u40 (and later) aren't displayed correctly</td> </tr> <tr> <td><a href="https://bugs.openjdk.java.net/browse/JDK-8045468">JDK-8045468</a></td> <td>TEST_BUG: java/util/logging/Logger/setResourceBundle/TestSetResourceBundle.java failing again</td> </tr> <tr> <td><a href="https://bugs.openjdk.java.net/browse/JDK-8045467">JDK-8045467</a></td> <td>TEST_BUG: java/util/logging/TestLoggerBundleSync.java failed with NPE</td> </tr> <tr> <td><a href="https://bugs.openjdk.java.net/browse/JDK-8045466">JDK-8045466</a></td> <td>Updates to ProblemList.txt after same-binaries run</td> </tr> <tr> <td><a href="https://bugs.openjdk.java.net/browse/JDK-8045465">JDK-8045465</a></td> <td>[TEST_BUG] regression test failure, SSLEngineBadBufferArrayAccess.java</td> </tr> <tr> <td><a href="https://bugs.openjdk.java.net/browse/JDK-8045464">JDK-8045464</a></td> <td>Allow multiple calls to DropTargetDropEvent.acceptDrop()</td> </tr> <tr> <td><a href="https://bugs.openjdk.java.net/browse/JDK-8045463">JDK-8045463</a></td> <td>JNI use results in UnsatisfiedLinkError looking for libmawt.so</td> </tr> <tr> <td><a href="https://bugs.openjdk.java.net/browse/JDK-8045462">JDK-8045462</a></td> <td>Test compiler/7184394/TestAESMain.java gets NPE on solaris</td> </tr> <tr> <td><a href="https://bugs.openjdk.java.net/browse/JDK-8045461">JDK-8045461</a></td> <td>C1: Old value instead of new one is passed to post-barrier in UnsafeGetAndSetObject</td> </tr> <tr> <td><a href="https://bugs.openjdk.java.net/browse/JDK-8045460">JDK-8045460</a></td> <td>Hotspot is expected to report OOM which is occurred String.intern(), but crashes in JDK8u5</td> </tr> <tr> <td><a href="https://bugs.openjdk.java.net/browse/JDK-8045459">JDK-8045459</a></td> <td>G1: Phantom zeros in cardtable</td> </tr> <tr> <td><a href="https://bugs.openjdk.java.net/browse/JDK-8045458">JDK-8045458</a></td> <td>G1: Concurrent mark stuck in loop calling os::elapsedVTime()</td> </tr> <tr> <td><a href="https://bugs.openjdk.java.net/browse/JDK-8045457">JDK-8045457</a></td> <td>G1: Concurrent mark hangs when mark stack overflows</td> </tr> <tr> <td><a href="https://bugs.openjdk.java.net/browse/JDK-8045456">JDK-8045456</a></td> <td>G1: VM hangs during shutdown</td> </tr> <tr> <td><a href="https://bugs.openjdk.java.net/browse/JDK-8045455">JDK-8045455</a></td> <td>gc/g1/TestHumongousAllocInitialMark.java caused SIGSEGV</td> </tr> <tr> <td><a href="https://bugs.openjdk.java.net/browse/JDK-8045454">JDK-8045454</a></td> <td>Overflow in java.lang.instrument.Instrumentation.getObjectSize() method</td> </tr> <tr> <td><a href="https://bugs.openjdk.java.net/browse/JDK-8045453">JDK-8045453</a></td> <td>Missing oopmap in patching stubs</td> </tr> <tr> <td><a href="https://bugs.openjdk.java.net/browse/JDK-8045452">JDK-8045452</a></td> <td>new hotspot build - hs25.20-b17</td> </tr> <tr> <td><a href="https://bugs.openjdk.java.net/browse/JDK-8045451">JDK-8045451</a></td> <td>Increment hsx 25.11 build to b03 for 8u11-b11</td> </tr> <tr> <td><a href="https://bugs.openjdk.java.net/browse/JDK-8045450">JDK-8045450</a></td> <td>Various fixes to linux/sparc</td> </tr> <tr> <td><a href="https://bugs.openjdk.java.net/browse/JDK-8045448">JDK-8045448</a></td> <td>Format warning in traceStream.hpp</td> </tr> <tr> <td><a href="https://bugs.openjdk.java.net/browse/JDK-8045447">JDK-8045447</a></td> <td>Change 8037816 breaks HS build with older GCC versions which don't support diagnostic pragmas</td> </tr> <tr> <td><a href="https://bugs.openjdk.java.net/browse/JDK-8045446">JDK-8045446</a></td> <td>Fix for 8036122 breaks build with Xcode5/clang</td> </tr> <tr> <td><a href="https://bugs.openjdk.java.net/browse/JDK-8045445">JDK-8045445</a></td> <td>Proper fix for 8032566</td> </tr> <tr> <td><a href="https://bugs.openjdk.java.net/browse/JDK-8045443">JDK-8045443</a></td> <td>BootstrapMethods attribute cannot be empty</td> </tr> <tr> <td><a href="https://bugs.openjdk.java.net/browse/JDK-8045442">JDK-8045442</a></td> <td>+UnlockExperimentalVMOptions missed from TestUseRTMLockingOptionOnUnsupportedVM.java test</td> </tr> <tr> <td><a href="https://bugs.openjdk.java.net/browse/JDK-8045440">JDK-8045440</a></td> <td>new hotspot build - hs25.20-b16</td> </tr> <tr> <td><a href="https://bugs.openjdk.java.net/browse/JDK-8045439">JDK-8045439</a></td> <td>JVM crashes with collect_args_for_profiling</td> </tr> <tr> <td><a href="https://bugs.openjdk.java.net/browse/JDK-8045438">JDK-8045438</a></td> <td>System.nanoTime() is slow and non-monotonic on OS X</td> </tr> <tr> <td><a href="https://bugs.openjdk.java.net/browse/JDK-8045437">JDK-8045437</a></td> <td>assert(t != NULL) failed: must set before get</td> </tr> <tr> <td><a href="https://bugs.openjdk.java.net/browse/JDK-8045436">JDK-8045436</a></td> <td>Performance regression in Math.pow intrinsic</td> </tr> <tr> <td><a href="https://bugs.openjdk.java.net/browse/JDK-8045435">JDK-8045435</a></td> <td>new hotspot build - hs25.20-b15</td> </tr> <tr> <td><a href="https://bugs.openjdk.java.net/browse/JDK-8045434">JDK-8045434</a></td> <td>Some bugfixes for the ppc64 port.</td> </tr> <tr> <td><a href="https://bugs.openjdk.java.net/browse/JDK-8045433">JDK-8045433</a></td> <td>Event Based tracing ids to be reassigned for CDS klasses</td> </tr> <tr> <td><a href="https://bugs.openjdk.java.net/browse/JDK-8045432">JDK-8045432</a></td> <td>dtrace/jsdt tests crash on solaris. found an unadvertised bad scavengable oop in the code cache</td> </tr> <tr> <td><a href="https://bugs.openjdk.java.net/browse/JDK-8045431">JDK-8045431</a></td> <td>C2: assert(base == NULL || t_adr->isa_rawptr() || !phase->type(base)->higher_equal(TypePtr::NULL_PTR)) failed: NULL+offs not RAW address?</td> </tr> <tr> <td><a href="https://bugs.openjdk.java.net/browse/JDK-8045430">JDK-8045430</a></td> <td>-XX:UseAVX=0 cause assert(UseAVX) failed</td> </tr> <tr> <td><a href="https://bugs.openjdk.java.net/browse/JDK-8045429">JDK-8045429</a></td> <td>Skip replay parsing errors with ReplayIgnoreInitErrors</td> </tr> <tr> <td><a href="https://bugs.openjdk.java.net/browse/JDK-8045428">JDK-8045428</a></td> <td>compiler/7184394/TestAESMain.java fails with: javax.crypto.IllegalBlockSizeException: Input length not multiple of 16 bytes</td> </tr> <tr> <td><a href="https://bugs.openjdk.java.net/browse/JDK-8045427">JDK-8045427</a></td> <td>SIGBUS in StubRoutines::aesencryptBlock, solaris-sparc</td> </tr> <tr> <td><a href="https://bugs.openjdk.java.net/browse/JDK-8045426">JDK-8045426</a></td> <td>new hotspot build - hs25.20-b14</td> </tr> <tr> <td><a href="https://bugs.openjdk.java.net/browse/JDK-8045425">JDK-8045425</a></td> <td>CICompilerCount is not updated when the number of compiler threads is adjusted to the number of CPUs</td> </tr> <tr> <td><a href="https://bugs.openjdk.java.net/browse/JDK-8045424">JDK-8045424</a></td> <td>new hotspot build - hs25.20-b13</td> </tr> <tr> <td><a href="https://bugs.openjdk.java.net/browse/JDK-8045423">JDK-8045423</a></td> <td>SIGSEGV in MethodData::next_data(ProfileData*)</td> </tr> <tr> <td><a href="https://bugs.openjdk.java.net/browse/JDK-8045422">JDK-8045422</a></td> <td>NewSize ergonomics wrong when setting small or unaligned size on command line</td> </tr> <tr> <td><a href="https://bugs.openjdk.java.net/browse/JDK-8045421">JDK-8045421</a></td> <td>Scale initial NewSize using NewRatio if not set on command line</td> </tr> <tr> <td><a href="https://bugs.openjdk.java.net/browse/JDK-8045420">JDK-8045420</a></td> <td>Compilation of compiler/rtm/cli/TestUseRTMDeoptOption* tests failed</td> </tr> <tr> <td><a href="https://bugs.openjdk.java.net/browse/JDK-8045419">JDK-8045419</a></td> <td>Crash in src/share/vm/opto/loopnode.cpp:3215 - assert(!had_error) failed: bad dominance</td> </tr> <tr> <td><a href="https://bugs.openjdk.java.net/browse/JDK-8045418">JDK-8045418</a></td> <td>assert(null_obj->escape_state() == PointsToNode::NoEscape,etc) runThese -full</td> </tr> <tr> <td><a href="https://bugs.openjdk.java.net/browse/JDK-8045417">JDK-8045417</a></td> <td>new hotspot build - hs25.20-b12</td> </tr> <tr> <td><a href="https://bugs.openjdk.java.net/browse/JDK-8045416">JDK-8045416</a></td> <td>invokestatic: IncompatibleClassChangeError trying to invoke static method from a parent in presence of conflicting defaults</td> </tr> <tr> <td><a href="https://bugs.openjdk.java.net/browse/JDK-8045414">JDK-8045414</a></td> <td>Crash in C2 compiler at Node::rematerialize</td> </tr> <tr> <td><a href="https://bugs.openjdk.java.net/browse/JDK-8045412">JDK-8045412</a></td> <td>dtrace/hotspot/Monitors/Monitors001 fails with "assert(s > 0) failed: Bad size calculated"</td> </tr> <tr> <td><a href="https://bugs.openjdk.java.net/browse/JDK-8045411">JDK-8045411</a></td> <td>SIGSEGV at ClassLoaderData::oops_do(OopClosure*, KlassClosure*, bool)</td> </tr> <tr> <td><a href="https://bugs.openjdk.java.net/browse/JDK-8045410">JDK-8045410</a></td> <td>CLI test on RTMRetryCount option was missed from fix for 8039496 </td> </tr> <tr> <td><a href="https://bugs.openjdk.java.net/browse/JDK-8045409">JDK-8045409</a></td> <td>New tests development for type profiling and speculation</td> </tr> <tr> <td><a href="https://bugs.openjdk.java.net/browse/JDK-8045408">JDK-8045408</a></td> <td>[TESTBUG] runtime/ClassFileUnsupportedClassFileVersion.java unable to find or load main class</td> </tr> <tr> <td><a href="https://bugs.openjdk.java.net/browse/JDK-8045407">JDK-8045407</a></td> <td>Improve UnsupportedClassVersionError message</td> </tr> <tr> <td><a href="https://bugs.openjdk.java.net/browse/JDK-8045406">JDK-8045406</a></td> <td>Avoid placing CTI immediately following cbcond instruction on T4</td> </tr> <tr> <td><a href="https://bugs.openjdk.java.net/browse/JDK-8045404">JDK-8045404</a></td> <td>Remove ppcsflt builds from JPRT</td> </tr> <tr> <td><a href="https://bugs.openjdk.java.net/browse/JDK-8045403">JDK-8045403</a></td> <td>Add tests to cover Intel RTM instructions support</td> </tr> <tr> <td><a href="https://bugs.openjdk.java.net/browse/JDK-8045402">JDK-8045402</a></td> <td>Add sanity tests on RTM-related command line options</td> </tr> <tr> <td><a href="https://bugs.openjdk.java.net/browse/JDK-8045401">JDK-8045401</a></td> <td>Add all common classes used by tests on RTM support to testlibrary</td> </tr> <tr> <td><a href="https://bugs.openjdk.java.net/browse/JDK-8045400">JDK-8045400</a></td> <td>Testlibrary should be updated to provide information about all VM types as well as access to Unsafe</td> </tr> <tr> <td><a href="https://bugs.openjdk.java.net/browse/JDK-8045399">JDK-8045399</a></td> <td>Make IsMethodCompilable test work with tiered</td> </tr> <tr> <td><a href="https://bugs.openjdk.java.net/browse/JDK-8045398">JDK-8045398</a></td> <td>Add sanity tests for BMI1 and LZCNT instructions</td> </tr> <tr> <td><a href="https://bugs.openjdk.java.net/browse/JDK-8045397">JDK-8045397</a></td> <td>WhiteBox :: clean type profiling data</td> </tr> <tr> <td><a href="https://bugs.openjdk.java.net/browse/JDK-8045396">JDK-8045396</a></td> <td>Remove prefix allocated_ from methods and variables in Metaspace</td> </tr> <tr> <td><a href="https://bugs.openjdk.java.net/browse/JDK-8045395">JDK-8045395</a></td> <td>EventMetaspaceSummary doesn't report committed Metaspace memory</td> </tr> <tr> <td><a href="https://bugs.openjdk.java.net/browse/JDK-8045394">JDK-8045394</a></td> <td>new hotspot build - hs25.20-b11</td> </tr> <tr> <td><a href="https://bugs.openjdk.java.net/browse/JDK-8045393">JDK-8045393</a></td> <td>Fix 64-bit store to int JNIHandleBlock::_top</td> </tr> <tr> <td><a href="https://bugs.openjdk.java.net/browse/JDK-8045392">JDK-8045392</a></td> <td>Some options related to RTM locking optimization works inconsistently</td> </tr> <tr> <td><a href="https://bugs.openjdk.java.net/browse/JDK-8045391">JDK-8045391</a></td> <td>Clean up misleading usage of malloc() in init_system_properties_values()</td> </tr> <tr> <td><a href="https://bugs.openjdk.java.net/browse/JDK-8045389">JDK-8045389</a></td> <td>"assert(thread != NULL) failed: just checking" due to Thread::current() and JNI pthread interaction</td> </tr> <tr> <td><a href="https://bugs.openjdk.java.net/browse/JDK-8045388">JDK-8045388</a></td> <td>Change type of the number of GC workers to unsigned int (2)</td> </tr> <tr> <td><a href="https://bugs.openjdk.java.net/browse/JDK-8045387">JDK-8045387</a></td> <td>Shark: add LLVM 3.4 support</td> </tr> <tr> <td><a href="https://bugs.openjdk.java.net/browse/JDK-8045386">JDK-8045386</a></td> <td>Make jdk8u20 the default jprt release for hs25.20</td> </tr> <tr> <td><a href="https://bugs.openjdk.java.net/browse/JDK-8045385">JDK-8045385</a></td> <td>List verification enabled in product builds</td> </tr> <tr> <td><a href="https://bugs.openjdk.java.net/browse/JDK-8045383">JDK-8045383</a></td> <td>hs_err improvement: Print elapsed time in a humanly readable format</td> </tr> <tr> <td><a href="https://bugs.openjdk.java.net/browse/JDK-8045382">JDK-8045382</a></td> <td>new hotspot build - hs25.20-b10</td> </tr> <tr> <td><a href="https://bugs.openjdk.java.net/browse/JDK-8045381">JDK-8045381</a></td> <td>VM warning: increase O_BUFLEN in ostream.hpp -- output truncated occurs with fastdebug VM when printing flags</td> </tr> <tr> <td><a href="https://bugs.openjdk.java.net/browse/JDK-8045380">JDK-8045380</a></td> <td>Fix includes and C inlining after 8035330</td> </tr> <tr> <td><a href="https://bugs.openjdk.java.net/browse/JDK-8045379">JDK-8045379</a></td> <td>Implicit null check is in the wrong place in C1 -UseCompressedOops</td> </tr> <tr> <td><a href="https://bugs.openjdk.java.net/browse/JDK-8045378">JDK-8045378</a></td> <td>crash in VM_Version::get_processor_features() on startup</td> </tr> <tr> <td><a href="https://bugs.openjdk.java.net/browse/JDK-8045377">JDK-8045377</a></td> <td>jvm.lib is missing from export list unless building server</td> </tr> <tr> <td><a href="https://bugs.openjdk.java.net/browse/JDK-8045376">JDK-8045376</a></td> <td>gclog rotation via external tool</td> </tr> <tr> <td><a href="https://bugs.openjdk.java.net/browse/JDK-8045375">JDK-8045375</a></td> <td>new hotspot build - hs25.20-b09</td> </tr> <tr> <td><a href="https://bugs.openjdk.java.net/browse/JDK-8045374">JDK-8045374</a></td> <td>Turn on @Stable support in VM</td> </tr> <tr> <td><a href="https://bugs.openjdk.java.net/browse/JDK-8045373">JDK-8045373</a></td> <td>VM crashes trying to force inlining the recursive call</td> </tr> <tr> <td><a href="https://bugs.openjdk.java.net/browse/JDK-8045372">JDK-8045372</a></td> <td>"assert(adr->is_AddP() && adr->in(AddPNode::Offset)->is_Con()) failed: offset is a constant" with FoldStableValues on</td> </tr> <tr> <td><a href="https://bugs.openjdk.java.net/browse/JDK-8045371">JDK-8045371</a></td> <td>new WB API to get nmethod</td> </tr> <tr> <td><a href="https://bugs.openjdk.java.net/browse/JDK-8045370">JDK-8045370</a></td> <td>Add command line option tests for BMI options</td> </tr> <tr> <td><a href="https://bugs.openjdk.java.net/browse/JDK-8045369">JDK-8045369</a></td> <td>rollback changes in make/jprt.properties for embedded testing</td> </tr> <tr> <td><a href="https://bugs.openjdk.java.net/browse/JDK-8045368">JDK-8045368</a></td> <td>PPC64: fix ad file after 8027754: Enable loop optimizations for loops with MathExact inside </td> </tr> <tr> <td><a href="https://bugs.openjdk.java.net/browse/JDK-8045367">JDK-8045367</a></td> <td>Introduce accessor for tmp_oop in frame.</td> </tr> <tr> <td><a href="https://bugs.openjdk.java.net/browse/JDK-8045366">JDK-8045366</a></td> <td>AIX: Fix os::naked_short_sleep() in os_aix.cpp after 8028280</td> </tr> <tr> <td><a href="https://bugs.openjdk.java.net/browse/JDK-8045365">JDK-8045365</a></td> <td>Account for trampoline stubs when estimating code buffer sizes</td> </tr> <tr> <td><a href="https://bugs.openjdk.java.net/browse/JDK-8045364">JDK-8045364</a></td> <td>Workaround for ccache in vm.make is missing for aix</td> </tr> <tr> <td><a href="https://bugs.openjdk.java.net/browse/JDK-8045363">JDK-8045363</a></td> <td>PPC64/AIX: Several smaller fixes</td> </tr> <tr> <td><a href="https://bugs.openjdk.java.net/browse/JDK-8045362">JDK-8045362</a></td> <td>AIX: Fix os::get_default_process_handle() in os_aix.cpp after 8031968</td> </tr> <tr> <td><a href="https://bugs.openjdk.java.net/browse/JDK-8045361">JDK-8045361</a></td> <td>PPC64: implement the template interpreter</td> </tr> <tr> <td><a href="https://bugs.openjdk.java.net/browse/JDK-8045360">JDK-8045360</a></td> <td>PPC64: Support for elf v2 abi.</td> </tr> <tr> <td><a href="https://bugs.openjdk.java.net/browse/JDK-8045359">JDK-8045359</a></td> <td>PPC64: Make usage of intrinsic dsqrt depend on processor recognition.</td> </tr> <tr> <td><a href="https://bugs.openjdk.java.net/browse/JDK-8045358">JDK-8045358</a></td> <td>cppInterpreter: fix message of NPE</td> </tr> <tr> <td><a href="https://bugs.openjdk.java.net/browse/JDK-8045357">JDK-8045357</a></td> <td>PPC64: Adapt to 8002074: Support for AES on SPARC</td> </tr> <tr> <td><a href="https://bugs.openjdk.java.net/browse/JDK-8045356">JDK-8045356</a></td> <td>PPC64: gcc 4.8 warning in output_c.cpp</td> </tr> <tr> <td><a href="https://bugs.openjdk.java.net/browse/JDK-8045355">JDK-8045355</a></td> <td>Add #ifdef PPC64 around OrderAccess operations on _thread_state.</td> </tr> <tr> <td><a href="https://bugs.openjdk.java.net/browse/JDK-8045354">JDK-8045354</a></td> <td>PPC64 (part 211): ordering of Independent Reads of Independent Writes</td> </tr> <tr> <td><a href="https://bugs.openjdk.java.net/browse/JDK-8045353">JDK-8045353</a></td> <td>PPC64: Some fixes in ppc and aix coding.</td> </tr> <tr> <td><a href="https://bugs.openjdk.java.net/browse/JDK-8045352">JDK-8045352</a></td> <td>Fix for 8029015: PPC64 (part 216): opto: trap based null and range checks</td> </tr> <tr> <td><a href="https://bugs.openjdk.java.net/browse/JDK-8045351">JDK-8045351</a></td> <td>PPC64: (part 220): ConstantTableBase for calls between args and jvms</td> </tr> <tr> <td><a href="https://bugs.openjdk.java.net/browse/JDK-8045350">JDK-8045350</a></td> <td>PPC64 (part 213): cppInterpreter: memory ordering for object initialization</td> </tr> <tr> <td><a href="https://bugs.openjdk.java.net/browse/JDK-8045349">JDK-8045349</a></td> <td>PPC64 (part 122): C2 compiler port</td> </tr> <tr> <td><a href="https://bugs.openjdk.java.net/browse/JDK-8045348">JDK-8045348</a></td> <td>PPC64: (part 219): adl replacement variable CondRegister</td> </tr> <tr> <td><a href="https://bugs.openjdk.java.net/browse/JDK-8045347">JDK-8045347</a></td> <td>PPC64 (part 212): Several memory ordering fixes in C-code.</td> </tr> <tr> <td><a href="https://bugs.openjdk.java.net/browse/JDK-8045346">JDK-8045346</a></td> <td>PPC64 (part 107): Extend ELF-decoder to support PPC64 function descriptor tables</td> </tr> <tr> <td><a href="https://bugs.openjdk.java.net/browse/JDK-8045345">JDK-8045345</a></td> <td>PPC64 (part 216): opto: trap based null and range checks</td> </tr> <tr> <td><a href="https://bugs.openjdk.java.net/browse/JDK-8045344">JDK-8045344</a></td> <td>PPC64 (part 113.2): opto: Introduce LoadFence/StoreFence.</td> </tr> <tr> <td><a href="https://bugs.openjdk.java.net/browse/JDK-8045343">JDK-8045343</a></td> <td>PPC64 (part 203): opto: Move static _in_dump_cnt to Compile object.</td> </tr> <tr> <td><a href="https://bugs.openjdk.java.net/browse/JDK-8045342">JDK-8045342</a></td> <td>PPC64: (part 121): smaller shared changes needed to build C2</td> </tr> <tr> <td><a href="https://bugs.openjdk.java.net/browse/JDK-8045341">JDK-8045341</a></td> <td>PPC64 (part 215): opto: Extend ImplicitNullCheck optimization.</td> </tr> <tr> <td><a href="https://bugs.openjdk.java.net/browse/JDK-8045340">JDK-8045340</a></td> <td>PPC64 (part 114/120): Support for Call nodes with constants.</td> </tr> <tr> <td><a href="https://bugs.openjdk.java.net/browse/JDK-8045339">JDK-8045339</a></td> <td>PPC64: Fix C++ Interpreter after '7195622: CheckUnhandledOops has limited usefulness now'</td> </tr> <tr> <td><a href="https://bugs.openjdk.java.net/browse/JDK-8045338">JDK-8045338</a></td> <td>PPC64 (part 214): linux: extend signal handler to catch SIGTRAP on ppc64.</td> </tr> <tr> <td><a href="https://bugs.openjdk.java.net/browse/JDK-8045337">JDK-8045337</a></td> <td>PPC64 (part 117): Improve usability of adlc and format() functionality.</td> </tr> <tr> <td><a href="https://bugs.openjdk.java.net/browse/JDK-8045336">JDK-8045336</a></td> <td>PPC64 (part 113): Extend Load and Store nodes to know about memory ordering.</td> </tr> <tr> <td><a href="https://bugs.openjdk.java.net/browse/JDK-8045335">JDK-8045335</a></td> <td>PPC64 (part 115): expand nodes after register allocation</td> </tr> <tr> <td><a href="https://bugs.openjdk.java.net/browse/JDK-8045334">JDK-8045334</a></td> <td>Adapt PPC to 8024927: Nashorn performance regression with CompressedOops</td> </tr> <tr> <td><a href="https://bugs.openjdk.java.net/browse/JDK-8045333">JDK-8045333</a></td> <td>Adapt PPC to 8026328: Setting a breakpoint on invokedynamic crashes the JVM</td> </tr> <tr> <td><a href="https://bugs.openjdk.java.net/browse/JDK-8045332">JDK-8045332</a></td> <td>Adapt PPC to 8023657: New type profiling points: arguments to call</td> </tr> <tr> <td><a href="https://bugs.openjdk.java.net/browse/JDK-8045331">JDK-8045331</a></td> <td>Adapt PPC to 8015107: NPG: Use consistent naming for metaspace concepts</td> </tr> <tr> <td><a href="https://bugs.openjdk.java.net/browse/JDK-8045330">JDK-8045330</a></td> <td>Adapt PPC to 6843347: Boundary values in some public GC options cause crashes</td> </tr> <tr> <td><a href="https://bugs.openjdk.java.net/browse/JDK-8045329">JDK-8045329</a></td> <td>PPC64: Implement 'os::fork_and_exec' on AIX</td> </tr> <tr> <td><a href="https://bugs.openjdk.java.net/browse/JDK-8045328">JDK-8045328</a></td> <td>PPC64 (part 201): cppInterpreter: implement bytecode profiling</td> </tr> <tr> <td><a href="https://bugs.openjdk.java.net/browse/JDK-8045327">JDK-8045327</a></td> <td>PPC64 (part 116): Extend adlc to generate fields into nodes.</td> </tr> <tr> <td><a href="https://bugs.openjdk.java.net/browse/JDK-8045326">JDK-8045326</a></td> <td>PPC64 (part 111): Support for C calling conventions that require 64-bit ints.</td> </tr> <tr> <td><a href="https://bugs.openjdk.java.net/browse/JDK-8045325">JDK-8045325</a></td> <td>PPC64 (part 202): cppInterpreter: support for OSR.</td> </tr> <tr> <td><a href="https://bugs.openjdk.java.net/browse/JDK-8045324">JDK-8045324</a></td> <td>PPC64 (part 112): C argument in register AND stack slot.</td> </tr> <tr> <td><a href="https://bugs.openjdk.java.net/browse/JDK-8045323">JDK-8045323</a></td> <td>PPC64 (part 15): Platform files for AIX/PPC64 support</td> </tr> <tr> <td><a href="https://bugs.openjdk.java.net/browse/JDK-8045322">JDK-8045322</a></td> <td>PPC64 (part 14): Implement AIX/PPC64 support in HotSpot makefiles</td> </tr> <tr> <td><a href="https://bugs.openjdk.java.net/browse/JDK-8045321">JDK-8045321</a></td> <td>PPC64: Adapt PPC64 port to 8003424</td> </tr> <tr> <td><a href="https://bugs.openjdk.java.net/browse/JDK-8045320">JDK-8045320</a></td> <td>PPC64 (part 13): Basic shared changes for AIX</td> </tr> <tr> <td><a href="https://bugs.openjdk.java.net/browse/JDK-8045319">JDK-8045319</a></td> <td>PPC64 (part 12): posix signal printing</td> </tr> <tr> <td><a href="https://bugs.openjdk.java.net/browse/JDK-8045318">JDK-8045318</a></td> <td>PPC64 (part 9): platform files for interpreter only VM</td> </tr> <tr> <td><a href="https://bugs.openjdk.java.net/browse/JDK-8045317">JDK-8045317</a></td> <td>PPC64 (part 106): Make hsdis build and work on Linux/PPC64</td> </tr> <tr> <td><a href="https://bugs.openjdk.java.net/browse/JDK-8045316">JDK-8045316</a></td> <td>PPC64 (part 11): Fix IA64 preprocessor conditionals on AIX.</td> </tr> <tr> <td><a href="https://bugs.openjdk.java.net/browse/JDK-8045315">JDK-8045315</a></td> <td>PPC64 (part 8): Implement Linux/PPC64 support in HotSpot makefiles</td> </tr> <tr> <td><a href="https://bugs.openjdk.java.net/browse/JDK-8045314">JDK-8045314</a></td> <td>PPC64 (part 105-2): fix build in cppInterpreter after 8019519</td> </tr> <tr> <td><a href="https://bugs.openjdk.java.net/browse/JDK-8045313">JDK-8045313</a></td> <td>PPC64 (part 105): cppInterpreter: implement support for early return</td> </tr> <tr> <td><a href="https://bugs.openjdk.java.net/browse/JDK-8045312">JDK-8045312</a></td> <td>PPC64 (part 104) : cppInterpreter: implement support for compressed Oops</td> </tr> <tr> <td><a href="https://bugs.openjdk.java.net/browse/JDK-8045311">JDK-8045311</a></td> <td>PPC64 (part 102): cppInterpreter: implement G1 support</td> </tr> <tr> <td><a href="https://bugs.openjdk.java.net/browse/JDK-8045310">JDK-8045310</a></td> <td>PPC64 (part 4): add relocation for trampoline stubs </td> </tr> <tr> <td><a href="https://bugs.openjdk.java.net/browse/JDK-8045309">JDK-8045309</a></td> <td>PPC64 (part 7): cppInterpreter: implement support for biased locking</td> </tr> <tr> <td><a href="https://bugs.openjdk.java.net/browse/JDK-8045308">JDK-8045308</a></td> <td>PPC64 (part 6): stack handling improvements</td> </tr> <tr> <td><a href="https://bugs.openjdk.java.net/browse/JDK-8045307">JDK-8045307</a></td> <td>PPC64 (part 3): basic changes for PPC64</td> </tr> <tr> <td><a href="https://bugs.openjdk.java.net/browse/JDK-8045306">JDK-8045306</a></td> <td>PPC64 (part 2): Clean up PPC defines.</td> </tr> <tr> <td><a href="https://bugs.openjdk.java.net/browse/JDK-8045305">JDK-8045305</a></td> <td>PPC64 (part 1): reenable CORE build</td> </tr> <tr> <td><a href="https://bugs.openjdk.java.net/browse/JDK-8045302">JDK-8045302</a></td> <td>update 8u fix for 8028073 now that 8028280 is backported to 8u</td> </tr> <tr> <td><a href="https://bugs.openjdk.java.net/browse/JDK-8045301">JDK-8045301</a></td> <td>Assembler::bsrl fails on assert when -UseCountLeadingZerosInstruction is used on CPU with LZCNT support</td> </tr> <tr> <td><a href="https://bugs.openjdk.java.net/browse/JDK-8045300">JDK-8045300</a></td> <td>nm->set_rtm_state() should be called after (nm != NULL) check</td> </tr> <tr> <td><a href="https://bugs.openjdk.java.net/browse/JDK-8045299">JDK-8045299</a></td> <td>Can't build product VM without precompiled header</td> </tr> <tr> <td><a href="https://bugs.openjdk.java.net/browse/JDK-8045298">JDK-8045298</a></td> <td>Use Intel RTM instructions for locks</td> </tr> <tr> <td><a href="https://bugs.openjdk.java.net/browse/JDK-8045297">JDK-8045297</a></td> <td>metaspaceTracer.cpp misses a symbol</td> </tr> <tr> <td><a href="https://bugs.openjdk.java.net/browse/JDK-8045296">JDK-8045296</a></td> <td>Add tests to verify correctness of operations with BMI1 and LZCNT instructions</td> </tr> <tr> <td><a href="https://bugs.openjdk.java.net/browse/JDK-8045295">JDK-8045295</a></td> <td>C2 intrinsic for Unsafe.getAddress performs pointer sign extension on 32-bit systems</td> </tr> <tr> <td><a href="https://bugs.openjdk.java.net/browse/JDK-8045294">JDK-8045294</a></td> <td>Sort the freelist in order to shrink the heap</td> </tr> <tr> <td><a href="https://bugs.openjdk.java.net/browse/JDK-8045293">JDK-8045293</a></td> <td>Add trace event with statistics for the metaspace chunk free lists</td> </tr> <tr> <td><a href="https://bugs.openjdk.java.net/browse/JDK-8045292">JDK-8045292</a></td> <td>Add trace event when a metaspace throws out of memory error</td> </tr> <tr> <td><a href="https://bugs.openjdk.java.net/browse/JDK-8045291">JDK-8045291</a></td> <td>Add trace event when a metaspace allocation fails</td> </tr> <tr> <td><a href="https://bugs.openjdk.java.net/browse/JDK-8045290">JDK-8045290</a></td> <td>Add trace event for updates to metaspace gc threshold</td> </tr> <tr> <td><a href="https://bugs.openjdk.java.net/browse/JDK-8045289">JDK-8045289</a></td> <td>Add metaspace gc threshold to metaspace summary trace event</td> </tr> <tr> <td><a href="https://bugs.openjdk.java.net/browse/JDK-8045288">JDK-8045288</a></td> <td>Several nightly tests failing with assert(imin < imax) failed: Unexpected page size</td> </tr> <tr> <td><a href="https://bugs.openjdk.java.net/browse/JDK-8045286">JDK-8045286</a></td> <td>String deduplication in G1</td> </tr> <tr> <td><a href="https://bugs.openjdk.java.net/browse/JDK-8045283">JDK-8045283</a></td> <td>Pad and cache-align the BiasedMappedArray</td> </tr> <tr> <td><a href="https://bugs.openjdk.java.net/browse/JDK-8045282">JDK-8045282</a></td> <td>Remove G1ParScanPartialArrayClosure and G1ParScanHeapEvacClosure</td> </tr> <tr> <td><a href="https://bugs.openjdk.java.net/browse/JDK-8045281">JDK-8045281</a></td> <td>Extract G1 From Card Cache into separate class</td> </tr> <tr> <td><a href="https://bugs.openjdk.java.net/browse/JDK-8045280">JDK-8045280</a></td> <td>Add times for evacuation failure handling in "Other" time</td> </tr> <tr> <td><a href="https://bugs.openjdk.java.net/browse/JDK-8045279">JDK-8045279</a></td> <td>Add card redirty time in "Other" time in G1</td> </tr> <tr> <td><a href="https://bugs.openjdk.java.net/browse/JDK-8045278">JDK-8045278</a></td> <td>Free CSet takes ~50% of young pause time</td> </tr> <tr> <td><a href="https://bugs.openjdk.java.net/browse/JDK-8045277">JDK-8045277</a></td> <td>Cache-align and pad the from card cache</td> </tr> <tr> <td><a href="https://bugs.openjdk.java.net/browse/JDK-8045276">JDK-8045276</a></td> <td>Improve data structure for Code Cache remembered sets</td> </tr> <tr> <td><a href="https://bugs.openjdk.java.net/browse/JDK-8045274">JDK-8045274</a></td> <td>G1: Abort weak reference processing if mark stack overflows</td> </tr> <tr> <td><a href="https://bugs.openjdk.java.net/browse/JDK-8045273">JDK-8045273</a></td> <td>G1: alloc_purpose in copy_to_survivor_space() used incorrectly</td> </tr> <tr> <td><a href="https://bugs.openjdk.java.net/browse/JDK-8045272">JDK-8045272</a></td> <td>Missing post-barrier in ReferenceProcessor</td> </tr> <tr> <td><a href="https://bugs.openjdk.java.net/browse/JDK-8045271">JDK-8045271</a></td> <td>G1: Shared SATB queue never enabled</td> </tr> <tr> <td><a href="https://bugs.openjdk.java.net/browse/JDK-8045270">JDK-8045270</a></td> <td>G1: Reference processing should not enqueue references on the shared SATB queue</td> </tr> <tr> <td><a href="https://bugs.openjdk.java.net/browse/JDK-8045269">JDK-8045269</a></td> <td>new hotspot build - hs25.20-b08</td> </tr> <tr> <td><a href="https://bugs.openjdk.java.net/browse/JDK-8045267">JDK-8045267</a></td> <td>Linux semaphores to use CLOCK_REALTIME</td> </tr> <tr> <td><a href="https://bugs.openjdk.java.net/browse/JDK-8045266">JDK-8045266</a></td> <td>G1: Remove heapRegionSets.cpp</td> </tr> <tr> <td><a href="https://bugs.openjdk.java.net/browse/JDK-8045265">JDK-8045265</a></td> <td>G1: Refactor the HeapRegionSet hierarchy</td> </tr> <tr> <td><a href="https://bugs.openjdk.java.net/browse/JDK-8045264">JDK-8045264</a></td> <td>Enable type speculation by default</td> </tr> <tr> <td><a href="https://bugs.openjdk.java.net/browse/JDK-8045262">JDK-8045262</a></td> <td>assert(dp_src->tag() == dp_dst->tag()) failed: should be same tags 1 != 0 at ciMethodData.cpp:90</td> </tr> <tr> <td><a href="https://bugs.openjdk.java.net/browse/JDK-8045261">JDK-8045261</a></td> <td>Type speculation should favor profile data from outermost inlined method</td> </tr> <tr> <td><a href="https://bugs.openjdk.java.net/browse/JDK-8045259">JDK-8045259</a></td> <td>Failed speculative optimizations should be reattempted when root of compilation is different</td> </tr> <tr> <td><a href="https://bugs.openjdk.java.net/browse/JDK-8045258">JDK-8045258</a></td> <td>G1: Enable TLAB resizing</td> </tr> <tr> <td><a href="https://bugs.openjdk.java.net/browse/JDK-8045257">JDK-8045257</a></td> <td>Enable loop optimizations for loops with MathExact inside</td> </tr> <tr> <td><a href="https://bugs.openjdk.java.net/browse/JDK-8045256">JDK-8045256</a></td> <td>new hotspot build - hs25.20-b07</td> </tr> <tr> <td><a href="https://bugs.openjdk.java.net/browse/JDK-8045255">JDK-8045255</a></td> <td>ThreadInterruptTest3 produces wrong output on Windows</td> </tr> <tr> <td><a href="https://bugs.openjdk.java.net/browse/JDK-8045254">JDK-8045254</a></td> <td>Fix "Native frames:" in crash report (hs_err file)</td> </tr> <tr> <td><a href="https://bugs.openjdk.java.net/browse/JDK-8045253">JDK-8045253</a></td> <td>Move Fast_Lock/Fast_Unlock code from .ad files to macroassembler</td> </tr> <tr> <td><a href="https://bugs.openjdk.java.net/browse/JDK-8045252">JDK-8045252</a></td> <td>[TESTBUG] tests that use JMX should be in need_compact3 test group</td> </tr> <tr> <td><a href="https://bugs.openjdk.java.net/browse/JDK-8045250">JDK-8045250</a></td> <td>[TESTBUG] NonTieredLevelsTest: java.lang.RuntimeException: private TestCase$Helper(java.lang.Object) must be osr_compiled</td> </tr> <tr> <td><a href="https://bugs.openjdk.java.net/browse/JDK-8045249">JDK-8045249</a></td> <td>AltHashing used jint for imprecise bit shifting </td> </tr> <tr> <td><a href="https://bugs.openjdk.java.net/browse/JDK-8045248">JDK-8045248</a></td> <td>java/util/stream/test/org/openjdk/tests/java/util/stream/ToArrayOpTest.java fails with TestData$OfRef): failure java.lang.AssertionError: expected [true] but found [false]</td> </tr> <tr> <td><a href="https://bugs.openjdk.java.net/browse/JDK-8045246">JDK-8045246</a></td> <td>ParkEvent leak when running modified runThese which only loads classes</td> </tr> <tr> <td><a href="https://bugs.openjdk.java.net/browse/JDK-8045245">JDK-8045245</a></td> <td>Fatal error due to incorrect thread state during nightly testing</td> </tr> <tr> <td><a href="https://bugs.openjdk.java.net/browse/JDK-8045243">JDK-8045243</a></td> <td>new hotspot build - hs25.20-b06</td> </tr> <tr> <td><a href="https://bugs.openjdk.java.net/browse/JDK-8045242">JDK-8045242</a></td> <td>Second phase of branch shortening doesn't account for loop alignment</td> </tr> <tr> <td><a href="https://bugs.openjdk.java.net/browse/JDK-8045241">JDK-8045241</a></td> <td>ShouldNotReachHere() in ConstantPool::copy_entry_to</td> </tr> <tr> <td><a href="https://bugs.openjdk.java.net/browse/JDK-8045240">JDK-8045240</a></td> <td>Remove use of template template parameters from binaryTreeDictionary.</td> </tr> <tr> <td><a href="https://bugs.openjdk.java.net/browse/JDK-8045239">JDK-8045239</a></td> <td>Unable to test minimalVM</td> </tr> <tr> <td><a href="https://bugs.openjdk.java.net/browse/JDK-8045238">JDK-8045238</a></td> <td>race condition in ObjectMonitor implementation causing deadlocks</td> </tr> <tr> <td><a href="https://bugs.openjdk.java.net/browse/JDK-8045237">JDK-8045237</a></td> <td>Add trace event for VM flag changes</td> </tr> <tr> <td><a href="https://bugs.openjdk.java.net/browse/JDK-8045236">JDK-8045236</a></td> <td>Back out JDK-6976350 since it does not fix any issue</td> </tr> <tr> <td><a href="https://bugs.openjdk.java.net/browse/JDK-8045235">JDK-8045235</a></td> <td>Move G1ParCopyClosure::copy_to_survivor_space into G1ParScanThreadState</td> </tr> <tr> <td><a href="https://bugs.openjdk.java.net/browse/JDK-8045234">JDK-8045234</a></td> <td>Assume non-NULL references in G1CollectedHeap::in_cset_fast_test</td> </tr> <tr> <td><a href="https://bugs.openjdk.java.net/browse/JDK-8045233">JDK-8045233</a></td> <td>Decrease code size and templatizing in G1ParCopyClosure::do_oop_work</td> </tr> <tr> <td><a href="https://bugs.openjdk.java.net/browse/JDK-8045232">JDK-8045232</a></td> <td>Remove unneeded "content_type" declarations from tracetypes.xml</td> </tr> <tr> <td><a href="https://bugs.openjdk.java.net/browse/JDK-8045231">JDK-8045231</a></td> <td>Can't call default methods from JNI</td> </tr> <tr> <td><a href="https://bugs.openjdk.java.net/browse/JDK-8045230">JDK-8045230</a></td> <td>Mac OS X: VM starts the agent by calling both Agent_OnAttach and Agent_OnAttach_L functions if its agent library is dynamically linked. </td> </tr> <tr> <td><a href="https://bugs.openjdk.java.net/browse/JDK-8045229">JDK-8045229</a></td> <td>Adjust call to getisax() for additional words returned</td> </tr> <tr> <td><a href="https://bugs.openjdk.java.net/browse/JDK-8045228">JDK-8045228</a></td> <td>serviceability/sa/jmap-hashcode/Test8028623.java fails with compilation errors</td> </tr> <tr> <td><a href="https://bugs.openjdk.java.net/browse/JDK-8045227">JDK-8045227</a></td> <td>SA: hash codes in SymbolTable mismatching java_lang_String::hash_code for extended characters.</td> </tr> <tr> <td><a href="https://bugs.openjdk.java.net/browse/JDK-8045226">JDK-8045226</a></td> <td>Restore UseOldInlining in jdk8u </td> </tr> <tr> <td><a href="https://bugs.openjdk.java.net/browse/JDK-8045225">JDK-8045225</a></td> <td>new hotspot build - hs25.20-b05</td> </tr> <tr> <td><a href="https://bugs.openjdk.java.net/browse/JDK-8045224">JDK-8045224</a></td> <td>Class loading verification failure if GC occurs in Universe::flush_dependents_on</td> </tr> <tr> <td><a href="https://bugs.openjdk.java.net/browse/JDK-8045222">JDK-8045222</a></td> <td>Remove -XX:+-UseOldInlining</td> </tr> <tr> <td><a href="https://bugs.openjdk.java.net/browse/JDK-8045221">JDK-8045221</a></td> <td>assert(_gvn.type(obj)->higher_equal(tjp)) failed: cast_up is no longer needed</td> </tr> <tr> <td><a href="https://bugs.openjdk.java.net/browse/JDK-8045220">JDK-8045220</a></td> <td>Support for AES on SPARC</td> </tr> <tr> <td><a href="https://bugs.openjdk.java.net/browse/JDK-8045218">JDK-8045218</a></td> <td>JVMTI: "vtable stub" dynamic code notification is misplaced</td> </tr> <tr> <td><a href="https://bugs.openjdk.java.net/browse/JDK-8045217">JDK-8045217</a></td> <td>Java should recognize Diagnostic options if -XX:+UnlockDiagnosticVMOptions is not specified and print an informative message</td> </tr> <tr> <td><a href="https://bugs.openjdk.java.net/browse/JDK-8045216">JDK-8045216</a></td> <td>Attempt to resolve abstract method in concrete class fails with AbstractMethodError</td> </tr> <tr> <td><a href="https://bugs.openjdk.java.net/browse/JDK-8045214">JDK-8045214</a></td> <td>Test not added for bug 8025937: assert(existing_f1 == NULL || existing_f1 == f1) failed: illegal field,change</td> </tr> <tr> <td><a href="https://bugs.openjdk.java.net/browse/JDK-8045213">JDK-8045213</a></td> <td>Parallel class loading test anonymous-simple gets SIGSEGV in Metaspace::contains</td> </tr> <tr> <td><a href="https://bugs.openjdk.java.net/browse/JDK-8045212">JDK-8045212</a></td> <td>Missing volatile specifier in Bitmap::par_put_range_within_word</td> </tr> <tr> <td><a href="https://bugs.openjdk.java.net/browse/JDK-8045211">JDK-8045211</a></td> <td>new hotspot build - hs25.20-b04</td> </tr> <tr> <td><a href="https://bugs.openjdk.java.net/browse/JDK-8045209">JDK-8045209</a></td> <td>Test8000311 fails after latest changes to parallelize string and symbol table unlink</td> </tr> <tr> <td><a href="https://bugs.openjdk.java.net/browse/JDK-8045208">JDK-8045208</a></td> <td>Wrong predicate for checking whether the correct amount of symbol table entries have been processed in G1</td> </tr> <tr> <td><a href="https://bugs.openjdk.java.net/browse/JDK-8045207">JDK-8045207</a></td> <td>G1: specialize deal_with_reference() for narrowOop*</td> </tr> <tr> <td><a href="https://bugs.openjdk.java.net/browse/JDK-8045206">JDK-8045206</a></td> <td>The flag VerifySilently misses a test case</td> </tr> <tr> <td><a href="https://bugs.openjdk.java.net/browse/JDK-8045205">JDK-8045205</a></td> <td>Make the Min/MaxHeapFreeRatio flags manageable</td> </tr> <tr> <td><a href="https://bugs.openjdk.java.net/browse/JDK-8045204">JDK-8045204</a></td> <td>new hotspot build - hs25.20-b03</td> </tr> <tr> <td><a href="https://bugs.openjdk.java.net/browse/JDK-8045203">JDK-8045203</a></td> <td>The JVM should not throw VerifyError when 'overriding' a static final method in a superclass.</td> </tr> <tr> <td><a href="https://bugs.openjdk.java.net/browse/JDK-8045202">JDK-8045202</a></td> <td>nsk/jvmti/scenarios/hotswap/HS101/hs101t006 Crashed the vm on Linux-amd64: SIGSEGV in JavaThread::last_java_vframe(RegisterMap*)+0xfa</td> </tr> <tr> <td><a href="https://bugs.openjdk.java.net/browse/JDK-8045201">JDK-8045201</a></td> <td>Access checks should precede additional per-instruction checks</td> </tr> <tr> <td><a href="https://bugs.openjdk.java.net/browse/JDK-8045200">JDK-8045200</a></td> <td>Remove do_gen_barrier template parameter in G1ParCopyClosure</td> </tr> <tr> <td><a href="https://bugs.openjdk.java.net/browse/JDK-8045199">JDK-8045199</a></td> <td>Do not traverse string table during G1 remark when treating them as strong roots during initial mark</td> </tr> <tr> <td><a href="https://bugs.openjdk.java.net/browse/JDK-8045198">JDK-8045198</a></td> <td>Improve symbol table scan times during gc pauses</td> </tr> <tr> <td><a href="https://bugs.openjdk.java.net/browse/JDK-8045197">JDK-8045197</a></td> <td>Improve performance of Stringtable unlink</td> </tr> <tr> <td><a href="https://bugs.openjdk.java.net/browse/JDK-8045196">JDK-8045196</a></td> <td>PSScavenge accounts too large code section to StringTable unlink</td> </tr> <tr> <td><a href="https://bugs.openjdk.java.net/browse/JDK-8045195">JDK-8045195</a></td> <td>assert(_prologue != NULL) failed: prologue pointer must be initialized</td> </tr> <tr> <td><a href="https://bugs.openjdk.java.net/browse/JDK-8045194">JDK-8045194</a></td> <td>new hotspot build - hs25.20-b02</td> </tr> <tr> <td><a href="https://bugs.openjdk.java.net/browse/JDK-8045193">JDK-8045193</a></td> <td>New type profiling points: sparc support</td> </tr> <tr> <td><a href="https://bugs.openjdk.java.net/browse/JDK-8045192">JDK-8045192</a></td> <td>"assert(counter_changed) failed: failed dependencies, but counter didn't change" still fails</td> </tr> <tr> <td><a href="https://bugs.openjdk.java.net/browse/JDK-8045190">JDK-8045190</a></td> <td>Make compilation IDs sequential</td> </tr> <tr> <td><a href="https://bugs.openjdk.java.net/browse/JDK-8045189">JDK-8045189</a></td> <td>intrinsics for Math.decrementExact(J) and incrementExact(J) don't work</td> </tr> <tr> <td><a href="https://bugs.openjdk.java.net/browse/JDK-8045188">JDK-8045188</a></td> <td>C1: assert(code_offset() - offset == NativeInstruction::nop_instruction_size) failed: only one instruction can go in a delay slot</td> </tr> <tr> <td><a href="https://bugs.openjdk.java.net/browse/JDK-8045187">JDK-8045187</a></td> <td>Add inlining information into ciReplay</td> </tr> <tr> <td><a href="https://bugs.openjdk.java.net/browse/JDK-8045185">JDK-8045185</a></td> <td>compiler/uncommontrap/TestStackBangRbp.java crashes with SIGSEGV </td> </tr> <tr> <td><a href="https://bugs.openjdk.java.net/browse/JDK-8045184">JDK-8045184</a></td> <td>fatal error: meet not symmetric</td> </tr> <tr> <td><a href="https://bugs.openjdk.java.net/browse/JDK-8045183">JDK-8045183</a></td> <td>tiered may collect wrong receiver type at virtual call</td> </tr> <tr> <td><a href="https://bugs.openjdk.java.net/browse/JDK-8045182">JDK-8045182</a></td> <td>Test cases to cover type system fixes pushed with 8024070</td> </tr> <tr> <td><a href="https://bugs.openjdk.java.net/browse/JDK-8045181">JDK-8045181</a></td> <td>[TESTBUG] New tests development for intrisics for basic operators - add, neg, inc, dec, sub, mul</td> </tr> <tr> <td><a href="https://bugs.openjdk.java.net/browse/JDK-8045180">JDK-8045180</a></td> <td>JVM crashes with SIGSEGV (0xb) at pc=0x00000001077cbbf6</td> </tr> <tr> <td><a href="https://bugs.openjdk.java.net/browse/JDK-8045178">JDK-8045178</a></td> <td>Provide regression test for 8026478: -XX:+VerifyAdapterSharing is broken</td> </tr> <tr> <td><a href="https://bugs.openjdk.java.net/browse/JDK-8045177">JDK-8045177</a></td> <td>Add -XX: flag to print code cache sweeper statistics</td> </tr> <tr> <td><a href="https://bugs.openjdk.java.net/browse/JDK-8045176">JDK-8045176</a></td> <td>-XX:+VerifyAdapterSharing is broken</td> </tr> <tr> <td><a href="https://bugs.openjdk.java.net/browse/JDK-8045175">JDK-8045175</a></td> <td>Bug in calculation of code cache sweeping interval</td> </tr> <tr> <td><a href="https://bugs.openjdk.java.net/browse/JDK-8045174">JDK-8045174</a></td> <td>Update the Hotspot version numbers in Hotspot for JDK 8U</td> </tr> <tr> <td><a href="https://bugs.openjdk.java.net/browse/JDK-8045173">JDK-8045173</a></td> <td>Move misplaced inference tests to test/tools/javac/generics/inference</td> </tr> <tr> <td><a href="https://bugs.openjdk.java.net/browse/JDK-8045172">JDK-8045172</a></td> <td>Refactor Types.upperBound to treat wildcards and variables separately</td> </tr> <tr> <td><a href="https://bugs.openjdk.java.net/browse/JDK-8045171">JDK-8045171</a></td> <td>wrong error message when mixing lambda expression and inner class</td> </tr> <tr> <td><a href="https://bugs.openjdk.java.net/browse/JDK-8045170">JDK-8045170</a></td> <td>javac, inconsistent generic types behaviour when compiling together vs. separate</td> </tr> <tr> <td><a href="https://bugs.openjdk.java.net/browse/JDK-8045169">JDK-8045169</a></td> <td>Most-specific should not have any special treatment for boxed vs. unboxed types</td> </tr> <tr> <td><a href="https://bugs.openjdk.java.net/browse/JDK-8045168">JDK-8045168</a></td> <td>langtools/test/Makefile breaks when JT_JAVA set to a JDK 9 build</td> </tr> <tr> <td><a href="https://bugs.openjdk.java.net/browse/JDK-8045167">JDK-8045167</a></td> <td>Support verbosity options in langtools testing</td> </tr> <tr> <td><a href="https://bugs.openjdk.java.net/browse/JDK-8045166">JDK-8045166</a></td> <td>fix for JDK-8029569 doesn't cover all possible cases</td> </tr> <tr> <td><a href="https://bugs.openjdk.java.net/browse/JDK-8045165">JDK-8045165</a></td> <td>javac, for method references a primitive type can be added as a bound</td> </tr> <tr> <td><a href="https://bugs.openjdk.java.net/browse/JDK-8045163">JDK-8045163</a></td> <td>Sensitive dependence on location of nested interface</td> </tr> <tr> <td><a href="https://bugs.openjdk.java.net/browse/JDK-8045162">JDK-8045162</a></td> <td>Duplicated notifications can be sent to TaskListener</td> </tr> <tr> <td><a href="https://bugs.openjdk.java.net/browse/JDK-8045161">JDK-8045161</a></td> <td>Inference produces spurious error for intersection type bounds check</td> </tr> <tr> <td><a href="https://bugs.openjdk.java.net/browse/JDK-8045160">JDK-8045160</a></td> <td>Inference ignores capture variable as upper bound</td> </tr> <tr> <td><a href="https://bugs.openjdk.java.net/browse/JDK-8045159">JDK-8045159</a></td> <td>Inference: implement eager resolution of return types, consistent with JDK-8028800</td> </tr> <tr> <td><a href="https://bugs.openjdk.java.net/browse/JDK-8045158">JDK-8045158</a></td> <td>Lambda reference to containing local class causes javac infinite recursion</td> </tr> <tr> <td><a href="https://bugs.openjdk.java.net/browse/JDK-8045157">JDK-8045157</a></td> <td>Bad code generated (VerifyError) when lambda instantiates enclosing local class and has captured variables</td> </tr> <tr> <td><a href="https://bugs.openjdk.java.net/browse/JDK-8045156">JDK-8045156</a></td> <td>javac generates incorrect exception table for multi-catch statements inside a lambda</td> </tr> <tr> <td><a href="https://bugs.openjdk.java.net/browse/JDK-8045155">JDK-8045155</a></td> <td>Definitely unassigned field can be accessed</td> </tr> <tr> <td><a href="https://bugs.openjdk.java.net/browse/JDK-8045154">JDK-8045154</a></td> <td>Compiler crash: ClassCastException</td> </tr> <tr> <td><a href="https://bugs.openjdk.java.net/browse/JDK-8045153">JDK-8045153</a></td> <td>Test tools/javac/classfiles/InnerClasses/SyntheticClasses.java fails</td> </tr> <tr> <td><a href="https://bugs.openjdk.java.net/browse/JDK-8045152">JDK-8045152</a></td> <td>Test tools/javac/processing/environment/round/TestElementsAnnotatedWith.java fails</td> </tr> <tr> <td><a href="https://bugs.openjdk.java.net/browse/JDK-8045151">JDK-8045151</a></td> <td>javac behaves incorrectly for annotations after method type parameters in some cases</td> </tr> <tr> <td><a href="https://bugs.openjdk.java.net/browse/JDK-8045150">JDK-8045150</a></td> <td>Should always use lambda body structure to disambiguate overload resolution</td> </tr> <tr> <td><a href="https://bugs.openjdk.java.net/browse/JDK-8045149">JDK-8045149</a></td> <td>javac should take multiple upper bounds into account in incorporation</td> </tr> <tr> <td><a href="https://bugs.openjdk.java.net/browse/JDK-8045148">JDK-8045148</a></td> <td>javac, rename method asFree() in InferenceContext to asUndetVar() which reflects better it's purpose</td> </tr> <tr> <td><a href="https://bugs.openjdk.java.net/browse/JDK-8045147">JDK-8045147</a></td> <td>[javadoc] fails with java.lang.IllegalStateException: endPosTable already set</td> </tr> <tr> <td><a href="https://bugs.openjdk.java.net/browse/JDK-8045146">JDK-8045146</a></td> <td>javadoc requires a trailing / for links where java 7's javadoc didn't</td> </tr> <tr> <td><a href="https://bugs.openjdk.java.net/browse/JDK-8045144">JDK-8045144</a></td> <td>Javac: final local String var referenced in binary/unary op in lambda produces code that does not verify</td> </tr> <tr> <td><a href="https://bugs.openjdk.java.net/browse/JDK-8045143">JDK-8045143</a></td> <td>Lambda returning post-increment generates wrong code</td> </tr> <tr> <td><a href="https://bugs.openjdk.java.net/browse/JDK-8045142">JDK-8045142</a></td> <td>[javadoc] test failure caused by javax.crypto fix</td> </tr> <tr> <td><a href="https://bugs.openjdk.java.net/browse/JDK-8045141">JDK-8045141</a></td> <td>javax.crypto is not listed in the compact* profiles javadoc</td> </tr> <tr> <td><a href="https://bugs.openjdk.java.net/browse/JDK-8045140">JDK-8045140</a></td> <td>jdk8 javac -source 7 compiles test case it should not</td> </tr> <tr> <td><a href="https://bugs.openjdk.java.net/browse/JDK-8045139">JDK-8045139</a></td> <td>Two langtools/javac tests fail by timeout on Windows</td> </tr> <tr> <td><a href="https://bugs.openjdk.java.net/browse/JDK-8045138">JDK-8045138</a></td> <td>missing test file for 8034048</td> </tr> <tr> <td><a href="https://bugs.openjdk.java.net/browse/JDK-8045137">JDK-8045137</a></td> <td>javac crash with method references plus lambda plus var args</td> </tr> <tr> <td><a href="https://bugs.openjdk.java.net/browse/JDK-8045136">JDK-8045136</a></td> <td>reorder class file attributes in javap listing</td> </tr> <tr> <td><a href="https://bugs.openjdk.java.net/browse/JDK-8045135">JDK-8045135</a></td> <td>annotation processors don't visit declaration parameter annotations</td> </tr> <tr> <td><a href="https://bugs.openjdk.java.net/browse/JDK-8045134">JDK-8045134</a></td> <td>outer_class_info_index of synthetic class is not zero</td> </tr> <tr> <td><a href="https://bugs.openjdk.java.net/browse/JDK-8045133">JDK-8045133</a></td> <td>Incorrect RuntimeVisibleTypeAnnotations for exception parameters when not generating debuging info</td> </tr> <tr> <td><a href="https://bugs.openjdk.java.net/browse/JDK-8045132">JDK-8045132</a></td> <td>javac provide debug oriented toString() methods to InferenceContext and UndetVar</td> </tr> <tr> <td><a href="https://bugs.openjdk.java.net/browse/JDK-8045131">JDK-8045131</a></td> <td>Incorrect inheritance of inaccessible static method</td> </tr> <tr> <td><a href="https://bugs.openjdk.java.net/browse/JDK-8045130">JDK-8045130</a></td> <td>remove support for legacy options in javap</td> </tr> <tr> <td><a href="https://bugs.openjdk.java.net/browse/JDK-8045129">JDK-8045129</a></td> <td>An extra space in the comments of constant pool entries</td> </tr> <tr> <td><a href="https://bugs.openjdk.java.net/browse/JDK-8045128">JDK-8045128</a></td> <td>Regression test tools/javap/MethodParameters.java fails in 8u20 nightly build</td> </tr> <tr> <td><a href="https://bugs.openjdk.java.net/browse/JDK-8045127">JDK-8045127</a></td> <td>javadoc fails with java.lang.IllegalStateException: endPosTable already set</td> </tr> <tr> <td><a href="https://bugs.openjdk.java.net/browse/JDK-8045126">JDK-8045126</a></td> <td>Internal error for zero indent</td> </tr> <tr> <td><a href="https://bugs.openjdk.java.net/browse/JDK-8045125">JDK-8045125</a></td> <td>An inappropriate newline symbol in the help section</td> </tr> <tr> <td><a href="https://bugs.openjdk.java.net/browse/JDK-8045124">JDK-8045124</a></td> <td>The values of non-static final fields are printed for the -constants option</td> </tr> <tr> <td><a href="https://bugs.openjdk.java.net/browse/JDK-8045123">JDK-8045123</a></td> <td>Extra empty line between field declarations for the "-v -c" and "-v -l" combination of options</td> </tr> <tr> <td><a href="https://bugs.openjdk.java.net/browse/JDK-8045122">JDK-8045122</a></td> <td>doclint incorrectly rejects some @see tags in javadoc comments</td> </tr> <tr> <td><a href="https://bugs.openjdk.java.net/browse/JDK-8045121">JDK-8045121</a></td> <td>LineNumberTable/LocalVariableTable tables duplication for the "-v -l" combination of options</td> </tr> <tr> <td><a href="https://bugs.openjdk.java.net/browse/JDK-8045120">JDK-8045120</a></td> <td>Incorrect indentation of StackMapTable entries</td> </tr> <tr> <td><a href="https://bugs.openjdk.java.net/browse/JDK-8045119">JDK-8045119</a></td> <td>Unnecessary new line after the StackMapTable</td> </tr> <tr> <td><a href="https://bugs.openjdk.java.net/browse/JDK-8045118">JDK-8045118</a></td> <td>An exception is thrown if using the "-classpath" option with no arguments </td> </tr> <tr> <td><a href="https://bugs.openjdk.java.net/browse/JDK-8045117">JDK-8045117</a></td> <td>StackMapTable does not unindent properly</td> </tr> <tr> <td><a href="https://bugs.openjdk.java.net/browse/JDK-8045116">JDK-8045116</a></td> <td>javap output has unnecessary trailing whitespace</td> </tr> <tr> <td><a href="https://bugs.openjdk.java.net/browse/JDK-8045115">JDK-8045115</a></td> <td>Incorrect comment alignment</td> </tr> <tr> <td><a href="https://bugs.openjdk.java.net/browse/JDK-8045114">JDK-8045114</a></td> <td>Default methods should be visible under source previous to 8</td> </tr> <tr> <td><a href="https://bugs.openjdk.java.net/browse/JDK-8045113">JDK-8045113</a></td> <td>Default methods not always visible under -source 7</td> </tr> <tr> <td><a href="https://bugs.openjdk.java.net/browse/JDK-8045112">JDK-8045112</a></td> <td>Existing regression tests in tl/langtools and tl/jdk need to be updated for @bug keyword.</td> </tr> <tr> <td><a href="https://bugs.openjdk.java.net/browse/JDK-8045111">JDK-8045111</a></td> <td>RoundEnvironment.getElementsAnnotatedWith receives wrong elements</td> </tr> <tr> <td><a href="https://bugs.openjdk.java.net/browse/JDK-8045110">JDK-8045110</a></td> <td>javac crashes when mixing lambdas and inner classes</td> </tr> <tr> <td><a href="https://bugs.openjdk.java.net/browse/JDK-8045109">JDK-8045109</a></td> <td>javac, compile time error isn't shown when final static field is not assigned, follow-up</td> </tr> <tr> <td><a href="https://bugs.openjdk.java.net/browse/JDK-8045108">JDK-8045108</a></td> <td>[javac] LambdaToMethod is missing forceSerializedRepresentation logic and switch</td> </tr> <tr> <td><a href="https://bugs.openjdk.java.net/browse/JDK-8045107">JDK-8045107</a></td> <td>ElementType.TYPE_USE should be a logical superset of ElementType.TYPE and ANNOTATION_TYPE</td> </tr> <tr> <td><a href="https://bugs.openjdk.java.net/browse/JDK-8045106">JDK-8045106</a></td> <td>Enable repeating annotations test cases since JDK-8004912 is fixed</td> </tr> <tr> <td><a href="https://bugs.openjdk.java.net/browse/JDK-8045105">JDK-8045105</a></td> <td>Access to undefined property yields "null" instead of "undefined"</td> </tr> <tr> <td><a href="https://bugs.openjdk.java.net/browse/JDK-8045104">JDK-8045104</a></td> <td>TypeError when attemping to create an instance of non-public class could be better</td> </tr> <tr> <td><a href="https://bugs.openjdk.java.net/browse/JDK-8045103">JDK-8045103</a></td> <td>Nashorn: Multiple RegExp#ignoreCase issues</td> </tr> <tr> <td><a href="https://bugs.openjdk.java.net/browse/JDK-8045102">JDK-8045102</a></td> <td>Test framework changes to run script tests without security manager</td> </tr> <tr> <td><a href="https://bugs.openjdk.java.net/browse/JDK-8045101">JDK-8045101</a></td> <td>Add more samples in nashorn/samples directory</td> </tr> <tr> <td><a href="https://bugs.openjdk.java.net/browse/JDK-8045100">JDK-8045100</a></td> <td>CompiledScript slower when eval with binding</td> </tr> <tr> <td><a href="https://bugs.openjdk.java.net/browse/JDK-8045099">JDK-8045099</a></td> <td>Make __proto__ ES6 draft compliant</td> </tr> <tr> <td><a href="https://bugs.openjdk.java.net/browse/JDK-8045098">JDK-8045098</a></td> <td>RegExp implementation is not thread-safe</td> </tr> <tr> <td><a href="https://bugs.openjdk.java.net/browse/JDK-8045097">JDK-8045097</a></td> <td>Avoid repeated reading of source for cached loads</td> </tr> <tr> <td><a href="https://bugs.openjdk.java.net/browse/JDK-8045096">JDK-8045096</a></td> <td>Add --const-as-var option</td> </tr> <tr> <td><a href="https://bugs.openjdk.java.net/browse/JDK-8045095">JDK-8045095</a></td> <td>JDK-8031359.js fails in 8u-dev</td> </tr> <tr> <td><a href="https://bugs.openjdk.java.net/browse/JDK-8045094">JDK-8045094</a></td> <td>Wrong result for Number.prototype.toString() for certain radix/inputs</td> </tr> <tr> <td><a href="https://bugs.openjdk.java.net/browse/JDK-8045093">JDK-8045093</a></td> <td>Nashorn: Uint8ClampedArray - Incorrect ToUint8Clamp implementation</td> </tr> <tr> <td><a href="https://bugs.openjdk.java.net/browse/JDK-8045092">JDK-8045092</a></td> <td> Write sanity tests for persistent caching </td> </tr> <tr> <td><a href="https://bugs.openjdk.java.net/browse/JDK-8045091">JDK-8045091</a></td> <td>NoPersistenceCachingTest fails with ant test</td> </tr> <tr> <td><a href="https://bugs.openjdk.java.net/browse/JDK-8045090">JDK-8045090</a></td> <td>Write sanity tests for bytecode persistence feature</td> </tr> <tr> <td><a href="https://bugs.openjdk.java.net/browse/JDK-8045089">JDK-8045089</a></td> <td>Nashorn supports indexed access of List elements, but length property is not supported</td> </tr> <tr> <td><a href="https://bugs.openjdk.java.net/browse/JDK-8045088">JDK-8045088</a></td> <td>Persistent code store does not use absolute paths internally</td> </tr> <tr> <td><a href="https://bugs.openjdk.java.net/browse/JDK-8045087">JDK-8045087</a></td> <td>Persistent store for compiled scripts</td> </tr> <tr> <td><a href="https://bugs.openjdk.java.net/browse/JDK-8045086">JDK-8045086</a></td> <td>Parser accepts conditional catch clauses even when --no-syntax-extensions / -nse option is passed</td> </tr> <tr> <td><a href="https://bugs.openjdk.java.net/browse/JDK-8045085">JDK-8045085</a></td> <td>test262 repo is now a git repo in github</td> </tr> <tr> <td><a href="https://bugs.openjdk.java.net/browse/JDK-8045084">JDK-8045084</a></td> <td>improve nasgen type checks and use specific return type for @Function, @SpecializedFunctio methods</td> </tr> <tr> <td><a href="https://bugs.openjdk.java.net/browse/JDK-8045083">JDK-8045083</a></td> <td>Nashorn: JSON.parse comes up with nonexistent entries if there are gaps between the keys</td> </tr> <tr> <td><a href="https://bugs.openjdk.java.net/browse/JDK-8045082">JDK-8045082</a></td> <td>Remove getInitialMap getters and GlobalObject interface.</td> </tr> <tr> <td><a href="https://bugs.openjdk.java.net/browse/JDK-8045081">JDK-8045081</a></td> <td>DataView constructor is not defined</td> </tr> <tr> <td><a href="https://bugs.openjdk.java.net/browse/JDK-8045080">JDK-8045080</a></td> <td>Share script classes between threads/globals within context</td> </tr> <tr> <td><a href="https://bugs.openjdk.java.net/browse/JDK-8045079">JDK-8045079</a></td> <td>delete on global object not properly guarded</td> </tr> <tr> <td><a href="https://bugs.openjdk.java.net/browse/JDK-8045078">JDK-8045078</a></td> <td>nasgen needs the newly build nasgen and nashorn classes in the bootclasspath</td> </tr> <tr> <td><a href="https://bugs.openjdk.java.net/browse/JDK-8045077">JDK-8045077</a></td> <td>Redesign property listeners for shared classes</td> </tr> <tr> <td><a href="https://bugs.openjdk.java.net/browse/JDK-8045076">JDK-8045076</a></td> <td>Nashorn: Object.defineProperty() can be lured to change fixed NaN property</td> </tr> <tr> <td><a href="https://bugs.openjdk.java.net/browse/JDK-8045075">JDK-8045075</a></td> <td>Default permissions are not given for eval code</td> </tr> <tr> <td><a href="https://bugs.openjdk.java.net/browse/JDK-8045074">JDK-8045074</a></td> <td>need indexed access to externally-managed ByteBuffer</td> </tr> <tr> <td><a href="https://bugs.openjdk.java.net/browse/JDK-8045073">JDK-8045073</a></td> <td>Add tests to assert map identity of certain objects</td> </tr> <tr> <td><a href="https://bugs.openjdk.java.net/browse/JDK-8045072">JDK-8045072</a></td> <td>implement @sourceURL and #sourceURL directives</td> </tr> <tr> <td><a href="https://bugs.openjdk.java.net/browse/JDK-8045071">JDK-8045071</a></td> <td>PropertyMap of Error objects is not stable</td> </tr> <tr> <td><a href="https://bugs.openjdk.java.net/browse/JDK-8045070">JDK-8045070</a></td> <td>instance property "message" of Error objects should be non-enumerable</td> </tr> <tr> <td><a href="https://bugs.openjdk.java.net/browse/JDK-8045069">JDK-8045069</a></td> <td>Error objects should capture stack at the constructor</td> </tr> <tr> <td><a href="https://bugs.openjdk.java.net/browse/JDK-8045068">JDK-8045068</a></td> <td>Indexed access to java package not working</td> </tr> <tr> <td><a href="https://bugs.openjdk.java.net/browse/JDK-8045067">JDK-8045067</a></td> <td>Do not require nasgen-generated functions to return Object</td> </tr> <tr> <td><a href="https://bugs.openjdk.java.net/browse/JDK-8045066">JDK-8045066</a></td> <td>Invocable.getInterface() works incorrectly if interface has default methods</td> </tr> <tr> <td><a href="https://bugs.openjdk.java.net/browse/JDK-8045065">JDK-8045065</a></td> <td>SyntaxError when property setter has no parameter</td> </tr> <tr> <td><a href="https://bugs.openjdk.java.net/browse/JDK-8045064">JDK-8045064</a></td> <td>Prototype linking is incorrect</td> </tr> <tr> <td><a href="https://bugs.openjdk.java.net/browse/JDK-8045063">JDK-8045063</a></td> <td>setField in ScriptObject is incorrect for non extensible objects</td> </tr> <tr> <td><a href="https://bugs.openjdk.java.net/browse/JDK-8045062">JDK-8045062</a></td> <td>Nashorn: IndexOutOfBoundsException in NashornCallSiteDescriptor.getNameToken()</td> </tr> <tr> <td><a href="https://bugs.openjdk.java.net/browse/JDK-8045061">JDK-8045061</a></td> <td>Anonymous functions should not be shown with internal names in script stack trace</td> </tr> <tr> <td><a href="https://bugs.openjdk.java.net/browse/JDK-8045060">JDK-8045060</a></td> <td>scopeCall with -1 as line number</td> </tr> <tr> <td><a href="https://bugs.openjdk.java.net/browse/JDK-8045059">JDK-8045059</a></td> <td>NashornException to expose thrown object</td> </tr> <tr> <td><a href="https://bugs.openjdk.java.net/browse/JDK-8045058">JDK-8045058</a></td> <td>"ant clean jar" on nashorn repo results in number of ASM deprecated warnings</td> </tr> <tr> <td><a href="https://bugs.openjdk.java.net/browse/JDK-8045057">JDK-8045057</a></td> <td>Need to add link to jdk.net apidoc in networking guide (for JDK 9 and 8u20)</td> </tr> <tr> <td><a href="https://bugs.openjdk.java.net/browse/JDK-8045056">JDK-8045056</a></td> <td>Add a link to the com.sun.nio.sctp API in IO guide</td> </tr> <tr> <td><a href="https://bugs.openjdk.java.net/browse/JDK-8045055">JDK-8045055</a></td> <td>Small typo in standards/index.html</td> </tr> <tr> <td><a href="https://bugs.openjdk.java.net/browse/JDK-8045053">JDK-8045053</a></td> <td>REGRESSION:NullPointerException at com.sun.javaws.Launcher.prepareToLaunch()</td> </tr> <tr> <td><a href="https://bugs.openjdk.java.net/browse/JDK-8045052">JDK-8045052</a></td> <td>refactoring existing DRS functionality - splitting RuleId class into smaller classes</td> </tr> <tr> <td><a href="https://bugs.openjdk.java.net/browse/JDK-8045049">JDK-8045049</a></td> <td>jcontrol script should use pwd with -P flag</td> </tr> <tr> <td><a href="https://bugs.openjdk.java.net/browse/JDK-8045046">JDK-8045046</a></td> <td>missing copyright notice</td> </tr> <tr> <td><a href="https://bugs.openjdk.java.net/browse/JDK-8045045">JDK-8045045</a></td> <td>Java update needed dialog on mac doesn't have a title</td> </tr> <tr> <td><a href="https://bugs.openjdk.java.net/browse/JDK-8045044">JDK-8045044</a></td> <td>Cannot run FX applets if Java 7 and 8 are installed and Java 8 is disabled via JCP</td> </tr> <tr> <td><a href="https://bugs.openjdk.java.net/browse/JDK-8045042">JDK-8045042</a></td> <td>Fix JUnit compilation error</td> </tr> <tr> <td><a href="https://bugs.openjdk.java.net/browse/JDK-8045039">JDK-8045039</a></td> <td>Text is truncated in JavaScript to Java security warning dialog on OS X</td> </tr> <tr> <td><a href="https://bugs.openjdk.java.net/browse/JDK-8045035">JDK-8045035</a></td> <td>Fix crash of unit tests for none windows platforms</td> </tr> <tr> <td><a href="https://bugs.openjdk.java.net/browse/JDK-8045034">JDK-8045034</a></td> <td>awt_Plugin no longer needed</td> </tr> <tr> <td><a href="https://bugs.openjdk.java.net/browse/JDK-8045032">JDK-8045032</a></td> <td>Old JRE's</td> </tr> <tr> <td><a href="https://bugs.openjdk.java.net/browse/JDK-8045025">JDK-8045025</a></td> <td>fix to JDK-8033756 is incomplete</td> </tr> <tr> <td><a href="https://bugs.openjdk.java.net/browse/JDK-8045022">JDK-8045022</a></td> <td>DRS: messaging is incorrect when blocking due to DRS version mismatch</td> </tr> <tr> <td><a href="https://bugs.openjdk.java.net/browse/JDK-8045021">JDK-8045021</a></td> <td>Confusing Error messages shown by ESL under some blocked scenarios</td> </tr> <tr> <td><a href="https://bugs.openjdk.java.net/browse/JDK-8045020">JDK-8045020</a></td> <td>Nashorn fails to evaluate autoconfig-script when used via JavaWS</td> </tr> <tr> <td><a href="https://bugs.openjdk.java.net/browse/JDK-8045019">JDK-8045019</a></td> <td>8u20: No blocked dialog for plugin and javafx apps when no jre matches the rule specified by Admin(DRS with force)</td> </tr> <tr> <td><a href="https://bugs.openjdk.java.net/browse/JDK-8045018">JDK-8045018</a></td> <td>DRS ruleset path matching problem</td> </tr> <tr> <td><a href="https://bugs.openjdk.java.net/browse/JDK-8045017">JDK-8045017</a></td> <td>Wrong port in HTTPS connection warning</td> </tr> <tr> <td><a href="https://bugs.openjdk.java.net/browse/JDK-8045007">JDK-8045007</a></td> <td>JRE 7u51 Plugin Failing to Run Older JRE Version < 1.6.0</td> </tr> <tr> <td><a href="https://bugs.openjdk.java.net/browse/JDK-8044994">JDK-8044994</a></td> <td>[regression] Unsigned warning dialog is shown twice for applet with extension launched thru javaws</td> </tr> <tr> <td><a href="https://bugs.openjdk.java.net/browse/JDK-8044992">JDK-8044992</a></td> <td>Array out of bounds exception in PluginMain.performSSVValidation</td> </tr> <tr> <td><a href="https://bugs.openjdk.java.net/browse/JDK-8044988">JDK-8044988</a></td> <td>Update javadoc comments in JNLP API</td> </tr> <tr> <td><a href="https://bugs.openjdk.java.net/browse/JDK-8044985">JDK-8044985</a></td> <td>An unsigned dialog will show up when signed apps try to access a non-exist jar</td> </tr> <tr> <td><a href="https://bugs.openjdk.java.net/browse/JDK-8044981">JDK-8044981</a></td> <td> Broken Java SE 7 jnlp samples (app2 and app3) </td> </tr> <tr> <td><a href="https://bugs.openjdk.java.net/browse/JDK-8044980">JDK-8044980</a></td> <td>JAR file is downloaded on DownloadService.removeResource, if it is not in Deployment Cache</td> </tr> <tr> <td><a href="https://bugs.openjdk.java.net/browse/JDK-8044979">JDK-8044979</a></td> <td>JNLP parser accepts illegal XML in comments</td> </tr> <tr> <td><a href="https://bugs.openjdk.java.net/browse/JDK-8044978">JDK-8044978</a></td> <td>A JTextField of an applet loses the abillity to receive the focus under certain circumstances.</td> </tr> <tr> <td><a href="https://bugs.openjdk.java.net/browse/JDK-8044975">JDK-8044975</a></td> <td>Refix [parfait] JNI exception pending in deploy/src/common/macosx/native/MacOSXBundleUtil.m</td> </tr> <tr> <td><a href="https://bugs.openjdk.java.net/browse/JDK-8044974">JDK-8044974</a></td> <td>Correct the fix for JDK-8039155 </td> </tr> <tr> <td><a href="https://bugs.openjdk.java.net/browse/JDK-8044973">JDK-8044973</a></td> <td>Remove unused code left after JDK-8001167 changes</td> </tr> <tr> <td><a href="https://bugs.openjdk.java.net/browse/JDK-8044972">JDK-8044972</a></td> <td>Exception is shown in security dialog</td> </tr> <tr> <td><a href="https://bugs.openjdk.java.net/browse/JDK-8044969">JDK-8044969</a></td> <td>Backout 8034028 [parfait] JNI exception pending in deploy/src/common/macosx/native/MacOSXBundleUtil.m</td> </tr> <tr> <td><a href="https://bugs.openjdk.java.net/browse/JDK-8044967">JDK-8044967</a></td> <td>AuthCacheBridge should not be in sun.net.www.protocol.http package</td> </tr> <tr> <td><a href="https://bugs.openjdk.java.net/browse/JDK-8044966">JDK-8044966</a></td> <td>"Always allow this application to access the printer" option doesn't work for jnlp application</td> </tr> <tr> <td><a href="https://bugs.openjdk.java.net/browse/JDK-8044965">JDK-8044965</a></td> <td>[nightly] Plugin doesn't work for javafx applets since from build 25.03.2014</td> </tr> <tr> <td><a href="https://bugs.openjdk.java.net/browse/JDK-8044964">JDK-8044964</a></td> <td>Fix copyright years</td> </tr> <tr> <td><a href="https://bugs.openjdk.java.net/browse/JDK-8044961">JDK-8044961</a></td> <td>com.sun.javaws.JnlpUpdateTest NPE</td> </tr> <tr> <td><a href="https://bugs.openjdk.java.net/browse/JDK-8044960">JDK-8044960</a></td> <td>RDF: Security dialog popup while Java <--> JavaScript communication</td> </tr> <tr> <td><a href="https://bugs.openjdk.java.net/browse/JDK-8044958">JDK-8044958</a></td> <td>When any applet-desc is launched via java web start and gets an error, it does not exit (process keeps running)</td> </tr> <tr> <td><a href="https://bugs.openjdk.java.net/browse/JDK-8044954">JDK-8044954</a></td> <td>launcher.c DetermineVersion() does not use jreversion or jrelocation</td> </tr> <tr> <td><a href="https://bugs.openjdk.java.net/browse/JDK-8044953">JDK-8044953</a></td> <td>[parfait] Refix Parfait Bugs</td> </tr> <tr> <td><a href="https://bugs.openjdk.java.net/browse/JDK-8044952">JDK-8044952</a></td> <td>Old version of jnlp file is used</td> </tr> <tr> <td><a href="https://bugs.openjdk.java.net/browse/JDK-8044949">JDK-8044949</a></td> <td>Run rule not working in case of html applet</td> </tr> <tr> <td><a href="https://bugs.openjdk.java.net/browse/JDK-8044947">JDK-8044947</a></td> <td>REGRESSION: There is no '-Daaa=/home/test' for javaplugin.vm.options after clicking on the JCP and pressing 's' key to dump system properties</td> </tr> <tr> <td><a href="https://bugs.openjdk.java.net/browse/JDK-8044946">JDK-8044946</a></td> <td>Java Control Panel appears at center and then slides to bottom left of screen</td> </tr> <tr> <td><a href="https://bugs.openjdk.java.net/browse/JDK-8044944">JDK-8044944</a></td> <td>Spurious Missing Manifest Permissions Attribute Warning When Launching versioned Java Web Start app</td> </tr> <tr> <td><a href="https://bugs.openjdk.java.net/browse/JDK-8044943">JDK-8044943</a></td> <td>The case:api/javax_jnlp/SingleInstanceService/index.html#AddRemove failed automatically</td> </tr> <tr> <td><a href="https://bugs.openjdk.java.net/browse/JDK-8044941">JDK-8044941</a></td> <td>DRS: Locale attribute for message element does not work with just language code</td> </tr> <tr> <td><a href="https://bugs.openjdk.java.net/browse/JDK-8044936">JDK-8044936</a></td> <td>RDF (8029649) can cause performance problem when Revocation check times out.</td> </tr> <tr> <td><a href="https://bugs.openjdk.java.net/browse/JDK-8044932">JDK-8044932</a></td> <td>Reduce dialog frequency when app is run multiple times</td> </tr> <tr> <td><a href="https://bugs.openjdk.java.net/browse/JDK-8044925">JDK-8044925</a></td> <td>test co-location: remove old SQE blackbox tests.</td> </tr> <tr> <td><a href="https://bugs.openjdk.java.net/browse/JDK-8044923">JDK-8044923</a></td> <td>Display issue of java control panel in ko and ja locale</td> </tr> <tr> <td><a href="https://bugs.openjdk.java.net/browse/JDK-8044921">JDK-8044921</a></td> <td>Layout problem on Exception site list dialog in ja, ko, de, es, fr, pt_BR</td> </tr> <tr> <td><a href="https://bugs.openjdk.java.net/browse/JDK-8044919">JDK-8044919</a></td> <td>More Information hyperlink in Blocked Application Dialog needs to use a new URL</td> </tr> <tr> <td><a href="https://bugs.openjdk.java.net/browse/JDK-8044914">JDK-8044914</a></td> <td>Java Control Panel does not honor system date/time settings</td> </tr> <tr> <td><a href="https://bugs.openjdk.java.net/browse/JDK-8044912">JDK-8044912</a></td> <td>java.lang.UnsupportedClassVersionError occurs while accessing an applet</td> </tr> <tr> <td><a href="https://bugs.openjdk.java.net/browse/JDK-8044911">JDK-8044911</a></td> <td>"Don't ask again..." doesn't work for expired native dialog on Ubuntu</td> </tr> <tr> <td><a href="https://bugs.openjdk.java.net/browse/JDK-8044910">JDK-8044910</a></td> <td>build broken: imports were missed</td> </tr> <tr> <td><a href="https://bugs.openjdk.java.net/browse/JDK-8044908">JDK-8044908</a></td> <td>backout parfait changes for javaws crash</td> </tr> <tr> <td><a href="https://bugs.openjdk.java.net/browse/JDK-8044907">JDK-8044907</a></td> <td>loading browser proxy via config script should not trigger JAR download</td> </tr> <tr> <td><a href="https://bugs.openjdk.java.net/browse/JDK-8044902">JDK-8044902</a></td> <td>JDK 8u5. When user click "Cancel" in Security warning dialog, wrong message is shown</td> </tr> <tr> <td><a href="https://bugs.openjdk.java.net/browse/JDK-8044901">JDK-8044901</a></td> <td>32-bit only Java Web Start apps fail to run on 32- and 64-bit JRE configs</td> </tr> <tr> <td><a href="https://bugs.openjdk.java.net/browse/JDK-8044882">JDK-8044882</a></td> <td>Update .jcheck/conf files for JDK 9</td> </tr> <tr> <td><a href="https://bugs.openjdk.java.net/browse/JDK-8044881">JDK-8044881</a></td> <td>DropDown List of JComboBox detached</td> </tr> <tr> <td><a href="https://bugs.openjdk.java.net/browse/JDK-8044880">JDK-8044880</a></td> <td>Java Web Start app run on Java SE 8 b79 shows "trust level" SecurityExceptions</td> </tr> <tr> <td><a href="https://bugs.openjdk.java.net/browse/JDK-8044879">JDK-8044879</a></td> <td>Accessibility class in jar on -xbootclasspath/a is not loaded by jvm </td> </tr> <tr> <td><a href="https://bugs.openjdk.java.net/browse/JDK-8044878">JDK-8044878</a></td> <td>8u20 l10n resource file translation update 1</td> </tr> <tr> <td><a href="https://bugs.openjdk.java.net/browse/JDK-8044877">JDK-8044877</a></td> <td>(corba) New connection reclaimed when number of connection is greater than highwatermark</td> </tr> <tr> <td><a href="https://bugs.openjdk.java.net/browse/JDK-8044875">JDK-8044875</a></td> <td>Support Solaris SO_FLOW_SLA socket option</td> </tr> <tr> <td><a href="https://bugs.openjdk.java.net/browse/JDK-8044874">JDK-8044874</a></td> <td>PPC64: Support for little endian execution model</td> </tr> <tr> <td><a href="https://bugs.openjdk.java.net/browse/JDK-8044873">JDK-8044873</a></td> <td>PPC64: Enable new build on AIX</td> </tr> <tr> <td><a href="https://bugs.openjdk.java.net/browse/JDK-8044872">JDK-8044872</a></td> <td>PPC64: Generic build preparations needed to enable new build on Linux/PPC64</td> </tr> <tr> <td><a href="https://bugs.openjdk.java.net/browse/JDK-8044870">JDK-8044870</a></td> <td>alsa library name is asound, not alsa</td> </tr> <tr> <td><a href="https://bugs.openjdk.java.net/browse/JDK-8044869">JDK-8044869</a></td> <td>Intermittent build failure: jdk8 fails on win_i586 in jdk/make (p11_convert.c(67) : Cannot open 'sun_security_pkcs11_wrapper_PKCS11.h)</td> </tr> <tr> <td><a href="https://bugs.openjdk.java.net/browse/JDK-8044868">JDK-8044868</a></td> <td>Allow duplicate bugid for changeset in jdk8 update forest</td> </tr> <tr> <td><a href="https://bugs.openjdk.java.net/browse/JDK-8044749">JDK-8044749</a></td> <td>Resolve autoconf and other merge issue from 8u20 to 8u25</td> </tr> <tr> <td><a href="https://bugs.openjdk.java.net/browse/JDK-8044604">JDK-8044604</a></td> <td>Increment minor version of HSx25 for 8u25 and initialize the build number</td> </tr> <tr> <td><a href="https://bugs.openjdk.java.net/browse/JDK-8044357">JDK-8044357</a></td> <td>[TEST_BUG] test/script/basic/JDK-8026161.js fails with java.lang.UnsatisfiedLinkError</td> </tr> <tr> <td><a href="https://bugs.openjdk.java.net/browse/JDK-8044190">JDK-8044190</a></td> <td>Relaunch to JRE 5 does not work</td> </tr> <tr> <td><a href="https://bugs.openjdk.java.net/browse/JDK-8044008">JDK-8044008</a></td> <td>TimeZoneNamesTest should be removed</td> </tr> <tr> <td><a href="https://bugs.openjdk.java.net/browse/JDK-8044007">JDK-8044007</a></td> <td>[TEST_BUG] sun/misc/Version/Version.java doesn't understand two-digit HotSpot minor version numbers</td> </tr> <tr> <td><a href="https://bugs.openjdk.java.net/browse/JDK-8043478">JDK-8043478</a></td> <td>Oracle Linux 5.x: Expired JRE disabled in the browser automatically and no native dialog prompting for the JRE update</td> </tr> <tr> <td><a href="https://bugs.openjdk.java.net/browse/JDK-8043445">JDK-8043445</a></td> <td>Unit Test Failures due to RDF and other 8u5 changes.</td> </tr> <tr> <td><a href="https://bugs.openjdk.java.net/browse/JDK-8043064">JDK-8043064</a></td> <td>[nightly] JNLP file invalid parsing</td> </tr> <tr> <td><a href="https://bugs.openjdk.java.net/browse/JDK-8042763">JDK-8042763</a></td> <td>[macosx] setDisplayMode crashes</td> </tr> <tr> <td><a href="https://bugs.openjdk.java.net/browse/JDK-8042762">JDK-8042762</a></td> <td>[macosx] huge native memory leak in AWTWindow.m</td> </tr> <tr> <td><a href="https://bugs.openjdk.java.net/browse/JDK-8042558">JDK-8042558</a></td> <td>Regression- Java Control Panel Advanced tab failed to display </td> </tr> <tr> <td><a href="https://bugs.openjdk.java.net/browse/JDK-8042545">JDK-8042545</a></td> <td>Regression: postscript size increase from 6u18</td> </tr> <tr> <td><a href="https://bugs.openjdk.java.net/browse/JDK-8042544">JDK-8042544</a></td> <td>IM candidate window appears on the South-East corner of the display.</td> </tr> <tr> <td><a href="https://bugs.openjdk.java.net/browse/JDK-8042541">JDK-8042541</a></td> <td>CacheTest Failure</td> </tr> <tr> <td><a href="https://bugs.openjdk.java.net/browse/JDK-8042538">JDK-8042538</a></td> <td>Java.Lang.Reflect.InvocationTargetException When Cache Has Disabled </td> </tr> <tr> <td><a href="https://bugs.openjdk.java.net/browse/JDK-8042535">JDK-8042535</a></td> <td>Disable timeout junit tests</td> </tr> <tr> <td><a href="https://bugs.openjdk.java.net/browse/JDK-8042534">JDK-8042534</a></td> <td>Disable SecurityBaseline.backgroundUpdate for JUnit test</td> </tr> <tr> <td><a href="https://bugs.openjdk.java.net/browse/JDK-8042533">JDK-8042533</a></td> <td>JNLPSignedResourcesHelperTest sometimes timeout on Windows</td> </tr> <tr> <td><a href="https://bugs.openjdk.java.net/browse/JDK-8042532">JDK-8042532</a></td> <td>[Nightly test failure]: PreloaderDelegateTest.testEarlyError</td> </tr> <tr> <td><a href="https://bugs.openjdk.java.net/browse/JDK-8042531">JDK-8042531</a></td> <td>Investigate MemoryCacheTest, JNLPSignedResourcesHelperTest, JVMManagerTest and JnlpUpdateTest</td> </tr> <tr> <td><a href="https://bugs.openjdk.java.net/browse/JDK-8042530">JDK-8042530</a></td> <td>Some JNLPSignedResourcesHelperTest tests fail on linux-amd64</td> </tr> <tr> <td><a href="https://bugs.openjdk.java.net/browse/JDK-8042529">JDK-8042529</a></td> <td>The fix for https://bugs.openjdk.java.net/browse/JDK-8037883 is still not good enough - unit test failure on linux-i586: com.sun.javaws.PreloaderTest.testProgressInOfflineMode</td> </tr> <tr> <td><a href="https://bugs.openjdk.java.net/browse/JDK-8042527">JDK-8042527</a></td> <td>Disable CacheUtilTest.testNoCodebase on Linux</td> </tr> <tr> <td><a href="https://bugs.openjdk.java.net/browse/JDK-8042526">JDK-8042526</a></td> <td>new unit test failure on linux-amd64: com.sun.javaws.PreloaderTest.testProgressInOfflineMode</td> </tr> <tr> <td><a href="https://bugs.openjdk.java.net/browse/JDK-8042525">JDK-8042525</a></td> <td>Fix server issue in some tests and WebServer</td> </tr> <tr> <td><a href="https://bugs.openjdk.java.net/browse/JDK-8042524">JDK-8042524</a></td> <td>DeployCacheHandlerTest NPE due to server resourse cleanup</td> </tr> <tr> <td><a href="https://bugs.openjdk.java.net/browse/JDK-8042523">JDK-8042523</a></td> <td>jdk9-client build failure caused by a jar not found</td> </tr> <tr> <td><a href="https://bugs.openjdk.java.net/browse/JDK-8042522">JDK-8042522</a></td> <td>BaseDirTest.testUserDir Failure on linux </td> </tr> <tr> <td><a href="https://bugs.openjdk.java.net/browse/JDK-8042520">JDK-8042520</a></td> <td>Exclude some tests that failed or causes error on Linux</td> </tr> <tr> <td><a href="https://bugs.openjdk.java.net/browse/JDK-8042519">JDK-8042519</a></td> <td>Fix Deployment Unit Test Timeout on Hudson</td> </tr> <tr> <td><a href="https://bugs.openjdk.java.net/browse/JDK-8042518">JDK-8042518</a></td> <td>FileNotFoundException when SetupHelper.blackListJarFile</td> </tr> <tr> <td><a href="https://bugs.openjdk.java.net/browse/JDK-8042517">JDK-8042517</a></td> <td>Make the starting web server port in sun.tests.helpers.WebServer configurable via an environment variable</td> </tr> <tr> <td><a href="https://bugs.openjdk.java.net/browse/JDK-8042516">JDK-8042516</a></td> <td>hudson junit test JNLPSignedResourcesHelperTest.java failures observed on mac but not windows</td> </tr> <tr> <td><a href="https://bugs.openjdk.java.net/browse/JDK-8042515">JDK-8042515</a></td> <td>Improve com/sun/deploy/security/RootCertStore.java so that it warns about missing system certificates file</td> </tr> <tr> <td><a href="https://bugs.openjdk.java.net/browse/JDK-8042514">JDK-8042514</a></td> <td>Typo in the fix for 8033492</td> </tr> <tr> <td><a href="https://bugs.openjdk.java.net/browse/JDK-8042513">JDK-8042513</a></td> <td>Deploy unit test to 100% pass rate</td> </tr> <tr> <td><a href="https://bugs.openjdk.java.net/browse/JDK-8042512">JDK-8042512</a></td> <td>Provide a way to override the default junit timeout of 10 minutes when running the deployment test suite</td> </tr> <tr> <td><a href="https://bugs.openjdk.java.net/browse/JDK-8042511">JDK-8042511</a></td> <td>Disable crashing deploy unit tests</td> </tr> <tr> <td><a href="https://bugs.openjdk.java.net/browse/JDK-8042510">JDK-8042510</a></td> <td>sun.plugin2.applet.FXAppletSecurityManagerTest: Error and Failure</td> </tr> <tr> <td><a href="https://bugs.openjdk.java.net/browse/JDK-8042509">JDK-8042509</a></td> <td>com.sun.javaws.security.JNLPSignedResourcesHelperTest: crash</td> </tr> <tr> <td><a href="https://bugs.openjdk.java.net/browse/JDK-8042507">JDK-8042507</a></td> <td>sun.plugin2.applet.AWTAppletLifecycleTest.testAppletHasParentBeforeInit test failure</td> </tr> <tr> <td><a href="https://bugs.openjdk.java.net/browse/JDK-8042506">JDK-8042506</a></td> <td>sun.plugin2.applet.Applet2DownloadTest : Caused an ERROR</td> </tr> <tr> <td><a href="https://bugs.openjdk.java.net/browse/JDK-8042505">JDK-8042505</a></td> <td>Both testCheckConnectWithContext and testCheckConnect started failing after recent sync from the sandbox</td> </tr> <tr> <td><a href="https://bugs.openjdk.java.net/browse/JDK-8042504">JDK-8042504</a></td> <td>sun.plugin2.applet.SerialAppletTest.testInitNormalSerialApplet: Caused an ERROR</td> </tr> <tr> <td><a href="https://bugs.openjdk.java.net/browse/JDK-8042503">JDK-8042503</a></td> <td>com.sun.jnlp.JNLPPreverifyClassLoaderTest.testInternalGzip: JNLPPreverifyClassLoader.initialize: FAILED </td> </tr> <tr> <td><a href="https://bugs.openjdk.java.net/browse/JDK-8042502">JDK-8042502</a></td> <td>sun.plugin2.applet.JNLPAppletPreloaderTest: 5 errors</td> </tr> <tr> <td><a href="https://bugs.openjdk.java.net/browse/JDK-8042501">JDK-8042501</a></td> <td>com.sun.deploy.registration.RegisterDeployTest failed</td> </tr> <tr> <td><a href="https://bugs.openjdk.java.net/browse/JDK-8042500">JDK-8042500</a></td> <td>com.sun.deploy.cache.CacheEntryTest.testReadSigningData failed</td> </tr> <tr> <td><a href="https://bugs.openjdk.java.net/browse/JDK-8042499">JDK-8042499</a></td> <td>sun.plugin2.applet.SignedAsBLOBJarTest: 5 similar errors due to ExitException</td> </tr> <tr> <td><a href="https://bugs.openjdk.java.net/browse/JDK-8042498">JDK-8042498</a></td> <td>sun.plugin2.applet.JNLP2ClassLoaderTest: 11 errors</td> </tr> <tr> <td><a href="https://bugs.openjdk.java.net/browse/JDK-8042497">JDK-8042497</a></td> <td>sun.plugin2.applet.Applet2ClassLoaderTest -- Your security settings have blocked an untrusted application from running</td> </tr> <tr> <td><a href="https://bugs.openjdk.java.net/browse/JDK-8042496">JDK-8042496</a></td> <td>sun.plugin2.main.server.JVMManagerTest Failed</td> </tr> <tr> <td><a href="https://bugs.openjdk.java.net/browse/JDK-8042495">JDK-8042495</a></td> <td>sun.plugin2.message.LaunchJVMAppletMessageTest failed</td> </tr> <tr> <td><a href="https://bugs.openjdk.java.net/browse/JDK-8042494">JDK-8042494</a></td> <td>com.sun.javaws.LaunchDownloadHttpsTest failed</td> </tr> <tr> <td><a href="https://bugs.openjdk.java.net/browse/JDK-8042493">JDK-8042493</a></td> <td>Both testcases testLoadClassFromLazyBlackListJar and testLoadClassFromLazyBlackListJar_NoCache caused an error</td> </tr> <tr> <td><a href="https://bugs.openjdk.java.net/browse/JDK-8042492">JDK-8042492</a></td> <td>sun.plugin2.applet.SignedCachedJarTest failed</td> </tr> <tr> <td><a href="https://bugs.openjdk.java.net/browse/JDK-8042491">JDK-8042491</a></td> <td>com.sun.jnlp.DownloadServiceImplTest.testRemoveAndLoadPart: NPE at ToolkitStore.get().getAppContext()</td> </tr> <tr> <td><a href="https://bugs.openjdk.java.net/browse/JDK-8042490">JDK-8042490</a></td> <td>sun.plugin2.applet.viewer.JNLP2ViewerTest failed on Mac</td> </tr> <tr> <td><a href="https://bugs.openjdk.java.net/browse/JDK-8042489">JDK-8042489</a></td> <td>SetupHelpers.blackListJarFile is out dated</td> </tr> <tr> <td><a href="https://bugs.openjdk.java.net/browse/JDK-8042488">JDK-8042488</a></td> <td>Unit test error PolicyParserTest</td> </tr> <tr> <td><a href="https://bugs.openjdk.java.net/browse/JDK-8042487">JDK-8042487</a></td> <td>com.sun.deploy.uitoolkit.impl.awt.ui.DownloadWindowForServiceTest: progress should be hidden after download</td> </tr> <tr> <td><a href="https://bugs.openjdk.java.net/browse/JDK-8042424">JDK-8042424</a></td> <td>Link error: launcher.c:(.text+0x1a97): undefined reference to `_stprintf'</td> </tr> <tr> <td><a href="https://bugs.openjdk.java.net/browse/JDK-8042065">JDK-8042065</a></td> <td>JNLP with java-vm-args whose length exceeded 512 chars failed to get loaded with CouldNotLoadArgumentException</td> </tr> <tr> <td><a href="https://bugs.openjdk.java.net/browse/JDK-8041965">JDK-8041965</a></td> <td>JUnit test compilation error on non Windows platform</td> </tr> <tr> <td><a href="https://bugs.openjdk.java.net/browse/JDK-8040746">JDK-8040746</a></td> <td>(tz) Support tzdata2014b</td> </tr> <tr> <td><a href="https://bugs.openjdk.java.net/browse/JDK-8040744">JDK-8040744</a></td> <td>Increment hsx 25.11 build to b02 for 8u11-b04</td> </tr> <tr> <td><a href="https://bugs.openjdk.java.net/browse/JDK-8040739">JDK-8040739</a></td> <td>Investigate com.sun.javaws.security.JNLPSignedResourcesHelperTest.DISABLED_testWarmupValidationWithSignedJNLP</td> </tr> <tr> <td><a href="https://bugs.openjdk.java.net/browse/JDK-8040737">JDK-8040737</a></td> <td>sun.plugin2.applet.JNLP2ClassLoaderTest.testFindGetBasics: Error</td> </tr> <tr> <td><a href="https://bugs.openjdk.java.net/browse/JDK-8040335">JDK-8040335</a></td> <td>With active Securitymanager JAXBContext.newInstance fails</td> </tr> <tr> <td><a href="https://bugs.openjdk.java.net/browse/JDK-8039219">JDK-8039219</a></td> <td>Update hsx version to hs25.11 with b01 for 8u11 release</td> </tr> <tr> <td><a href="https://bugs.openjdk.java.net/browse/JDK-8039203">JDK-8039203</a></td> <td>[TEST] Child process error stream is not empty! </td> </tr> <tr> <td><a href="https://bugs.openjdk.java.net/browse/JDK-8039197">JDK-8039197</a></td> <td>Review comments from 8035897</td> </tr> <tr> <td><a href="https://bugs.openjdk.java.net/browse/JDK-8039144">JDK-8039144</a></td> <td> Applet with jnlp.Packenabled=True And jnlp.versionEnabled=True Fails </td> </tr> <tr> <td><a href="https://bugs.openjdk.java.net/browse/JDK-8027821">JDK-8027821</a></td> <td>For signed jars without manifest "Permissions", there is still security warning dialog before Application Error (Or blocked) Dialog.</td> </tr> <tr> <td><a href="https://bugs.openjdk.java.net/browse/JDK-8025726">JDK-8025726</a></td> <td>Certificate rule in DRS does not work for Java Web Start app when caching is turned off</td> </tr> </table> <h2>Committer push log</h2> </body> </html>