PUSHES REPORT: 8u40

This report shows who pushed the backports to the given release. This usually shows who did the backporting, testing, and review work.

Report generated: Mon Nov 08 19:03:13 CET 2021

Distribution by priority

Count Priority
24 P1
145 P2
408 P3
300 P4
20 P5

Distribution by components

Count Component
897 100% Total
330 36.8% core-libs
196 21.9% core-libs/jdk.nashorn
38 4.2% core-libs/java.lang.invoke
16 1.8% core-libs/java.net
15 1.7% core-libs
9 1.0% core-libs/java.util:i18n
8 0.9% core-libs/java.lang
7 0.8% core-libs/java.nio
7 0.8% core-libs/java.lang:reflect
4 0.4% core-libs/java.util.logging
4 0.4% core-libs/java.util:collections
4 0.4% core-libs/java.math
4 0.4% core-libs/javax.naming
3 0.3% core-libs/java.util.concurrent
3 0.3% core-libs/java.util
2 0.2% core-libs/javax.script
2 0.2% core-libs/java.lang:class_loading
2 0.2% core-libs/java.util.stream
2 0.2% core-libs/java.io
2 0.2% core-libs/java.time
1 0.1% core-libs/java.rmi
1 0.1% core-libs/java.text
297 33.1% hotspot
118 13.2% hotspot/gc
97 10.8% hotspot/compiler
65 7.2% hotspot/runtime
13 1.4% hotspot/svc
2 0.2% hotspot/jvmti
2 0.2% hotspot/test
89 9.9% client-libs
35 3.9% client-libs/java.awt
23 2.6% client-libs/javax.swing
19 2.1% client-libs/2d
4 0.4% client-libs
3 0.3% client-libs/javax.sound
2 0.2% client-libs/java.beans
1 0.1% client-libs/demo
1 0.1% client-libs/java.awt:i18n
1 0.1% client-libs/javax.imageio
74 8.2% infrastructure
69 7.7% infrastructure/build
5 0.6% infrastructure
45 5.0% tools
36 4.0% tools/javac
7 0.8% tools
1 0.1% tools/javadoc(tool)
1 0.1% tools/launcher
25 2.8% security-libs
9 1.0% security-libs/java.security
3 0.3% security-libs/javax.smartcardio
3 0.3% security-libs/javax.net.ssl
3 0.3% security-libs
3 0.3% security-libs/org.ietf.jgss:krb5
1 0.1% security-libs/javax.xml.crypto
1 0.1% security-libs/javax.security
1 0.1% security-libs/org.ietf.jgss
1 0.1% security-libs/javax.crypto
15 1.7% core-svc
4 0.4% core-svc/tools
4 0.4% core-svc/javax.management
3 0.3% core-svc
2 0.2% core-svc/java.lang.management
1 0.1% core-svc/java.lang.instrument
1 0.1% core-svc/debugger
10 1.1% xml
4 0.4% xml/jaxp
2 0.2% xml
2 0.2% xml/jaxb
1 0.1% xml/jax-ws
1 0.1% xml/javax.xml.validation
5 0.6% globalization
5 0.6% globalization/translation
3 0.3% other-libs
2 0.2% other-libs/other
1 0.1% other-libs/corba:rmi-iiop
2 0.2% deploy
1 0.1% deploy/plugin
1 0.1% deploy
1 0.1% docs
1 0.1% docs
1 0.1% embedded
1 0.1% embedded/libraries

Distribution by affiliation

Count Committer
894 100% Total
553 61.9% Oracle
49 5.5% Vladimir Ivanov
46 5.1% Thomas Schatzl
37 4.1% Stefan Karlsson
37 4.1% Robert Mckenna
34 3.8% Vladimir Kozlov
25 2.8% Hannes Wallnoefer
21 2.3% Sundararajan Athijegannathan
19 2.1% Albert Noll
15 1.7% Sean Coffey
13 1.5% David Holmes
13 1.5% Vicente Arturo Romero Zaldivar
12 1.3% Bengt Rutisson
12 1.3% Igor Veresov
10 1.1% Aleksej Efimov
10 1.1% Igor Ignatyev
9 1.0% Robert Field
8 0.9% Christian Tornqvist
8 0.9% Jesper Wilhelmsson
7 0.8% Weijun Wang
7 0.8% Coleen Phillimore
7 0.8% Philip Race
6 0.7% Brian Burkhalter
6 0.7% Calvin Cheung
6 0.7% Joel Borggrén-Franck
6 0.7% Jan Lahoda
6 0.7% Ioi Lam
6 0.7% Petr Pchelko
6 0.7% Mandy Chung
6 0.7% Staffan Larsen
5 0.6% Michael Fang
5 0.6% Anthony Scarpino
5 0.6% Anton Litvinov
4 0.4% Markus Grönlund
4 0.4% Maurizio Cimadamore
4 0.4% Roger Riggs
4 0.4% Daniel Fuchs
4 0.4% Tobias Hartmann
4 0.4% Paul Sandoz
4 0.4% Mikhail Cherkasov
4 0.4% Erik Gahlin
4 0.4% David Buck
4 0.4% Harold Seigel
4 0.4% Dmitry Markov
4 0.4% Mikael Gerdin
3 0.3% Jon Masamitsu
3 0.3% Shanliang Jiang
2 0.2% Michael McMahon
2 0.2% Svetlana Steuck
2 0.2% Henry Jen
2 0.2% Vincent Ryan
2 0.2% Rickard Backman
2 0.2% Kevin Walls
2 0.2% Brent Christian
2 0.2% Erik Joelsson
2 0.2% Daniel Daugherty
2 0.2% Erik Helin
2 0.2% Yumin Qi
1 0.1% Mark Sheppard
1 0.1% Sean Mullan
1 0.1% Joe Wang
1 0.1% Poonam Bajaj Parhar
1 0.1% Valerie Peng
1 0.1% Morris Meyer
1 0.1% Anton Nashatyrev
1 0.1% Dan Smith
1 0.1% Dmeetry Degrave
1 0.1% Stuart Marks
1 0.1% Yong Huang
1 0.1% Lance Andersen
1 0.1% Anthony Petrov
1 0.1% Naoto Sato
1 0.1% Karen Kinnear
214 23.9% Independent
129 14.4% Attila Szegedi
31 3.5% Alejandro Murillo
20 2.2% Marcus Lagergren
12 1.3% Abhijit Saha
11 1.2% Mike Duigou
5 0.6% Chris Hegarty
2 0.2% Masayoshi Okutsu
2 0.2% Peter Levart
1 0.1% Jonathan Lu
1 0.1% Dmitriy Samersoff
30 3.4% Amazon
29 3.2% Sergey Bylokhov
1 0.1% Volker Simonis
23 2.6% Google
21 2.3% Ivan Gerasimov
2 0.2% Jiangli Zhou
22 2.5% Red Hat
16 1.8% Zhengyu Gu
6 0.7% Roland Westrelin
14 1.6% Azul
6 0.7% Konstantin Shefov
4 0.4% Andrew Brygin
3 0.3% Yuri Nesterenko
1 0.1% Dmitry Cherepanov
14 1.6% BellSoft
14 1.6% Alexandr Scherbatiy
12 1.3% Twitter
12 1.3% John Coomes
3 0.3% @metricspace.net
3 0.3% Eric Mccorkle
3 0.3% DataDog
3 0.3% Jaroslav Bachorík
3 0.3% VMWare
3 0.3% Kumar Srinivasan
2 0.2% JetBrains
2 0.2% Anton Tarasov
1 0.1% SAP
1 0.1% Goetz Lindenmaier

Chronological push log:

Days Ago Committer Affiliation Bug Summary
2474 Robert Mckenna Oracle JDK-8072019 AIX port of "8050807: Better performing performance data handling"
2481 Robert Mckenna Oracle JDK-8071385 Forgot to add a test model to JDK-8068573
2481 Robert Mckenna Oracle JDK-8071384 POJO setter using [] syntax throws an exception
2481 Robert Mckenna Oracle JDK-8071383 REGRESSION: test/script/external/test262/test/suite/ch11/11.2/11.2.3/S11.2.3_A3_T5.js fails with tip
2481 Robert Mckenna Oracle JDK-8071382 Calling a @FunctionalInterface from JS leaks internal objects
2481 Robert Mckenna Oracle JDK-8071381 SHA1WithDSA with key > 1024 bits not working
2483 Alejandro Murillo Independent JDK-8069209 new hotspot build - hs25.40-b25
2483 Alejandro Murillo Independent JDK-8068729 Usage of UseHugeTLBFS, UseLargePagesInMetaspace and huge SurvivorAlignmentInBytes cause crashes in CMBitMapClosure::do_bit
2483 Abhijit Saha Independent JDK-8069428 Increment the build value to b07 for hs25.31 in 8u31-b11
2483 Abhijit Saha Independent JDK-8069426 Increment the build value to b06 for hs25.31 in 8u31-b10
2483 Abhijit Saha Independent JDK-8069425 Increment the build value to b05 for hs25.31 in 8u31-b08
2483 Abhijit Saha Independent JDK-8069424 Increment hsx 25.31 build to b04 for 8u31-b08
2483 Abhijit Saha Independent JDK-8069423 Increment hsx 25.31 build to b03 for 8u31-b06
2483 Abhijit Saha Independent JDK-8069421 Increment hsx 25.31 build to b02 for 8u31-b05
2483 Abhijit Saha Independent JDK-8069415 Increment minor version of HSx for 8u31 and initialize the build number
2487 Michael Fang Oracle JDK-8069122 l10n resource file update for JDK-8068491
2489 Robert Mckenna Oracle JDK-8068495 Update the protocol for references of docs.oracle.com to HTTPS in langtools.
2489 Robert Mckenna Oracle JDK-8068491 Update the protocol for references of docs.oracle.com to HTTPS.
2489 Robert Mckenna Oracle JDK-8068485 Update references of download.oracle.com to docs.oracle.com in javadoc makefile
2491 Alejandro Murillo Independent JDK-8068911 [TESTBUG] New tests in gc/survivorAlignment/ fails
2491 Alejandro Murillo Independent JDK-8068910 Add tests on alignment of objects copied to survivor space
2491 Alejandro Murillo Independent JDK-8068631 new hotspot build - hs25.40-b24
2491 Robert Mckenna Oracle JDK-8068858 $jdk/api/javac/tree contains docs for nashorn
2491 Robert Mckenna Oracle JDK-8068857 jdeps needs a different mechanism to recognize javax.jnlp as supported API
2523 Goetz Lindenmaier SAP JDK-8067323 ppc64: argument and return type profiling, fix problem with popframe
2523 David Holmes Oracle JDK-8067232 [TESTBUG] runtime/CheckEndorsedAndExtDirs/EndorsedExtDirs.java fails with ClassNotFoundException
2523 Roland Westrelin Red Hat JDK-8067299 SIGSEGV with +TraceDeoptimization in Deoptimization::print_objects
2523 Roland Westrelin Red Hat JDK-8066955 opto/node.hpp:355, assert(i < _max) failed: oob: i=1, _max=1
2523 Roland Westrelin Red Hat JDK-8066243 C2's range check smearing allows out of bound array accesses
2523 Roland Westrelin Red Hat JDK-8064322 The escape analysis with G1 cause crash assertion src/share/vm/runtime/vframeArray.cpp:94
2523 Michael Fang Oracle JDK-8065157 jdk8u40 Japanese man page file translation update
2524 Vladimir Ivanov Oracle JDK-8066891 MHs.explicitCastArguments does incorrect type checks for VarargsCollector
2524 Vladimir Ivanov Oracle JDK-8065969 LambdaForm caches should support eviction
2524 Hannes Wallnoefer Oracle JDK-8067285 NPE in ScriptObject.clone() when running with object fields
2524 Eric Mccorkle @metricspace.net JDK-8067039 Revert changes to annotation attribute generation
2524 Hannes Wallnoefer Oracle JDK-8067244 dust.js performance regression caused by primitive field conversion
2524 Hannes Wallnoefer Oracle JDK-8067228 __noSuchMethod__ binds to this-object without proper guard
2524 Stefan Karlsson Oracle JDK-8066779 Crash in InstanceKlass::clean_method_data when _method is NULL
2524 Attila Szegedi Independent JDK-8067216 Fuzzing bug: Assertion error related to bytecode slots
2524 Igor Veresov Oracle JDK-8066973 Array Out Of Bounds Exception causes variable corruption
2524 Sergey Bylokhov Amazon JDK-8067174 [macosx] "Pinch to zoom" does not work since jdk7
2525 Attila Szegedi Independent JDK-8067161 Fuzzing bug: StackMapTable error: bad offset, ClassFormatError
2525 Attila Szegedi Independent JDK-8067160 Fuzzing bug: constant folding of ternary operator and IfNode with constant test
2525 Attila Szegedi Independent JDK-8067159 Fuzzing bug: duplicate integer switch cases
2525 Sundararajan Athijegannathan Oracle JDK-8067145 BrowserJSObjectLinker does not handle call on JSObjects
2525 Alexandr Scherbatiy BellSoft JDK-8065627 Animated GIFs fail to display on a HiDPI display
2525 Ioi Lam Oracle JDK-8066671 -XX:+PrintSharedArchiveAndExit does not exit the VM when the archive is invalid
2526 Sergey Bylokhov Amazon JDK-8066986 [headless] DataTransferer.getInstance throws ClassCastException in headless mode
2526 Anton Litvinov Oracle JDK-8066758 [TEST_BUG] test/sun/awt/dnd/8024061/bug8024061.java fails
2526 Daniel Fuchs Oracle JDK-8066907 LogManager unecessarily calls JavaAWTAccess from within a critical section
2527 Sergey Bylokhov Amazon JDK-8066888 Broken link in java.awt.event Interface KeyListener
2527 Attila Szegedi Independent JDK-8066887 Fuzzing bug: CodeGenerator load unitialized slot
2527 Attila Szegedi Independent JDK-8066886 Fuzzing bug: Undefined object type assertion when computing TypeBounds
2529 Alejandro Murillo Independent JDK-8066647 new hotspot build - hs25.40-b23
2529 Robert Mckenna Oracle JDK-8065238 javax.naming.NamingException after upgrade to JDK 8
2529 Chris Hegarty Independent JDK-8066804 [TEST_BUG] sun/net/www/http/HttpClient/StreamingRetry.java failed intermittently
2530 Konstantin Shefov Azul JDK-8066785 [TESTBUG] java/lang/invoke/LFCaching/LFMultiThreadCachingTest.java failed - timeout
2530 Sergey Bylokhov Amazon JDK-8066755 CTW CRASH: SIGSEGV in ctw/jre/lib/rt_jar/preloading_1 and ctw/jre/lib/rt_jar/sun_awt_X11_ListHelper
2530 Sergey Bylokhov Amazon JDK-8066754 JFileChooser filter uses .toString() instead of getDescription() for filter text on GTK laf
2530 Mandy Chung Oracle JDK-8065702 Deprecate the Extension Mechanism
2531 Shanliang Jiang Oracle JDK-8066693 [TEST_BUG] javax/management/monitor/CounterMonitorTest.java hangs
2531 Paul Sandoz Oracle JDK-8066677 Remove network-related seed initialization code in ThreadLocal/SplittableRandom
2531 David Buck Oracle JDK-8065638 JVM_GetVersionInfo fails to zero structure
2531 Vladimir Kozlov Oracle JDK-8066649 8u backport for 8065618 is incorrect
2531 Vladimir Kozlov Oracle JDK-8066653 C2 escape analysis prevents VM from exiting quickly
2532 Hannes Wallnoefer Oracle JDK-8066598 OOM on Window/Solaris in test compile-octane-splitter.js
2532 Alexandr Scherbatiy BellSoft JDK-8066591 closed/javax/swing/JComboBox/4212498/bug4212498.java:Edit the value in the text field and then press the tab key, the number don't increase
2532 Robert Mckenna Oracle JDK-8066582 [TEST_BUG] java/lang/ProcessBuilder/Basic.java failed with: java.lang.AssertionError: Some tests failed
2532 Alejandro Murillo Independent JDK-8066510 Disable JPRT submissions from the hotspot repo
2532 Vladimir Kozlov Oracle JDK-8066496 C2 RA incorrectly removes kill projections
2532 Mandy Chung Oracle JDK-8065765 Missing space in output message from -XX:+CheckEndorsedAndExtDirs
2533 Igor Ignatyev Oracle JDK-8066408 compiler/EliminateAutoBox/UnsignedLoads.java fails with client vm
2533 Roland Westrelin Red Hat JDK-8066416 opto/node.hpp:355, assert(i < _max) failed: oob: i=1, _max=1
2533 Roland Westrelin Red Hat JDK-8062149 C2: Incorrectly compiled char[] array access crashes JVM
2533 Alexandr Scherbatiy BellSoft JDK-8066412 [macosx] TwentyThousandTest test failed with OOM
2533 Svetlana Steuck Oracle JDK-8066121 Nashorn: Tests failed on Windows when in output contains path to script
2534 Sundararajan Athijegannathan Oracle JDK-8066278 jdk.nashorn.api.scripting package javadoc should be included in jdk docs
2534 Coleen Phillimore Oracle JDK-8042592 redefining method used by multiple MethodHandles crashes VM
2534 Sergey Bylokhov Amazon JDK-8066276 Default implementation of DrawImage.renderImageXform() should be improved for d3d/ogl
2534 Sergey Bylokhov Amazon JDK-8066275 [OGL] Metrics for a method choice copying of texture should be improved
2537 Jan Lahoda Oracle JDK-8066175 Compiler Error when obtaining .class property
2537 Ivan Gerasimov Google JDK-8066169 Core reflection should use final fields whenever possible
2537 Marcus Lagergren Independent JDK-8066144 Missing resource type.error.not.an.arraybuffer
2537 Attila Szegedi Independent JDK-8066134 Function.prototype.bind doesn't work on all callables
2537 Alejandro Murillo Independent JDK-8066061 new hotspot build - hs25.40-b22
2538 Hannes Wallnoefer Oracle JDK-8057980 let & const: remaining issues with lexical scoping
2538 Vladimir Ivanov Oracle JDK-8066109 Inlining failure of Number.doubleValue() in JSType.toNumeric() causes 15% peak perf regresion on Box2D
2538 Alexandr Scherbatiy BellSoft JDK-8066100 JColorChooser no longer supports drag and drop between two JVM instances
2538 Vladimir Ivanov Oracle JDK-8066029 MaxNodeLimit and LiveNodeCountInliningCutoff should be increased
2538 Vladimir Ivanov Oracle JDK-8066028 SIGSEGV in Metadata::mark_on_stack() while marking metadata in ciEnv
2538 Vladimir Ivanov Oracle JDK-8066027 C2: EliminateAutoBox regression after 8042786
2538 Vladimir Ivanov Oracle JDK-8066022 Get rid of LambdaForm interpretation
2538 Vladimir Ivanov Oracle JDK-8066021 Enable full LF sharing by default
2538 Vladimir Ivanov Oracle JDK-8066020 GWT branch frequencies pollution due to LF sharing
2539 Joel Borggrén-Franck Oracle JDK-8065192 javac Attr crashes with NPE in TypeAnnotationsValidator visitNewClass
2539 Robert Field Oracle JDK-8058112 Invalid BootstrapMethod for constructor/method reference
2540 Eric Mccorkle @metricspace.net JDK-8065132 Parameter annotations not updated when synthetic parameters are prepended
2540 Yuri Nesterenko Azul JDK-8065108 Nashorn: RuntimeException when run command from js with -scripting on Cygwin
2540 Yuri Nesterenko Azul JDK-8059654 Nashorn: Some tests fails on windows with AccessControlException
2540 Ioi Lam Oracle JDK-8065841 WB_AddToBootstrapClassLoaderSearch calls JvmtiEnv::create_a_jvmti when not in _thread_in_vm state
2540 Ioi Lam Oracle JDK-8065840 Some CDS optimizations should be disabled if bootclasspath is modified by JVMTI
2540 Vicente Arturo Romero Zaldivar Oracle JDK-8065407 Inference chokes on wildcard derived from method reference
2540 Vicente Arturo Romero Zaldivar Oracle JDK-8065389 Missing compile error in Java 8 mode for Interface.super.field access
2541 Aleksej Efimov Oracle JDK-8065782 (tz) Support tzdata2014j
2541 Hannes Wallnoefer Oracle JDK-8057691 Nashorn: let & const declarations are not shared between scripts
2541 Hannes Wallnoefer Oracle JDK-8065747 Nashorn should just warn on code store instantiation error
2541 Tobias Hartmann Oracle JDK-8064574 crash while compiling java.lang.ref.Finalizer::runFinalizer
2542 Sergey Bylokhov Amazon JDK-8049256 Introspector ignores indexed part of the property sometimes
2542 Sergey Bylokhov Amazon JDK-8049255 Do not prefer indexed properties
2543 Alejandro Murillo Independent JDK-8065385 new hotspot build - hs25.40-b21
2544 Stefan Karlsson Oracle JDK-8065227 Report allocation context stats at end of cleanup
2544 Jesper Wilhelmsson Oracle JDK-8065305 Make it possible to extend the G1CollectorPolicy
2544 Roger Riggs Oracle JDK-8065397 Remove ExtendedPlatformComponent.java from EXFILES list
2545 Henry Jen Oracle JDK-8065386 AIX: fix adjust-mflags.sh to build with GNU Make 4.0 (adapt 8028407 for AIX)
2545 Henry Jen Oracle JDK-8065267 adjust-mflags.sh failed build with GNU Make 4.0 with -I
2545 Erik Gahlin Oracle JDK-8062372 java/lang/instrument/DaemonThread/TestDaemonThread.java regularly fails due to exceeded timeout
2545 Ivan Gerasimov Google JDK-8065537 Misplaced parentheses in sun.net.www.http.HttpClient break HTTP PUT streaming
2545 Mandy Chung Oracle JDK-8064667 Add -XX:+CheckEndorsedAndExtDirs flag to JDK 8
2546 Markus Grönlund Oracle JDK-8065382 Fixup headers and definitions for INCLUDE_TRACE
2546 Petr Pchelko Oracle JDK-8065376 [macosx] Potential incomplete fix for JDK-8031485
2546 Michael Fang Oracle JDK-8065181 Japanese translation for a warning from javac looks incorrect.
2546 Eric Mccorkle @metricspace.net JDK-8055063 Parameter#toString() fails w/ AIOOBE for ctr of inner class w/ generic type
2547 Erik Joelsson Oracle JDK-8065232 Add --with-copyright-year option to configure
2547 Mikael Gerdin Oracle JDK-8058209 Race in G1 card scanning could allow scanning of memory covered by PLABs
2547 Alexandr Scherbatiy BellSoft JDK-8062657 AWT fails on generic non-reparenting window managers
2547 Sergey Bylokhov Amazon JDK-8065211 JInternalFrame title not antialiased in Nimbus LaF
2547 Sergey Bylokhov Amazon JDK-8065210 Incorrect color conversion, when bicubic interpolation is used
2547 Sergey Bylokhov Amazon JDK-8065209 [D3D] The fix for JDK-8029253 should be ported to d3d pipeline
2547 Sergey Bylokhov Amazon JDK-8065208 [OGL] Incorrect clip is used during sw->surface blit in xor mode
2547 Sergey Bylokhov Amazon JDK-8065207 [TEST_BUG] [macosx] In test, the window does not have time to resize before make a screenshot
2547 Sergey Bylokhov Amazon JDK-8065206 [macosx] Aqua LaF should use BI.TYPE_INT_ARGB_PRE for a better performance
2547 Sergey Bylokhov Amazon JDK-8065205 JFrame in full screen mode leaves empty workspace after close
2547 Sergey Bylokhov Amazon JDK-8065204 Reference to nonexistant Class in javadoc
2547 Sergey Bylokhov Amazon JDK-8058308 [macosx] Performance problems with Retina display on Mac OS X
2547 Sergey Bylokhov Amazon JDK-8057830 Crash in Java2D Queue Flusher, OGLSD_SetScratchSurface
2547 Tobias Hartmann Oracle JDK-8062908 compiler/whitebox/IsMethodCompilableTest.java fails with 'method() is not compilable after 3 iterations'
2547 Jiangli Zhou Google JDK-8064735 Change certain errors to warnings in CDS output
2547 Jon Masamitsu Oracle JDK-8062690 ConcurrentMarkThread::slt may be invoked before ConcurrentMarkThread::makeSurrogateLockerThread causing intermittent crashes
2547 Coleen Phillimore Oracle JDK-8056024 Change 8037816 breaks HS build on PPC64 and CPP-Interpreter platforms
2548 Anton Nashatyrev Oracle JDK-8065130 Dragged and Dropped data is corrupted for two data types
2548 Marcus Lagergren Independent JDK-8065129 Test NASHORN-377.js fails on Solaris sparc
2549 Daniel Daugherty Oracle JDK-8034005 cannot debug in synchronizer.o or objectMonitor.o on Solaris X86 debug/jvmg bits
2549 Daniel Daugherty Oracle JDK-8033602 wrong stabs data in libjvm.debuginfo on JDK 8 - SPARC
2550 Robert Field Oracle JDK-8065061 VerifyError when running successfully compiled java class
2550 Robert Field Oracle JDK-8065060 Lambda: NPE while obtaining method reference through lambda expression
2550 Robert Field Oracle JDK-8065059 JVM cannot access constructor though ::new reference although can call it directly
2550 Robert Field Oracle JDK-8065058 lambda reference to inner class in base class causes LambdaConversionException
2550 Robert Field Oracle JDK-8065057 javac complex method references: revamp and simplify
2550 Robert Field Oracle JDK-8062855 javac NPE or VerifyError for code with constructor reference of inner class
2550 Brent Christian Oracle JDK-8064288 sun.management.Flag should loadLibrary()
2550 Jan Lahoda Oracle JDK-8064879 Compiler error when anonymous class uses method with parametrized exception
2551 Alejandro Murillo Independent JDK-8064854 new hotspot build - hs25.40-b20
2551 Konstantin Shefov Azul JDK-8064893 TestHumongousShrinkHeap.java can not be run with -XX:+ExplicitGCInvokesConcurrent
2551 Alexandr Scherbatiy BellSoft JDK-8064886 [macosx] Incorrect thread access when showing splash screen
2551 Alexandr Scherbatiy BellSoft JDK-8064884 [macosx] java -splash does not honor @2x hi dpi notation for retina support
2551 Joel Borggrén-Franck Oracle JDK-8064391 More thread safety problems in core reflection
2551 Alexandr Scherbatiy BellSoft JDK-8064871 ownedWindowList access requires synchronization in Window.setAlwaysOnTop() method
2551 Yumin Qi Oracle JDK-8064841 [TESTBUG] Allow WhiteBox test to access JVM offsets
2551 Vladimir Kozlov Oracle JDK-8064839 Bug in locking code when UseOptoBiasInlining is disabled: assert(dmw->is_neutral()) failed: invariant
2552 Attila Szegedi Independent JDK-8064824 Remove NativeArray link logic fields
2552 Marcus Lagergren Independent JDK-8064821 GlobalConstants produces wrong result with Object.defineProperty
2552 Marcus Lagergren Independent JDK-8064778 Cosmetics: The recompile log produces double lines for some reason
2553 Marcus Lagergren Independent JDK-8064718 push() on frozen array increases its length property
2553 Attila Szegedi Independent JDK-8064717 Trivial bugfixing and exception reuse in ApplySpecialization
2553 Stefan Karlsson Oracle JDK-8064556 G1: ParallelGCThreads=0 may cause assert(!MetadataOnStackMark::has_buffer_for_thread(Thread::current())) failed: Should be empty
2553 Aleksej Efimov Oracle JDK-8064389 XML parser returns corrupt attribute value
2553 John Coomes Twitter JDK-8060467 CMS: small OldPLABSize and -XX:-ResizePLAB cause assert(ResizePLAB || n_blks == OldPLABSize) failed: Error
2553 Christian Tornqvist Oracle JDK-8064630 assert(_count > 0) failed: Negative counter when running runtime/NMT/MallocTrackingVerify.java
2553 Christian Tornqvist Oracle JDK-8064629 Update use of GetVersionEx to get correct Windows version in hs_err files
2553 Christian Tornqvist Oracle JDK-8064628 [TESTBUG] MallocSiteHashOverflow.java should be enabled for 32-bit platforms
2553 Philip Race Oracle JDK-8064381 Swing applications not being displayed properly
2554 Attila Szegedi Independent JDK-8064593 Binary logical expressions can have numeric types
2554 Attila Szegedi Independent JDK-8064589 Deoptimization type information persistence doesn't work - "Failed to calculate version dir name"
2554 David Buck Oracle JDK-8064554 BCEL still corrupts generic methods if bytecode offsets are modified
2555 Attila Szegedi Independent JDK-8064451 Logical NOT operator throws NullPointerException for null Boolean return values
2556 Ivan Gerasimov Google JDK-8064413 (coll) IdentityHashMap is resized before exceeding the expected maximum size
2557 Anthony Scarpino Oracle JDK-8064378 -Xcheck:jni changes cause many JCK failures in api/javax_crypto tests in SunPKCS11
2557 Ivan Gerasimov Google JDK-8064412 java/lang/ref/EarlyTimeout.java: elapsed time 981 is less than timeout 1000
2557 Ivan Gerasimov Google JDK-8064411 TEST_BUG: java/lang/ref/EarlyTimeout.java fails with a non-adequate message
2557 Ivan Gerasimov Google JDK-8064410 (ref) ReferenceQueue.remove(timeout) may return null even if timeout has not expired
2557 Ivan Gerasimov Google JDK-8064408 SequenceInputStream with lots of empty substreams can cause StackOverflowError
2557 Ivan Gerasimov Google JDK-8064402 (fs) Path.register(..) clears interrupt status of thread with no InterruptedException
2557 Ivan Gerasimov Google JDK-8064401 (fs) Path.register doesn't throw IllegalArgumentException if multiple OVERFLOW events are specified
2557 Ivan Gerasimov Google JDK-8064400 (fs) Path.register doesn't throw IllegalArgumentException if multiple OVERFLOW events are specified, part 2
2557 Ivan Gerasimov Google JDK-8064397 java/util/BitSet/BSMethods.java failed with: java.lang.OutOfMemoryError: Java heap space
2557 Ivan Gerasimov Google JDK-8064396 BitSet.toString() can throw IndexOutOfBoundsException
2557 Markus Grönlund Oracle JDK-8056049 getProcessCpuLoad() stops working in one process when a different process exits
2557 Alejandro Murillo Independent JDK-8064361 new hotspot build - hs25.40-b19
2558 Philip Race Oracle JDK-8064370 PrinterJob NPE when drawing translucent image with null user clip
2558 Sean Coffey Oracle JDK-8059311 com/sun/jndi/ldap/LdapTimeoutTest.java fails with exit_code == 0
2558 Stefan Karlsson Oracle JDK-8059888 Investigate increased GC remark time after class unloading changes in CRM Fuse
2558 David Buck Oracle JDK-8064324 BCEL corrupts debug data of methods that use generics
2558 Attila Szegedi Independent JDK-8064318 b36 of 9 introduces regressions over b35 when running lyra
2558 Vladimir Kozlov Oracle JDK-8062074 SPECjvm2008-MPEG performance regressions on x64 platforms
2558 Kumar Srinivasan VMWare JDK-8064292 [asm] refresh internal ASM version v5.0.3
2558 Ivan Gerasimov Google JDK-8064271 (fc) FileChannel.size() returns 0 for block devices on Linux
2559 Mikhail Cherkasov Oracle JDK-8063140 NPE in sun/lwawt/macosx/CPlatformWindow::toFront after JDK-8060146
2559 Hannes Wallnoefer Oracle JDK-8063132 java.lang.String methods not available on concatenated strings
2559 Hannes Wallnoefer Oracle JDK-8063131 Different versions of nashorn use same code cache directory
2559 Vladimir Ivanov Oracle JDK-8063127 NPE with explicitCastArguments unboxing null
2559 David Buck Oracle JDK-8063111 stability issues when being launched as an embedded JVM via JNI
2559 Bengt Rutisson Oracle JDK-8063103 Type annotations not retained during class redefine / retransform
2559 Kevin Walls Oracle JDK-8063097 Make PrintGCApplicationStoppedTime print information about stopping threads
2560 Marcus Lagergren Independent JDK-8063032 JDK-8061391 regresses typescript: OOME with too fat SparseArrayData instances
2560 Marcus Lagergren Independent JDK-8063031 Missing ArrayBuffer.isView() Method
2560 Marcus Lagergren Independent JDK-8063030 String.prototype.charCodeAt called with invalid index throws ClassCastException
2560 Marcus Lagergren Independent JDK-8063029 Remove all Joni and test Warnings
2560 Marcus Lagergren Independent JDK-8057825 emitted socket arg becomes null in avatar.js http tests
2560 Alexandr Scherbatiy BellSoft JDK-8062897 JComboBox actionListener never receives "comboBoxEdited" from getActionCommand
2560 Tobias Hartmann Oracle JDK-8062730 Whitebox.deoptimizeMethod() does not deoptimize all OSR versions of method
2560 Tobias Hartmann Oracle JDK-8062534 Multiple OSR compilations issued for same bci
2560 David Holmes Oracle JDK-8036616 [TESTBUG] Embedded: sun/jvmstat/monitor/MonitoredVm/CR6672135.java should be launched with -XX:+UsePerfData
2561 Michael McMahon Oracle JDK-8062838 jdk.net.Sockets.setOption/getOption does not support IP_TOS
2561 Ioi Lam Oracle JDK-8061651 Add an interface to the JVM's Class/Resource Lookup Index Cache for improving sun.misc.URLClassPath search time
2561 Vicente Arturo Romero Zaldivar Oracle JDK-8058512 Method reference with generic type creates NPE when compiling
2562 Albert Noll Oracle JDK-8062292 [TESTBUG] compiler/whitebox/MakeMethodNotCompilableTest.java fails with "must not be in queue"
2562 Albert Noll Oracle JDK-8062031 [TESTBUG] compiler/whitebox/ tests fail : must be osr_compiled (reappeared in nightlies)
2562 Albert Noll Oracle JDK-8061303 [TESTBUG] Whitebox tests fail with -XX:CompileThreshold=100
2562 Albert Noll Oracle JDK-8060441 compiler/whitebox/ tests fail : must be osr_compiled
2562 Attila Szegedi Independent JDK-8062733 Some arithmetic operations have unnecessary widening
2564 Alejandro Murillo Independent JDK-8062589 new hotspot build - hs25.40-b18
2564 Hannes Wallnoefer Oracle JDK-8062673 Throwing object with error prototype causes error proto to be caught
2565 Roger Riggs Oracle JDK-8062635 Enable custom CompileJavaClasses.gmk
2565 Sean Coffey Oracle JDK-8062670 (str) contentEquals checks the String contents twice on mismatch
2565 Hannes Wallnoefer Oracle JDK-8062656 Nashorn incorrectly binds "this" for constructor created by another function
2565 Hannes Wallnoefer Oracle JDK-8062655 User accessors require boxing and do not support optimistic types
2565 Roger Riggs Oracle JDK-8062639 Enable hook for custom doc generation
2565 Albert Noll Oracle JDK-8062629 compiler/7200264/TestIntVect.java fails with: Test Failed: AddVI 0 < 4
2565 Albert Noll Oracle JDK-8062628 Fix of JDK-8034775 neglects to account for non-JIT VMs
2565 Albert Noll Oracle JDK-8062627 [TESTBUG] ciReplay/* tests fail after 8034775
2565 Albert Noll Oracle JDK-8062625 Failing to initialize VM when running with negative value for -XX:CICompilerCount
2565 Albert Noll Oracle JDK-8062621 CompileQueue::free_all() code is incorrect
2565 Albert Noll Oracle JDK-8062620 Excessive number of tests timing out on nightly testing due to fix for 8040798
2565 Albert Noll Oracle JDK-8062619 compiler/startup/SmallCodeCacheStartup.java timed out in RT_Baseline
2565 Jon Masamitsu Oracle JDK-8062603 assert(_heap_alignment >= _space_alignment) failed: heap_alignment less than space_alignment
2565 Brian Burkhalter Oracle JDK-8062595 Modifications of server socket channel accept() methods for instrumentation purposes
2565 Calvin Cheung Oracle JDK-8062586 VM Crashes in MetaspaceShared::generate_vtable_methods while creating CDS archive with limiting SharedMiscCodeSize
2565 Philip Race Oracle JDK-8050963 Endless loop in native code of sun.java2d.loops.ScaledBlit
2565 Vladimir Kozlov Oracle JDK-8062576 CompilerThread seems to occupy all CPU in a very rare situation
2566 Aleksej Efimov Oracle JDK-8062541 (tz) Support tzdata2014i
2566 Yumin Qi Oracle JDK-8062484 CDS test failed: assert((size % os::vm_allocation_granularity()) == 0) failed when limiting SharedMiscDataSize
2567 Jaroslav Bachorík DataDog JDK-8047073 Some javax/management/ fails with JFR
2567 Stuart Marks Oracle JDK-8062451 add java/rmi/server/Unreferenced/finiteGCLatency/FiniteGCLatency.java to problem list
2567 Sergey Bylokhov Amazon JDK-8062446 Some of the input validation in the javasound is too strict
2567 Sergey Bylokhov Amazon JDK-8062444 A switch operator in JFrame.processWindowEvent() should be rewritten
2567 Sergey Bylokhov Amazon JDK-8062443 Font2DTest demo: unused resource files
2567 Sergey Bylokhov Amazon JDK-8062442 Unexpected exceptions and timeouts in SF2 parser code
2567 Sergey Bylokhov Amazon JDK-8062441 Cleanup of sun.awt.X11 package
2567 Sergey Bylokhov Amazon JDK-8062440 Unexpected exceptions in MID parser code
2567 Sundararajan Athijegannathan Oracle JDK-8062374 [TEST_BUG] [nashorn] regresion test failure with TimeZone
2567 Igor Veresov Oracle JDK-8062363 SIGBUS in C2 compiled method weblogic.wsee.jaxws.framework.jaxrpc.EnvironmentFactory$SimulatedWsdlDefinitions.
2567 Christian Tornqvist Oracle JDK-8062326 [TESTBUG] Detailed Native Memory Tracking (NMT) data is not verified as output at VM exit
2568 Maurizio Cimadamore Oracle JDK-8062272 StackOverflowError at com.sun.tools.javac.code.Types.lub
2568 Joel Borggrén-Franck Oracle JDK-8062027 (ann) Cannot reference field of inner class in an anonymous class
2568 Sundararajan Athijegannathan Oracle JDK-8062248 Issue with date.setFullYear when time other than midnight
2569 Marcus Lagergren Independent JDK-8062140 String.concat needs to have optimistic builtin versions
2571 Karen Kinnear Oracle JDK-8062114 interface initialization for default methods
2572 Vicente Arturo Romero Zaldivar Oracle JDK-8059711 javac, the same approach used in fix for JDK-8058708 should be applied to Code.closeAliveRanges
2572 Vladimir Ivanov Oracle JDK-8062081 Wrong ciConstant type for arrays from ConstantPool::_resolved_reference
2572 Vladimir Ivanov Oracle JDK-8062080 C2: crash while inlining MethodHandle invocation w/ null receiver
2572 Vladimir Ivanov Oracle JDK-8062079 EA: ConnectionGraph::split_unique_types does incorrect scalar replacement
2572 Vladimir Ivanov Oracle JDK-8062072 FILL_ARRAYS and ARRAYS are eagely initialized in MethodHandleImpl
2572 Jesper Wilhelmsson Oracle JDK-8062055 GC cleanup phase can cause G1 skipping a System.gc()
2572 Jiangli Zhou Google JDK-8047935 Adding new API for unlocking diagnostic argument for SharedArchiveFile
2572 Alejandro Murillo Independent JDK-8061861 new hotspot build - hs25.40-b17
2573 Hannes Wallnoefer Oracle JDK-8059813 Type Info Cache flag must must be documented
2573 David Holmes Oracle JDK-8061888 TraceClassLoading expects there to be a (Java) caller when you load a class with the bootstrap class loader
2574 David Holmes Oracle JDK-8061759 Minimal VM build broken after gcId.cpp was added
2574 David Holmes Oracle JDK-8061758 Add sanity test for minimal VM in test/Makefile
2574 David Holmes Oracle JDK-8061757 Add jtreg jobs to JPRT for Hotspot
2574 Anthony Scarpino Oracle JDK-8057141 CertificateFactory.getInstance("X.509").generateCertificates(InputStream) does not throw CertificateException for invalid input
2575 Attila Szegedi Independent JDK-8061620 Pessimistic LMUL used where optimistic should be
2575 Attila Szegedi Independent JDK-8061596 Implement optimistic splitter
2575 Attila Szegedi Independent JDK-8061595 Make AST serializable
2575 Vladimir Kozlov Oracle JDK-8061571 It should be possible to explicitly disable usage of TZCNT instr w/ -XX:-UseBMI1Instructions
2575 Coleen Phillimore Oracle JDK-8061554 SIGSEGV VirtualMemoryTracker::remove_released_region
2576 Anton Litvinov Oracle JDK-8061223 ArrayIndexOutOfBoundsException occurs when Container with overridden getComponents() is deserialized
2576 Hannes Wallnoefer Oracle JDK-8060724 ant test262parallel in Nashorn spends a significant amount of time after almost all the tests are run
2576 Sundararajan Athijegannathan Oracle JDK-8061465 nashorn ant build script should have a sanity target
2578 Vladimir Kozlov Oracle JDK-8061428 assert(adr_type != NULL) failed: expecting TypeKlassPtr
2578 Alejandro Murillo Independent JDK-8061275 new hotspot build - hs25.40-b16
2579 Brian Burkhalter Oracle JDK-8061380 Wrong NumberFormat.format() HALF_UP rounding when last digit exactly at rounding position greater than 5
2579 Hannes Wallnoefer Oracle JDK-8061317 Concatenating an array and converting it to Java gives wrong result
2579 Michael McMahon Oracle JDK-8042622 Check for CRL results in IllegalArgumentException "white space not allowed"
2579 Jan Lahoda Oracle JDK-8061314 NullPointerException when compiling specific code.
2579 Attila Szegedi Independent JDK-8061299 Boolean used as optimistic call return type
2580 Konstantin Shefov Azul JDK-8060696 [TEST_BUG] Test java/awt/Graphics2D/DrawString/DrawStringCrash.java fails with OutOfMemoryError
2580 Konstantin Shefov Azul JDK-8061226 [TESTBUG] java/lang/invoke/LFCaching/LFSingleThreadCachingTest.java and LFMultiThreadCachingTest.java failed on some platforms due to java.lang.VirtualMachineError
2580 Konstantin Shefov Azul JDK-8061225 [TESTBUG] Reinvokers with arity >253 can't be cached
2580 Calvin Cheung Oracle JDK-8061206 Exclude AIX from VS.NET make/windows/projectcreator.make
2581 Sundararajan Athijegannathan Oracle JDK-8060755 Nashorn: Generated script class name fails --verify-code for names with special chars
2581 Attila Szegedi Independent JDK-8060726 Immediately invoked function expressions cause lot of deoptimization
2581 Attila Szegedi Independent JDK-8060725 Compile-time expression evaluator wasn't seeing into ArrayBufferViews
2581 Bengt Rutisson Oracle JDK-8060131 After JDK-8047976 gc/g1/TestSummarizeRSetStatsThreads fails
2581 Attila Szegedi Independent JDK-8060690 Reports for optimistic test run overwrite those for pessimistic run
2581 Masayoshi Okutsu Independent JDK-8060451 No Russian time zones mapping for Windows
2581 Abhijit Saha Independent JDK-8060631 TimeZoneNamesTest should be removed
2581 Abhijit Saha Independent JDK-8060615 Increment hsx 25.25 build to b02 for 8u25-b11
2581 Abhijit Saha Independent JDK-8060612 Increment minor version of HSx25 for 8u25 and initialize the build number
2581 Abhijit Saha Independent JDK-8060602 Resolve autoconf and other merge issue from 8u20 to 8u25
2582 Marcus Lagergren Independent JDK-8060477 GlobalConstants.findSetMethod calls DynamicLinker.getLinkedCallSiteLocation, which does Throwables
2582 Sundararajan Athijegannathan Oracle JDK-8050977 Java8 Javascript Nashorn exception: no current Global instance for nashorn
2582 Weijun Wang Oracle JDK-8060452 Unable to initiate SpNego using a S4U2Proxy GSSCredential (Krb5ProxyCredential)
2582 Robert Field Oracle JDK-8056051 int[]::clone causes "java.lang.NoClassDefFoundError: Array"
2582 Attila Szegedi Independent JDK-8060247 Creating symbols for declared functions shouldn't be a special case
2583 Abhijit Saha Independent JDK-8055521 Incorrect radio button behavior
2583 Bengt Rutisson Oracle JDK-8059890 G1: Change the default values for G1HeapWastePercent and G1MixedGCLiveThresholdPercent
2585 Thomas Schatzl Oracle JDK-8060155 Remove dead code in g1BlockOffsetTable
2585 Thomas Schatzl Oracle JDK-8060019 Footprint regressions with JDK-8038423
2585 Thomas Schatzl Oracle JDK-8043766 CMM Testing: 8u40 Decommit auxiliary data structures
2586 Sundararajan Athijegannathan Oracle JDK-8060129 AssertionError: __noSuchProperty__ placeholder called from NativeJavaImporter
2586 Anton Litvinov Oracle JDK-8059873 ScrollBar doesn't become active when tabs are created more than frame size
2586 Alejandro Murillo Independent JDK-8059655 new hotspot build - hs25.40-b15
2587 Hannes Wallnoefer Oracle JDK-8060018 NPE restoring cached script with optimistic types disabled
2587 Hannes Wallnoefer Oracle JDK-8059236 Memory leak when executing octane pdfjs with optimistic typing
2588 Stefan Karlsson Oracle JDK-8058535 TestCMSClassUnloadingEnabledHWM.java fails with '.*CMS Initial Mark.*' missing from stdout/stderr
2588 Erik Joelsson Oracle JDK-8059834 New Nasgen dependencies to Nashorn breaks the JDK 9 build - bootstrapping problem?
2589 Bengt Rutisson Oracle JDK-8059878 Force young GC to initiate marking cycle when stat update is requested
2589 Stefan Karlsson Oracle JDK-8059839 CMS: JVM intermittently crashes with "FreeList of size 258 violates Conservation Principle" assert
2589 Igor Veresov Oracle JDK-8059797 JVM crashes with "unexpected index type" assert in LIRGenerator::do_UnsafeGetRaw
2590 Marcus Lagergren Independent JDK-8059231 Octane Raytrace fails when optimistic typing turned off
2590 Attila Szegedi Independent JDK-8059750 Single class loader is used to load compiled bytecode
2590 Anton Tarasov JetBrains JDK-8059745 [TESTBUG] fix the @run line of the test: jdk/test/java/awt/Focus/SortingFTP/JDK8048887.java
2593 Dmitry Cherepanov Azul JDK-8059136 Reverse removal of applet demos [backout 8015376]
2593 Alejandro Murillo Independent JDK-8059618 new hotspot build - hs25.40-b14
2593 Jaroslav Bachorík DataDog JDK-8059659 JDI: ReferenceType.visibleMethods() return wrong visible methods
2593 Jaroslav Bachorík DataDog JDK-8042123 Support default and static interface methods in JDI, JDWP and JDB
2593 Coleen Phillimore Oracle JDK-8059642 Allocation of more then 1G of memory using Unsafe.allocateMemory is still causing a fatal error on 32bit platforms
2593 Vladimir Kozlov Oracle JDK-8059641 Recent bugfixes in ppc64 port.
2593 Vladimir Kozlov Oracle JDK-8059226 Names of rtm_state_change and unstable_if deoptimization reasons were swapped in 8u40
2594 Michael Fang Oracle JDK-8059177 jdk8u40 l10n resource file translation update 1
2594 Marcus Lagergren Independent JDK-8059578 Significant parser/frontend overhead in recompilation of avatar.js
2594 Marcus Lagergren Independent JDK-8025435 Specialized library functions for optimistic typing
2595 Sean Coffey Oracle JDK-8059564 GSSContext.acceptSecContext fails when a supported mech is initiator preferred
2595 Mark Sheppard Oracle JDK-8059539 [TEST_BUG] java/net/InetAddress/IPv4Formats.java failed because hello.foo.bar does exist
2595 Aleksej Efimov Oracle JDK-8054106 JAX-WS handles wrongly xsd:any arguments for Web services
2595 Attila Szegedi Independent JDK-8059537 Code duplication in split emitter
2595 Attila Szegedi Independent JDK-8059536 Code duplication in handling of break and continue
2595 Attila Szegedi Independent JDK-8059535 Unnecessary work in deoptimizing recompilation
2595 Vladimir Ivanov Oracle JDK-8059534 Compiled LambdaForms should inherit from Object to improve class loading performance
2595 Calvin Cheung Oracle JDK-8058264 java.net.URLClassLoader.findClass uses exceptions in control flow
2596 Weijun Wang Oracle JDK-8059490 Add @jdk.Exported to com.sun.jarsigner.ContentSigner API
2596 Vincent Ryan Oracle JDK-8059476 Typo in keytool resource file
2596 Sergey Bylokhov Amazon JDK-8059471 OperationTimedOut exception inside from XToolkit.syncNativeQueue call
2596 Sergey Bylokhov Amazon JDK-8059470 realSync() doesn't work with Xfce
2596 Daniel Fuchs Oracle JDK-8059463 FileHandler may throw NPE if pattern is a simple name and the lock file already exists
2596 Bengt Rutisson Oracle JDK-8059460 Ergonomics for GC thread counts should update the flags
2596 Thomas Schatzl Oracle JDK-8058532 Evacuation failure handling in G1 does not evacuate all objects if -XX:-G1DeferredRSUpdate is set
2596 Thomas Schatzl Oracle JDK-8058097 G1: Unnecessary NULL check in G1KeepAliveClosure
2596 Igor Veresov Oracle JDK-8059391 java/lang/instrument/NativeMethodPrefixAgent.java fails due to VirtualMachineError: out of space in CodeCache for method handle intrinsic
2597 Vincent Ryan Oracle JDK-8059350 Debug security logging should print Provider used for each crypto operation
2599 Paul Sandoz Oracle JDK-8057709 Improve ForkJoin thread throttling
2600 Alejandro Murillo Independent JDK-8059204 new hotspot build - hs25.40-b13
2600 Masayoshi Okutsu Independent JDK-8054493 DateTimeFormatter "MMMMM" returns English value in Japanese locale
2601 Mikael Gerdin Oracle JDK-8059108 G1: Code root hashtable updated incorrectly when evacuation failed
2601 Mikael Gerdin Oracle JDK-8059107 G1 Code Root Migration performs poorly
2601 Mikael Gerdin Oracle JDK-8059106 Refactor Hashtable to allow implementations without rehashing support
2601 Igor Veresov Oracle JDK-8059097 8058744 needs a test case
2601 Igor Veresov Oracle JDK-8059096 Crash in C1 OSRed method w/ Unsafe usage
2601 Kevin Walls Oracle JDK-8058933 JVM hangs at getAgentProperties after attaching to VM with lower IntegrityLevel
2602 Anton Tarasov JetBrains JDK-8059030 Mac: JFXPanel deadlocks in jnlp mode
2602 Staffan Larsen Oracle JDK-8059023 hotspot/test/Makefile should use jtreg script from $JT_HOME/bin/jreg (instead of $JT_HOME/win32/bin/jtreg)
2603 Andrew Brygin Azul JDK-8058953 JDK demo applets not running with >=7u40 or (JDK 8 and JDK 9)
2603 Vicente Arturo Romero Zaldivar Oracle JDK-8049512 Should ignore nested lambda bodies during overload resolution
2603 Vicente Arturo Romero Zaldivar Oracle JDK-8049631 javac, Gen.LVTAssignAnalyzer should be refactored, it shouldn't be a static class
2604 Hannes Wallnoefer Oracle JDK-8058885 Indexed or polymorphic set on global affects Object.prototype
2604 Attila Szegedi Independent JDK-8058883 NullPointerException at jdk.nashorn.internal.codegen.LocalVariableTypesCalculator.symbolIsUsed(LocalVariableTypesCalculator.java:224)
2604 Konstantin Shefov Azul JDK-8058878 TEST_BUG: Make java/lang/invoke/LFCaching/LFGarbageCollectedTest.java skip arrayElementSetter and arrayElementGetter methods
2606 Igor Veresov Oracle JDK-8058646 Tiered compilation performance drop in PIT
2607 Calvin Cheung Oracle JDK-8052313 Backport CDS tests from JDK-9 to jdk8_u40
2607 Hannes Wallnoefer Oracle JDK-8046202 Make persistent code store more flexible
2607 Alejandro Murillo Independent JDK-8058798 new hotspot build - hs25.40-b12
2607 Shanliang Jiang Oracle JDK-8058792 [TEST_BUG] javax/management/monitor/GaugeMonitorDeadlockTest.java fails intermittently
2608 Brian Burkhalter Oracle JDK-8058751 [TEST_BUG] More bad characters in BigIntegerTest
2608 Brian Burkhalter Oracle JDK-8058750 [TEST_BUG] Bad fonts in BigIntegerTest
2608 Brian Burkhalter Oracle JDK-8058749 BigIntegerTest does not exercise Burnikel-Ziegler division
2608 Brian Burkhalter Oracle JDK-8058748 BigDecimal is no longer effectively immutable
2608 Naoto Sato Oracle JDK-8058687 jdk build is broken due to the changeset of JDK-8033370
2608 Joel Borggrén-Franck Oracle JDK-8058632 Revert JDK-8054984 from 8u40
2608 Ivan Gerasimov Google JDK-8058676 ByteArrayOutputStream capacity should be maximal array size permitted by VM
2609 Christian Tornqvist Oracle JDK-8056263 [TESTBUG] Re-enable NMTWithCDS.java test
2609 Vladimir Ivanov Oracle JDK-8058641 [TEST_BUG] Ignore java/lang/invoke/LFCaching/LFGarbageCollectedTest until 8057020 is fixed
2609 Vladimir Ivanov Oracle JDK-8058640 Bit set computation in MHs.findFirstDupOrDrop/findFirstDrop is broken
2609 Vladimir Ivanov Oracle JDK-8058639 Missing some checks during parameter validation
2609 Vladimir Ivanov Oracle JDK-8058626 Missing part of 8057656 in 8u40 compared to 9
2609 Sundararajan Athijegannathan Oracle JDK-8058623 Overload resolution ambiguity involving ConsString
2610 Philip Race Oracle JDK-8056133 xrender: text drawn after setColor(Color.white) is actually black
2610 Bengt Rutisson Oracle JDK-8058565 Make heap region region type in G1 HeapRegion explicit
2610 Albert Noll Oracle JDK-8058427 assert(which != imm_operand) failed: instruction is not a movq reg, imm64
2610 Albert Noll Oracle JDK-8058426 closed/compiler/6595044/Main.java failed with timeout
2610 Sundararajan Athijegannathan Oracle JDK-8058553 With strict mode, bean property assignment of a non-existent property should result in TypeError
2610 Stefan Karlsson Oracle JDK-8058481 Test gc/class_unloading/TestCMSClassUnloadingDisabledHWM.java was removed, but TEST.groups still refers to it
2611 Hannes Wallnoefer Oracle JDK-8056978 ClassCastException: cannot cast jdk.nashorn.internal.scripts.JO*
2611 Shanliang Jiang Oracle JDK-8058484 Transient network problems cause JMX thread to fail silenty
2611 Staffan Larsen Oracle JDK-8058437 java/lang/instrument/RedefineBigClass.sh RetransformBigClass.sh start failing after JDK-8055012
2611 Staffan Larsen Oracle JDK-8058436 [TESTBUG] NMTHelper fails to parse NMT output
2611 Sundararajan Athijegannathan Oracle JDK-8058454 Users should be able to overwrite "context" and "engine" variables
2613 Alejandro Murillo Independent JDK-8058275 new hotspot build - hs25.40-b11
2613 Vladimir Ivanov Oracle JDK-8058363 ReplacedNodes dumps it's content to tty
2613 Vladimir Ivanov Oracle JDK-8058362 LogCompilation: C1: inlining tree is flat (no depth is stored)
2613 Vladimir Ivanov Oracle JDK-8058361 LogCompilation: annotate make_not_compilable with compilation level
2613 Vladimir Ivanov Oracle JDK-8058360 Provide descriptive failure reason for compilation tasks removed for the queue
2613 Vladimir Ivanov Oracle JDK-8058359 Method marked w/ @ForceInline isn't inlined with "executed < MinInliningThreshold times" message
2613 Vladimir Ivanov Oracle JDK-8058358 JSR 292 support for PopFrame has a fragile coupling with DirectMethodHandle
2613 Vladimir Ivanov Oracle JDK-8058357 Convert warning("Thread holding lock at safepoint that vm can block on") to fatal(...)
2613 Vladimir Ivanov Oracle JDK-8058356 Thread holding lock at safepoint that vm can block on: MethodCompileQueue_lock
2613 Igor Ignatyev Oracle JDK-8058352 New tests for LambdaForm Reduction and Caching feature
2613 Igor Ignatyev Oracle JDK-8058351 [TEST_BUG] Test library enhancement in lib/testlibrary/jsr292/com/oracle/testlibrary/jsr292/Helper.java
2614 Sean Coffey Oracle JDK-8057756 SSLv2Hello protocol may be filtered out unexpectedly
2614 Sean Coffey Oracle JDK-8057813 Alterations to jdk_security3 test target
2614 Chris Hegarty Independent JDK-8058323 NetworkInterface.getHardwareAddress can return zero length byte array when run with preferIPv4Stack
2614 Hannes Wallnoefer Oracle JDK-8058311 Non-serializable fields in serializable classes
2614 Hannes Wallnoefer Oracle JDK-8058310 Single quotes must be escaped in message resource file
2614 Alexandr Scherbatiy BellSoft JDK-8058299 [headless] JPopupMenu creation in headless mode with JDK9b23 causes NPE
2614 Dmitry Markov Oracle JDK-8058286 Using tables in JTextPane leads to infinite loop in FlowLayout.layoutRow
2614 Jan Lahoda Oracle JDK-8057028 Exception in compiler: java.lang.AssertionError: isSubClass T
2614 Jan Lahoda Oracle JDK-8057027 Type inference may be skipped for a complex receiver generic method in a parameter position
2614 Coleen Phillimore Oracle JDK-8058273 Internal Error: mallocTracker.cpp:146 fatal error: Should not use malloc for big memory block, use virtual memory instead
2614 John Coomes Twitter JDK-8058235 identify GCs initiated to update allocation context stats
2614 Jesper Wilhelmsson Oracle JDK-8058269 [TESTBUG] gc/g1/TestHumongousShrinkHeap.java fails due to OOM
2614 Jesper Wilhelmsson Oracle JDK-8056235 CMM Testing: 8u40 an allocated humongous object at the end of the heap should not prevents shrinking the heap
2614 Igor Veresov Oracle JDK-8058267 Test vm/mlvm/meth/stress/compiler/deoptimize. Assert in src/share/vm/classfile/systemDictionary.cpp: MH intrinsic invariant
2614 Igor Veresov Oracle JDK-8058266 Move _highest_comp_level and _highest_osr_comp_level from MethodData to MethodCounters
2614 Dmitriy Samersoff Independent JDK-8058250 SA: Constantpool lookup for invokedynamic is not implemented
2615 Vladimir Kozlov Oracle JDK-8058240 assert(result == NULL || result->is_oop()) failed: must be oop
2615 Vladimir Kozlov Oracle JDK-8058239 Recursive method that was compiled by C1 is unable to catch StackOverflowError
2615 Vladimir Kozlov Oracle JDK-8058238 assert(false) failed: only Initialize or AddP expected macro.cpp:943
2615 Hannes Wallnoefer Oracle JDK-8058237 Global constants get in the way of self-modifying properties
2615 Hannes Wallnoefer Oracle JDK-8057021 UserAccessorProperty guards fail with multiple globals
2615 Attila Szegedi Independent JDK-8058236 Reduce the RecompilableScriptFunctionData footprint
2615 Aleksej Efimov Oracle JDK-8058234 Several test failing after update to tzdata2014g
2615 Aleksej Efimov Oracle JDK-8058233 (tz) Support tzdata2014g
2615 Bengt Rutisson Oracle JDK-8057752 WhiteBox extension support for testing
2615 Marcus Lagergren Independent JDK-8058222 Still, lots of trivial classes are generated by Nashorn compiler
2615 Marcus Lagergren Independent JDK-8058218 Lots of trivial classes are generated by Nashorn compiler
2615 Ivan Gerasimov Google JDK-8057952 Duplicate closure of file descriptors leads to unexpected and incorrect closure of sockets
2615 Marcus Lagergren Independent JDK-8058212 jdk/nashorn/internal/scripts/JO* classes are missing from the generated methods dump
2615 Joel Borggrén-Franck Oracle JDK-8054987 (reflect) Add sharing of annotations between instances of Executable
2615 Marcus Lagergren Independent JDK-8058194 Make class dumping available outside --compile-only mode
2615 John Coomes Twitter JDK-8057827 notify an obj when allocation context stats are available
2615 John Coomes Twitter JDK-8057824 methods to copy allocation context statistics
2615 John Coomes Twitter JDK-8057818 collect allocation context statistics at gc pauses
2615 Christian Tornqvist Oracle JDK-8058166 [TESTBUG] Test is needed to verify correctness of malloc tracking
2615 Vladimir Kozlov Oracle JDK-8058162 Tests run TypeProfileLevel=222 crash with guarantee(0) failed: must find derived/base pair
2616 Vladimir Ivanov Oracle JDK-8058132 Improve MethodType.isCastableTo() & MethodType.isConvertibleTo() checks
2616 Vladimir Ivanov Oracle JDK-8058131 Make LambdaForm intrinsics detection more robust
2616 Vladimir Ivanov Oracle JDK-8058130 Improve caching of MethodHandle reinvokers
2616 Vladimir Ivanov Oracle JDK-8058129 Get rid of some package-private methods on arguments in j.l.i.MethodHandle
2616 Vladimir Ivanov Oracle JDK-8058128 Improve caching of different invokers
2616 Vladimir Ivanov Oracle JDK-8058127 Small cleanups in java.lang.invoke code
2616 Vladimir Ivanov Oracle JDK-8058126 Move varargsArray from sun.invoke.util package to java.lang.invoke
2616 Vladimir Ivanov Oracle JDK-8058125 JSR292: cache and reuse typed array accessors
2616 Vladimir Ivanov Oracle JDK-8058124 Improvements and cleanups to bytecode assembly for lambda forms
2616 Vladimir Ivanov Oracle JDK-8058123 Get rid of char-based descriptions 'J' of basic types
2616 Vladimir Ivanov Oracle JDK-8058122 Fix deprecation and raw lint warnings in java.lang.invoke
2616 Vladimir Ivanov Oracle JDK-8058121 Fix raw and unchecked warnings java.util.stream
2616 Vladimir Ivanov Oracle JDK-8057922 Improve LambdaForm sharing by using LambdaFormEditor more extensively
2616 Vladimir Ivanov Oracle JDK-8057657 Annotate LambdaForm parameters with types
2616 Vladimir Ivanov Oracle JDK-8057654 Extract checks performed during MethodHandle construction into separate methods
2616 Vladimir Ivanov Oracle JDK-8057042 LambdaFormEditor: ability to derive new LFs from a base LF
2616 Vladimir Ivanov Oracle JDK-8056926 Improve caching of GuardWithTest combinator
2616 Vladimir Ivanov Oracle JDK-8050887 Intrinsify constants for default values
2616 Vladimir Ivanov Oracle JDK-8050884 Intrinsify ValueConversions.identity() functions
2616 Vladimir Ivanov Oracle JDK-8050877 Improve code for pairwise argument conversions and value boxing/unboxing
2616 Vladimir Ivanov Oracle JDK-8050174 Support overriding of isInvokeSpecial flag in WrappedMember
2616 Vladimir Ivanov Oracle JDK-8050173 Generalize BMH.copyWith API to all method handles
2616 Volker Simonis Amazon JDK-8058111 Upgrade to LittleCMS 2.6 breaks AIX build
2616 Marcus Lagergren Independent JDK-8058110 Additional arguments to Function.prototype.apply messes up actual arguments passed
2616 Sundararajan Athijegannathan Oracle JDK-8058108 [TEST_BUG] sun/tools/jrunscript/jrunscriptTest.sh start failing: Output of jrunscript -l nashorn differ from expected output
2616 Rickard Backman Oracle JDK-8058107 compiler/6340864/TestLongVect.java timeout with
2616 Attila Szegedi Independent JDK-8058103 Instead of not skipping small functions in parser, make lexer avoid them instead
2616 Attila Szegedi Independent JDK-8058102 Remove "eval id" from eval locations
2616 Maurizio Cimadamore Oracle JDK-8058094 Wrong, confusing error when non-static varargs referenced in static context
2616 Maurizio Cimadamore Oracle JDK-8052388 Cannot assign a value to final variable in lambda
2616 Vladimir Kozlov Oracle JDK-8057989 Add C2 x86 intrinsic for BigInteger::multiplyToLen() method
2616 Paul Sandoz Oracle JDK-8057969 Fork/Join task ForEachOps.ForEachOrderedTask clarifications and minor improvements
2616 Igor Veresov Oracle JDK-8057968 CTW should not make MH intrinsics not entrant
2617 Vladimir Kozlov Oracle JDK-8057966 Fix AIX build after the Extend CompileCommand=option change 8055286
2617 Vladimir Kozlov Oracle JDK-8057965 JDK-8055286 changes are incomplete.
2617 Vladimir Kozlov Oracle JDK-8057964 Extend CompileCommand=option to handle numeric parameters
2617 Sergey Bylokhov Amazon JDK-8057956 api/javax_swing/JScrollPane/indexTGF.html#UpdateUI failed with MotifLookAndFeel on all platform
2617 Attila Szegedi Independent JDK-8057771 [TEST_BUG] Tests for let&const keywords in Nashorn
2617 Igor Ignatyev Oracle JDK-8057929 Develop sanity tests on SPARC's SHA instructions support
2617 Igor Ignatyev Oracle JDK-8057928 Develop tests for new command-line options related to SHA intrinsics
2617 Igor Ignatyev Oracle JDK-8057927 Move compiler/intrinsics/mathexact/sanity/Verifier to compiler/testlibrary and extend its functionality
2617 Attila Szegedi Independent JDK-8057926 Skip nested functions on reparse
2617 Vladimir Kozlov Oracle JDK-8057909 Unable to build --with-debug-level=optimized on OSX
2617 John Coomes Twitter JDK-8057710 Refactor G1 heap region default sizes
2617 Yong Huang Oracle JDK-8057532 ISO 4217 Amendment #159
2617 Igor Veresov Oracle JDK-8057887 Hotspot should use PICL interface to get cacheline size on SPARC
2617 Vladimir Kozlov Oracle JDK-8057884 Missing MemNode::acquire ordering in some volatile Load nodes
2617 Vladimir Kozlov Oracle JDK-8057880 PPC64: implement template interpreter for ppc64le
2617 John Coomes Twitter JDK-8057658 Enable G1 FullGC extensions
2618 Roger Riggs Oracle JDK-8057751 CompileNativeLibraries for custom build
2618 Attila Szegedi Independent JDK-8057831 AtomicInteger is treated as primitive number with optimistic compilation
2618 Coleen Phillimore Oracle JDK-8047195 Improve performance of Class.getClassLoader()
2618 Staffan Larsen Oracle JDK-8056172 Propagate errors from Diagnostic Commands as exceptions in the attach framework
2618 Staffan Larsen Oracle JDK-8049246 Add API to start JMX agent from attach framework
2618 Staffan Larsen Oracle JDK-8056173 Attach code should propagate errors in Diagnostic Commands as errors
2618 Sundararajan Athijegannathan Oracle JDK-8057767 [TEST_BUG] ant clean test should not fail if one or more external test suites are missing
2618 Albert Noll Oracle JDK-8056270 "unexpected yanked node" opto/postaloc.cpp:139
2620 Alejandro Murillo Independent JDK-8057649 new hotspot build - hs25.40-b10
2620 John Coomes Twitter JDK-8057731 add an extension class for argument handling
2621 Alexandr Scherbatiy BellSoft JDK-8057698 JCK8's api/javax_swing/JDesktopPane/descriptions.html#getset failed with GTKLookAndFeel on Linux and Solaris run
2621 Jesper Wilhelmsson Oracle JDK-8056056 Remove unnecessary inclusion of HS_ALT_MAKE from solaris Makefile
2621 Igor Ignatyev Oracle JDK-8057682 typo in export_optimized_jdk
2621 Igor Ignatyev Oracle JDK-8057681 add jprt_optimized targets
2621 Bengt Rutisson Oracle JDK-8057536 Refactor G1 to allow context specific allocations
2621 Paul Sandoz Oracle JDK-8057659 Improve CompletableFuture resource usage
2621 John Coomes Twitter JDK-8057642 refactor gc argument processing code slightly
2621 Philip Race Oracle JDK-8057616 Upgrade JDK to use LittleCMS 2.6
2622 John Coomes Twitter JDK-8054970 gc src file exclusion should exclude alternative sources
2622 Hannes Wallnoefer Oracle JDK-8051889 Implement block scoping in symbol assignment and scope computation
2622 Daniel Fuchs Oracle JDK-8057591 [TEST_BUG] java/util/logging/CheckZombieLockTest.java fails with NoSuchFileException
2622 Daniel Fuchs Oracle JDK-8049857 Regression on java.util.logging.FileHandler
2622 Zhengyu Gu Red Hat JDK-8057584 [TESTBUG] Misplaced @key stress prevents MallocSiteHashOverflow.java and MallocStressTest.java tests from running
2622 Zhengyu Gu Red Hat JDK-8057583 runtime/NMT/CommandLineEmptyArgument.java fails
2622 Zhengyu Gu Red Hat JDK-8057582 [TESTBUG] runtime/NMT/VirtualAllocCommitUncommitRecommit.java fails
2622 Zhengyu Gu Red Hat JDK-8057581 [TESTBUG] runtime/NMT/JcmdDetailDiff.java fails on Windows when there are no debug symbols available
2622 Zhengyu Gu Red Hat JDK-8057580 runtime/NMT/CommandLineEmptyArgument.java fails
2622 Zhengyu Gu Red Hat JDK-8057579 [TESTBUG] Enable NMT2 tests after NMT2 is integrated
2622 Zhengyu Gu Red Hat JDK-8057578 Re-enable warning for incompatible java launcher
2622 Zhengyu Gu Red Hat JDK-8057577 [TESTBUG] Add missing NMT2 tests
2622 John Coomes Twitter JDK-8057535 add a thread extension class
2622 Thomas Schatzl Oracle JDK-8057163 Incomplete renaming of variables containing "hrs" to "hrm" related to HeapRegionSeq
2622 Calvin Cheung Oracle JDK-8057115 Change "8048150: Allow easy configurations for large CDS archives" triggers conversion warning with older GCC
2622 Calvin Cheung Oracle JDK-8048151 Allow easy configurations for large CDS archives
2623 Alexandr Scherbatiy BellSoft JDK-8057156 Fourth mouse button (wheel) is treated like second button - isPopupTrigger returns true
2623 Thomas Schatzl Oracle JDK-8056255 Bitmap verification sometimes fails after Full GC aborts concurrent marking
2623 Albert Noll Oracle JDK-8055726 Test compiler/classUnloading/methodUnloading/TestMethodUnloading.java does not work with non-default GC
2623 Thomas Schatzl Oracle JDK-8057126 CMM Testing: an allocated humongous object at the end of the heap should not prevents shrinking the heap
2623 Thomas Schatzl Oracle JDK-8056289 Remove dead code in G1 concurrent marking code
2623 Thomas Schatzl Oracle JDK-8056114 G1 does not uncommit within the heap after JDK-8038423
2623 Thomas Schatzl Oracle JDK-8056019 Rename HeapRegionSeq to HeapRegionManager
2623 Ioi Lam Oracle JDK-8057094 Minor class loading clean-up
2623 Ioi Lam Oracle JDK-8047937 Class Data Sharing clean up and refactoring
2625 Jonathan Lu Independent JDK-8056986 AIX: Provide a better fontconfig.properties file
2626 Aleksej Efimov Oracle JDK-8036981 JAXB not preserving formatting for xsd:any Mixed content
2628 Alejandro Murillo Independent JDK-8056299 new hotspot build - hs25.40-b09
2629 Zhengyu Gu Red Hat JDK-8056297 Deadlock during NMT2 shutdown on Windows
2629 Zhengyu Gu Red Hat JDK-8056296 NMT2 leaks memory
2629 Zhengyu Gu Red Hat JDK-8056295 assert at share/vm/services/virtualMemoryTracker.cpp:332 Error: ShouldNotReachHere() when running NMT tests
2629 Zhengyu Gu Red Hat JDK-8056294 NMT2: emptyStack missing in minimal build
2629 Zhengyu Gu Red Hat JDK-8056293 nsk/jdi/VirtualMachine/exit/exit002 crash with detail tracking on (NMT2)
2629 Zhengyu Gu Red Hat JDK-8056292 [TESTBUG] Wrong WhiteBox.java was pushed by JDK-8044140
2629 Zhengyu Gu Red Hat JDK-8056291 [TESTBUG] Create NMT (Native Memory Tracking) tests for NMT2
2629 Zhengyu Gu Red Hat JDK-8056290 Scalable Native Memory Tracking development
2629 Zhengyu Gu Red Hat JDK-8056256 [TESTBUG] Disable NMTWithCDS.java test as launcher change has yet promoted
2629 Joel Borggrén-Franck Oracle JDK-8054984 (reflect) Constructor.getAnnotatedReceiverType() returns wrong value
2630 Alexandr Scherbatiy BellSoft JDK-8056149 [headless] DataTransferer.getInstance throws ClassCastException in headless mode
2630 Attila Szegedi Independent JDK-8056166 Nashorn: all tests failed with AccessControlException
2630 Attila Szegedi Independent JDK-8056165 jdk.nashorn.internal.codegen.ApplySpecialization$1.leaveIdentNode() should throw stackless Exception
2630 Sundararajan Athijegannathan Oracle JDK-8056164 Anonymous function statements leak internal function names into global scope
2630 Attila Szegedi Independent JDK-8056163 jdk.nashorn.internal.codegen.CompilationPhase.setStates() is hot in class installation phase
2630 Attila Szegedi Independent JDK-8056162 jdk.nashorn.internal.runtime.Source.getContent() does excess Object.clone()
2630 Attila Szegedi Independent JDK-8056161 Questionable use of parallelStream() in jdk.nashorn.internal.runtime.Context$ContextCodeInstaller.initialize()
2630 Attila Szegedi Independent JDK-8056160 jdk.nashorn.internal.{codegen.CompilationPhase|runtime.Timing} should use System.nanoTime
2630 Attila Szegedi Independent JDK-8056159 jdk.nashorn.internal.ir.Node.hashCode() delegates to Object.hashCode() and is hot
2630 Attila Szegedi Independent JDK-8056158 Questionable String.intern() in jdk.nashorn.internal.ir.IdentNode()
2630 Thomas Schatzl Oracle JDK-8056116 WB API should be extended to provide information about size and age of object.
2630 Thomas Schatzl Oracle JDK-8056115 [TESTBUG] Fix for 8055098 does not contain unit test
2630 Attila Szegedi Independent JDK-8056145 iteration fails if index var is not used
2630 Ivan Gerasimov Google JDK-8056097 (fs) bad error handling in java.base/unix/native/libnio/fs/UnixNativeDispatcher.c
2631 Andrew Brygin Azul JDK-8056081 [macosx] Large JTable cell results in a OutOfMemoryException
2631 Sundararajan Athijegannathan Oracle JDK-8056068 [TEST_BUG] runExternalJsTest method in test/jdk/nashorn/internal/runtime/ClassFilter.java slows down "ant test"
2631 Yuri Nesterenko Azul JDK-8055811 Tests for Nashorn ClassFilter Support
2631 Jan Lahoda Oracle JDK-8056020 @SuppressWarnings("deprecation") does not work when overriding deprecated method
2631 Harold Seigel Oracle JDK-8051002 Incorrectly merged share/vm/classfile/classFileParser.cpp was pushed to 8u20
2631 Alejandro Murillo Independent JDK-8055952 new hotspot build - hs25.40-b08
2632 Sundararajan Athijegannathan Oracle JDK-8055948 [TEST_BUG] Two nashorn tests fail in 8u40 nightly build with ClassNotFoundException
2632 Albert Noll Oracle JDK-8054894 "klass->is_loader_alive(_is_alive)) failed: must be alive" for anonymous classes
2632 Sundararajan Athijegannathan Oracle JDK-8055861 JDK-8015969.js is silently failing
2632 David Holmes Oracle JDK-8055858 [Testbug] Some tests are being executed and fail under profiles
2635 Markus Grönlund Oracle JDK-8055662 Update mapfile for libjfr
2635 Sundararajan Athijegannathan Oracle JDK-8055807 JSObject and browser JSObject linkers should provide fallback to call underlying Java methods directly
2635 Sundararajan Athijegannathan Oracle JDK-8055803 Nashorn misses linker for netscape.javascript.JSObject instances
2635 Alejandro Murillo Independent JDK-8055786 new hotspot build - hs25.40-b07
2636 Thomas Schatzl Oracle JDK-8055653 Missing include in g1RegionToSpaceMapper.hpp results in unresolved symbol of fastdebug build without precompiled headers
2636 Thomas Schatzl Oracle JDK-8055652 Bigapp weblogic+medrec fails to startup after JDK-8038423
2636 Thomas Schatzl Oracle JDK-8055400 G1: Decommit memory within the heap
2636 Sundararajan Athijegannathan Oracle JDK-8055736 Wrong "this" passed to JSObject.eval call
2636 Weijun Wang Oracle JDK-8055724 File ccache only recognizes Linux and Solaris defaults
2636 Anthony Scarpino Oracle JDK-8055226 Re-enabling CBC_PAD PKCS11 mechanisms for Solaris
2636 Anthony Scarpino Oracle JDK-8055505 Consider re-enabling PKCS11 mechanisms previously disabled due to Solaris bug 7050617
2636 Jesper Wilhelmsson Oracle JDK-8055006 Store original value of Min/MaxHeapFreeRatio
2637 Rickard Backman Oracle JDK-8055699 java/lang/Character/CheckProp test times out
2637 Erik Gahlin Oracle JDK-8055682 sun/jvmstat/monitor/MonitoredVm/MonitorVmStartTerminate.java timed out
2637 Erik Gahlin Oracle JDK-8028474 sun/jvmstat/monitor/MonitoredVm/MonitorVmStartTerminate.sh timeout, leaves looping process behind
2637 Sundararajan Athijegannathan Oracle JDK-8050078 Nashorn ClassFilter Support
2637 Attila Szegedi Independent JDK-8055651 [TEST_BUG] test/script/trusted/JDK-8055107.js fails with access control exception
2637 Attila Szegedi Independent JDK-8055650 Extension directives to turn on callsite profiling, tracing, AST print and other debug features locally
2637 Attila Szegedi Independent JDK-8055649 Compile-time expression evaluator was missing variables
2637 Attila Szegedi Independent JDK-8055648 jjs exits interactive mode if exception was thrown when trying to print value of last evaluated expression
2637 Attila Szegedi Independent JDK-8055647 type info cache may be disabled for test262 and tests explicitly changing that property should use @fork
2637 Attila Szegedi Independent JDK-8055646 Avoid creation of empty type info files
2637 Attila Szegedi Independent JDK-8055645 Global.initConstructor and ScriptFunction.getPrototype(Object) can have stricter types
2637 Attila Szegedi Independent JDK-8055644 test/script/external/test262/test/suite/ch12/12.6/12.6.4/12.6.4-2.js fails with tip
2637 Attila Szegedi Independent JDK-8055643 Add "nashorn.args.prepend" system property
2637 Attila Szegedi Independent JDK-8055642 Nashorn: AssertionError when use __DIR__ and ScriptEngine.eval()
2637 Attila Szegedi Independent JDK-8055641 Auto format caused warning in CompositeTypeBasedGuardingDynamicLinker
2637 Attila Szegedi Independent JDK-8055640 ScriptObjectMirror causing havoc with Invocation interface
2637 Attila Szegedi Independent JDK-8055639 jdeps is not PATH on Mac, results in ant clean test failure on Mac
2637 Attila Szegedi Independent JDK-8055637 Wrong type calculated for ADD operator with undefined operand
2637 Attila Szegedi Independent JDK-8055636 Test262 tests for ECMAScript 5 now in branch "es5-tests"
2637 Attila Szegedi Independent JDK-8055634 Separate src and test execution sandbox directories
2637 Attila Szegedi Independent JDK-8055633 OptimisticTypesPersistence.java should use java.util.Date instead of java.sql.Date
2637 Attila Szegedi Independent JDK-8055632 javax.script.filename variable should not be enumerable with nashorn engine's ENGINE_SCOPE bindings
2637 Attila Szegedi Independent JDK-8055631 Global object initialization via javax.script API should be minimal
2637 Attila Szegedi Independent JDK-8055630 [TEST_BUG] Test hideLocationProperties.js fail on Window due to backslash in path.
2637 Attila Szegedi Independent JDK-8055629 Explicit constructor overload selection should work with StaticClass as well
2637 Attila Szegedi Independent JDK-8055626 Minor API convenience functions on "Java" object
2637 Attila Szegedi Independent JDK-8055625 Reduce time spent in jdk.nashorn.internal.ir.Node.accept/java.lang.Class.cast(Object)
2637 Attila Szegedi Independent JDK-8055624 JSON.parse('{"0":0, "64":0}') throws ArrayindexOutOfBoundsException
2637 Attila Szegedi Independent JDK-8055623 String concatenation with optimistic types is slow
2637 Attila Szegedi Independent JDK-8055622 readFully does not handle ConsString file names
2637 Attila Szegedi Independent JDK-8055621 Persistent code store is broken after optimistic types merge
2637 Attila Szegedi Independent JDK-8055620 eval within 'with' statement does not use correct scope if with scope expression has a copy of eval
2637 Attila Szegedi Independent JDK-8055619 Type info caching accidentally defeated
2637 Attila Szegedi Independent JDK-8055618 bindings created for declarations in eval code are not mutable
2637 Attila Szegedi Independent JDK-8055617 (function(x){var o={x:0}; with(o){delete x} return o.x})() evaluates to 0 instead of undefined
2637 Attila Szegedi Independent JDK-8055616 function f(){ var a=1; with({ get a() { return false } }) return a }; f() throws TypeError with optimistic compilation
2637 Attila Szegedi Independent JDK-8055615 Add regression tests for passing test cases of JDK-8024971
2637 Attila Szegedi Independent JDK-8055614 large string size RangeError should be thrown rather than reporting negative length
2637 Attila Szegedi Independent JDK-8055613 Function("switch((null >> x3)) { default: {var x; break ; }\nthrow x; }")() results in AssertionError in LocalVariableTypesCalculator
2637 Attila Szegedi Independent JDK-8055612 ArrayLiteral mutability caused trouble in optimistic types
2637 Attila Szegedi Independent JDK-8055611 eval("23", ({})[/x/]) crashes with ArrayIndexOutOfBoundsException with optimistic compilation
2637 Attila Szegedi Independent JDK-8055610 Add a regression test for the passing test cases from JDK-8042304
2637 Attila Szegedi Independent JDK-8055609 (function() "hello")() crashes in Lexer with jdk9
2637 Attila Szegedi Independent JDK-8055608 Deoptimization type information peristence
2637 Attila Szegedi Independent JDK-8055607 apply on apply is broken
2637 Attila Szegedi Independent JDK-8055606 Make sure that there is no difference in test exercise behavior between lazy and non lazy
2637 Attila Szegedi Independent JDK-8055605 Running uncompilable scripts throws NullPointerException
2637 Attila Szegedi Independent JDK-8055604 Avoid repeated flattening of nested ConsStrings
2637 Attila Szegedi Independent JDK-8055601 MultiGlobalCompiledScript used to cache method handle and strict mode - not anymore
2637 Attila Szegedi Independent JDK-8055600 TypeError: Cannot apply "with" to non script object
2637 Attila Szegedi Independent JDK-8055599 nashorn properties leak memory
2637 Attila Szegedi Independent JDK-8055598 On-demand compiled top-level program doesn't need :createProgramFunction
2637 Attila Szegedi Independent JDK-8055597 Unnecessary restOf check in CodeGenerator.undefinedCheck
2637 Attila Szegedi Independent JDK-8055596 Some tests fail with non-optimistic compilation
2637 Attila Szegedi Independent JDK-8055594 Constant folding for unary + should produce int for boolean literals
2637 Attila Szegedi Independent JDK-8055593 Deoptimizing negation produces wrong result for zero
2637 Attila Szegedi Independent JDK-8055592 Ensure exceptions related to optimistic recompilation are not serializable
2637 Attila Szegedi Independent JDK-8055591 Get rid of global optimistic flag
2637 Attila Szegedi Independent JDK-8055590 Make optimistic exception handlers smaller
2637 Attila Szegedi Independent JDK-8055589 Nashorn : all tests failed with java.security.AccessControlException
2637 Attila Szegedi Independent JDK-8055586 Make code caching work with optimistic typing and lazy compilation
2637 Attila Szegedi Independent JDK-8055582 Make equality tests inline better
2637 Attila Szegedi Independent JDK-8055581 Enable history for empty property maps
2637 Attila Szegedi Independent JDK-8055580 Octane test harness in Nashorn is missing an argument for print_always
2637 Attila Szegedi Independent JDK-8055579 Fix yet another corner case of JDK-8041995
2637 Attila Szegedi Independent JDK-8055578 Type-based optimizations interfere with continuation methods
2637 Attila Szegedi Independent JDK-8055577 Index selection of overloaded java new constructors
2637 Attila Szegedi Independent JDK-8055576 Collapse long sequences of NOP in Nashorn bytecode output
2637 Attila Szegedi Independent JDK-8055575 Fix corner cases of JDK-8041995
2637 Attila Szegedi Independent JDK-8055574 Nashorn : all tests failed with java.security.AccessControlException
2637 Attila Szegedi Independent JDK-8055573 Reduce variability at JavaAdapter call sites
2637 Attila Szegedi Independent JDK-8055572 Use strongly referenced generic invokers
2637 Attila Szegedi Independent JDK-8055571 Improve performance of Nashorn equality operators
2637 Attila Szegedi Independent JDK-8055565 Fix RewriteException debug object return value
2637 Attila Szegedi Independent JDK-8055562 BranchOptimizer produces bad code for NaN FP comparison
2637 Attila Szegedi Independent JDK-8055556 Access to undefined scoped variables deoptimized too much
2637 Attila Szegedi Independent JDK-8055555 NPE in unboxInteger
2637 Attila Szegedi Independent JDK-8055553 OptimisticRecompilationTest fails on staging repo nashorn/jdk9/nashorn due to test framework
2637 Attila Szegedi Independent JDK-8055552 8037534 breaks richards Octane benchmark
2637 Attila Szegedi Independent JDK-8055549 Add more test cases to check static types
2637 Attila Szegedi Independent JDK-8055546 Check that deoptimizing recompilations are correct
2637 Attila Szegedi Independent JDK-8055545 New tests need to be written for optimistic typing feature
2637 Attila Szegedi Independent JDK-8055539 Need regression test for bug JDK-8010731
2637 Attila Szegedi Independent JDK-8055538 Developers should be able to pass nashorn properties and enable/disable JFR from command line
2637 Attila Szegedi Independent JDK-8055537 Remove nashorn repo "bin" scripts to avoid confusion with JDK bin launcher programs
2637 Attila Szegedi Independent JDK-8055536 NASHORN TEST: Create tests to test markdown javascript engine work with Nashorn.
2637 Attila Szegedi Independent JDK-8055534 Tidy up Nashorn codebase for code standards (August 2014)
2637 Attila Szegedi Independent JDK-8055533 Tidy up Nashorn codebase for code standards
2637 Attila Szegedi Independent JDK-8055529 Clean up the bin directory
2637 Attila Szegedi Independent JDK-8055186 Backport Nashorn optimistic typing to 8u repository
2637 Attila Szegedi Independent JDK-8047331 Assertion in CompiledFunction when running earley-boyer after Merge
2637 Attila Szegedi Independent JDK-8047166 Function("do with({}) break ; while(0);")() crashes with AssertionError from CompilationPhase.java:437
2637 Sean Coffey Oracle JDK-8055526 new hotspot build - hs25.20-b23
2637 Valerie Peng Oracle JDK-8055081 ReplayCacheTestProc test fails with timeout
2637 Kumar Srinivasan VMWare JDK-8055502 Launcher changes for native memory tracking scalability enhancement
2638 Sean Coffey Oracle JDK-8055383 Two tests failed with "java.net.SocketException: Bad protocol option" on Windows after 8029607
2638 Sean Coffey Oracle JDK-8055382 Type of Service (TOS) cannot be set in IPv6 header
2638 Thomas Schatzl Oracle JDK-8055363 Refactor HeapRegionSeq to manage heap region and auxiliary data
2638 Thomas Schatzl Oracle JDK-8055358 G1: Clean up usages of heap_region_containing
2638 Thomas Schatzl Oracle JDK-8055357 G1: More useful information in a few assert messages
2638 Thomas Schatzl Oracle JDK-8054549 gc/g1/TestEagerReclaimHumongousRegions2.java timeout
2638 Poonam Bajaj Parhar Oracle JDK-8044406 JVM crash with JDK8 (build 1.8.0-b132) with G1 GC
2638 Stefan Karlsson Oracle JDK-8055281 Several gc/class_unloading/ tests fail due to missed +UnlockDiagnosticVMOptions flag
2638 Christian Tornqvist Oracle JDK-8055243 Make jdk8u40 the default release
2638 Igor Veresov Oracle JDK-8055337 Segmentation error while running program
2639 Harold Seigel Oracle JDK-8055302 super() in a try block in a ctor may need to cause VerifyError
2639 Roland Westrelin Red Hat JDK-8055285 Make replace_in_map() on parent maps generic
2639 Bengt Rutisson Oracle JDK-8042305 CMS: enable time based triggering of concurrent cycles
2641 Anthony Scarpino Oracle JDK-8042161 sun.security.pkcs11.SessionManager is scalability blocker
2641 Alejandro Murillo Independent JDK-8055217 Make jdk8u40 the default jprt release for hs25.40
2642 Mikhail Cherkasov Oracle JDK-8054405 Unexpected mnemonic in JFileChooser
2642 Alejandro Murillo Independent JDK-8055155 new hotspot build - hs25.40-b06
2643 Erik Helin Oracle JDK-8054994 Check JNI ReleaseStringChars / ReleaseStringUTFChars verify_guards test inverted
2643 Erik Helin Oracle JDK-8054982 -Xcheck:jni should support checking of GetPrimitiveArrayCritical
2643 Anton Litvinov Oracle JDK-8050839 Java app receives javax.print.PrintException: Printer is not accepting job.
2644 Morris Meyer Oracle JDK-8054960 Add iterators to GrowableArray
2644 Vladimir Kozlov Oracle JDK-8054959 C2 support for SHA on SPARC
2644 Vladimir Kozlov Oracle JDK-8054958 Expand functionality of PredictedIntrinsicGenerator
2644 Vladimir Kozlov Oracle JDK-8054947 Optimize code generated by C2 for Intel's Atom processor
2645 Vladimir Kozlov Oracle JDK-8054924 Refactor DigestBase.engineUpdate() method for better code generation by JIT compiler
2645 Thomas Schatzl Oracle JDK-8054921 G1: verify that the marking bitmaps have no marks for objects over TAMS
2645 Thomas Schatzl Oracle JDK-8054357 Remove some obsolete code in G1CollectedHeap class
2645 Thomas Schatzl Oracle JDK-8054356 G1 asserts at collection exit with -XX:-G1DeferredRSUpdate
2645 Thomas Schatzl Oracle JDK-8054014 Eager reclaim leaves marks of marked but reclaimed objects on the next bitmap
2645 Thomas Schatzl Oracle JDK-8052413 CMS/G1 GC: add missing Resource and Handle mark
2645 Thomas Schatzl Oracle JDK-8051708 G1 Full GC needs to support the case when the very first region is not available
2645 Thomas Schatzl Oracle JDK-8051706 Conservative maximum heap alignment should take vm_allocation_granularity into account
2645 Thomas Schatzl Oracle JDK-8051705 Aborting marking just before remark results in useless additional clearing of the next mark bitmap
2645 Thomas Schatzl Oracle JDK-8051704 Use of during_initial_mark_pause() in G1CollectorPolicy::record_collection_pause_end() prevents use of seperate object copy time prediction during marking
2645 Thomas Schatzl Oracle JDK-8051703 Early reclamation of large objects in G1
2645 Anthony Petrov Oracle JDK-8054914 [JLightweightFrame] Support DnD for SwingNode
2645 Ivan Gerasimov Google JDK-8054910 (process) ProcessBuilder leaks native memory
2645 Albert Noll Oracle JDK-8054403 'assert(klass->is_loader_alive(_is_alive)) failed: must be alive' during VM_CollectForMetadataAllocation
2645 Albert Noll Oracle JDK-8054624 8040121 is broken
2645 Albert Noll Oracle JDK-8054585 Duplicate definitions in vm/runtime/sharedRuntimeTrans.cpp versus math.h in VS2013
2645 Vladimir Kozlov Oracle JDK-8054805 Update CLI tests on RTM options to reflect changes from JDK-8054376
2645 Vladimir Kozlov Oracle JDK-8054376 Move RTM flags from Experimental to Product
2645 Vladimir Kozlov Oracle JDK-8054858 JVM crashed in Compile::start() during method parsing w/ UseRTMDeopt turned on
2648 Anton Litvinov Oracle JDK-8049334 SortingFocusTraversalPolicy throws IllegalArgumentException from the sort method
2649 Stefan Karlsson Oracle JDK-8054414 TEST.groups references missing test: gc/class_unloading/TestCMSClassUnloadingDisabledHWM.java
2649 Stefan Karlsson Oracle JDK-8054413 Add flag to turn off class unloading after G1 concurrent mark
2649 Stefan Karlsson Oracle JDK-8049856 Metadata Full GCs are not triggered when CMSClassUnloadingEnabled is turned off
2649 Stefan Karlsson Oracle JDK-8049580 Minor cleanups after G1 class unloading
2649 Stefan Karlsson Oracle JDK-8049579 G1 Class Unloading after completing a concurrent mark cycle
2649 Stefan Karlsson Oracle JDK-8049576 Remove the is_scavenging flag to process_strong_roots
2649 Stefan Karlsson Oracle JDK-8049575 ConcurrentMark::cleanup leaks BitMaps if VerifyDuringGC is enabled
2649 Stefan Karlsson Oracle JDK-8049574 Remove dead oop_iterate MemRegion variants from SharedHeap, Generation and Space classes
2649 Stefan Karlsson Oracle JDK-8049572 Move object_iterate_mem from Space to CMS since it is only ever used by CMS
2649 Stefan Karlsson Oracle JDK-8049571 Move object_iterate_careful down from Space to ContigousSpace and CFLSpace
2649 Stefan Karlsson Oracle JDK-8049570 Clean up some virtual fucntions in Space class hierarchy
2649 Stefan Karlsson Oracle JDK-8049569 G1 HeapRegionDCTOC does not need to inherit ContiguousSpaceDCTOC
2649 Stefan Karlsson Oracle JDK-8049567 G1 Block offset table does not need to support generic Space classes
2649 Stefan Karlsson Oracle JDK-8049566 G1 Does not use the save_marks functionality as intended
2649 Stefan Karlsson Oracle JDK-8049564 Linker error when compiling G1SATBCardTableModRefBS after include order changes
2649 Stefan Karlsson Oracle JDK-8049563 G1 HeapRegions can no longer be ContiguousSpaces
2649 Stefan Karlsson Oracle JDK-8049561 Remove the usage of StarTask from BufferingOopClosure
2649 Stefan Karlsson Oracle JDK-8049560 Use BufferingOopClosure for G1 code root scanning
2649 Stefan Karlsson Oracle JDK-8049559 Remove the do_code_roots parameter from process_strong_roots
2649 Stefan Karlsson Oracle JDK-8049558 Use process_strong_roots to adjust the StringTable
2649 Stefan Karlsson Oracle JDK-8049557 Use CLDClosure instead of CLDToOopClosure in frame::oops_interpreted_do
2649 Stefan Karlsson Oracle JDK-8049556 Cleanup ClassLoaderData::is_alive
2649 Stefan Karlsson Oracle JDK-8049554 Don't use Handle in java_lang_String::print
2649 Stefan Karlsson Oracle JDK-8049552 Add missing Klass::oop_is_instanceClassLoader() function
2649 Stefan Karlsson Oracle JDK-8049551 Make CMS metadata aware closures applicable for other collectors
2649 Stefan Karlsson Oracle JDK-8049550 Clean the ExceptionCache in one pass
2649 Stefan Karlsson Oracle JDK-8049549 Remove unused _copy_metadata_obj_cl in G1CopyingKeepAliveClosure
2649 Stefan Karlsson Oracle JDK-8049548 Consolidate all CompiledIC::CompiledIC implementations and move it to compiledIC.cpp
2649 Stefan Karlsson Oracle JDK-8049547 Add a version of CompiledIC_at that doesn't create a new RelocIterator
2649 Alejandro Murillo Independent JDK-8054550 new hotspot build - hs25.40-b05
2649 David Holmes Oracle JDK-8054559 Support SKIP_BOOT_CYCLE=false when invoked from JPRT
2649 Igor Ignatyev Oracle JDK-8054552 new WB API :: get/setVMFlag
2649 Igor Ignatyev Oracle JDK-8054551 memory leak in jmm_SetVMGlobal
2650 Harold Seigel Oracle JDK-8051410 VerifyError on backward branch
2650 Ivan Gerasimov Google JDK-8049720 (smartcardio) CardTerminal.connect('direct') does not work on MacOSX
2651 Robert Mckenna Oracle JDK-8054428 Unexpected RuntimeExceptions being thrown by SSLEngine
2651 Robert Mckenna Oracle JDK-8054427 Ftp download does not work properly for ftp user without password
2651 Robert Mckenna Oracle JDK-8054426 java/lang/ProcessBuilder/Basic.java fails intermittently: waitFor took too long
2651 Alexandr Scherbatiy BellSoft JDK-8054415 [macosx] Do not use the base image in the MultiResolutionBufferedImage constructor
2651 Vladimir Kozlov Oracle JDK-8054384 VerifyStack logic in Deoptimization::unpack_frames does not expect to see invoke bc at the top frame during normal deoptimization
2652 Harold Seigel Oracle JDK-8051757 Regression in verifier for method call from inside of a branch
2652 Dmitry Markov Oracle JDK-8054216 [macosx] Language specific keys does not work in applets when opened outside the browser
2653 Aleksej Efimov Oracle JDK-8049707 getTextContent doesn't return string in JAXP
2655 Jon Masamitsu Oracle JDK-8054195 Make UseNUMA enable UseNUMAInterleaving
2655 Alejandro Murillo Independent JDK-8054159 new hotspot build - hs25.40-b04
2656 Jesper Wilhelmsson Oracle JDK-8054041 Refactor test framework for dynamic VM options
2656 Dmeetry Degrave Oracle JDK-8054142 NPE from JapaneseEra when a new era is defined in calendar.properties
2658 Chris Hegarty Independent JDK-8053971 Collections.checkedList(empty list).replaceAll((UnaryOperator)null) doesn't throw NPE after JDK-8047795
2658 Petr Pchelko Oracle JDK-8048551 [macosx] Disable usage of system menu bar if AWT is embedded in FX
2658 Andrew Brygin Azul JDK-8053933 KeyEvent can not be accepted in quick mouse clicking
2659 Jesper Wilhelmsson Oracle JDK-8053901 Add a way to verify an extended set of command line options
2659 Mikhail Cherkasov Oracle JDK-8049014 [macosx] Endless loop in EDT on Mac
2659 Thomas Schatzl Oracle JDK-8052410 gc/g1/TestGCLogMessages.java fail with "[Evacuation Failure' found"
2660 Mike Duigou Independent JDK-8052200 SynchronizedNavigableSet tailSet uses wrong mutex
2660 Erik Gahlin Oracle JDK-8046783 Add hidden field to methods for event based tracing
2663 Alejandro Murillo Independent JDK-8051910 new hotspot build - hs25.40-b03
2664 Peter Levart Independent JDK-8051918 (process) Merge UNIXProcess.java.bsd & UNIXProcess.java.linux
2664 Peter Levart Independent JDK-8047340 (process) Runtime.exec() fails in Turkish locale
2664 Vladimir Kozlov Oracle JDK-8051913 Fix bad field access check in C1 and C2
2664 Petr Pchelko Oracle JDK-8046819 [macosx] sigsegv (0Xb) Being Generated When Starting JDev With Voiceover Running
2664 Vladimir Kozlov Oracle JDK-8051774 Concurrency problem in PcDesc cache
2665 Vicente Arturo Romero Zaldivar Oracle JDK-8051467 javac, additional test case for JDK-8051402
2665 Aleksej Efimov Oracle JDK-8050473 NPE seen in XMLDocumentFragmentScannerImpl.setProperty since 7u40b33
2666 Maurizio Cimadamore Oracle JDK-8043927 javac, code valid in 7 is not compiling for 8
2666 Sean Coffey Oracle JDK-8051582 awt_Plugin no longer needed
2666 Sean Coffey Oracle JDK-8051581 DTDBuilder should be run in headless mode
2666 Sean Coffey Oracle JDK-8051580 [macosx] (awt) setjmp/longjmp changes the process signal mask on OS X
2666 Sean Coffey Oracle JDK-8051579 X11 dependencies should be removed from Mac OS X build.
2666 Aleksej Efimov Oracle JDK-8051014 FEATURE_SECURE_PROCESSING can not be turned off on a validator through SchemaFactory
2667 Vicente Arturo Romero Zaldivar Oracle JDK-8051402 javac, type containment should accept that CAP <= ? extends CAP and CAP <= ? super CAP
2667 Vicente Arturo Romero Zaldivar Oracle JDK-8047081 Crash on faulty reduce/lambda
2667 Weijun Wang Oracle JDK-8049690 NTLM authentication fail if user specified a different realm
2667 Thomas Schatzl Oracle JDK-8051419 [TESTBUG] gc/g1/TestSummarizeRSetStats* tests launch 32bit jvm with UseCompressedOops
2667 Thomas Schatzl Oracle JDK-8051418 Error message in AdaptiveFreeList::verify_stats is wrong
2667 Thomas Schatzl Oracle JDK-8049596 G1 crashes when run with -XX:-G1DeferredRSUpdate
2667 Thomas Schatzl Oracle JDK-8049595 Move G1ParScanThreadState into its own files
2667 Thomas Schatzl Oracle JDK-8049594 Swapped usage of idx_t and bm_word_t types in parMarkBitMap.cpp
2667 Thomas Schatzl Oracle JDK-8049593 max_heap_for_compressed_oops() declared with size_t, but defined with uintx
2667 Thomas Schatzl Oracle JDK-8049592 G1: Memory usage calculation uses sizeof(this) instead of sizeof(classname)
2667 Thomas Schatzl Oracle JDK-8049591 Clean up code and code duplication in re-diryting cards for verification
2667 Thomas Schatzl Oracle JDK-8049590 G1: High "Other" time most likely due to card redirtying
2667 Thomas Schatzl Oracle JDK-8040674 Remove HeapRegionRemSet::clear_incoming_entry
2667 Thomas Schatzl Oracle JDK-8040673 Use the "next" field to iterate over fine remembered instead of using the hash table
2667 Thomas Schatzl Oracle JDK-8040672 Change the in_cset_fast_test functionality to use the G1BiasedArray abstraction
2667 Thomas Schatzl Oracle JDK-8040670 G1 does not retire allocation buffers after reference processing work
2667 Thomas Schatzl Oracle JDK-8040645 G1CodeRootSet::test fails with assert(_num_chunks_handed_out == 0) failed: No elements must have been handed out yet
2667 Thomas Schatzl Oracle JDK-8037310 Fix visibility of G1ParScanThreadState members
2669 David Holmes Oracle JDK-8051400 Add hotspot testset to jprt.properties
2669 Vicente Arturo Romero Zaldivar Oracle JDK-8051384 javac, incorrect bug id in tests for JDK-8050386
2669 Vicente Arturo Romero Zaldivar Oracle JDK-8051383 javac, follow-up of fix for JDK-8049305
2669 Vladimir Kozlov Oracle JDK-8051378 AIX: Change "8030763: Validate global memory allocation" breaks the HotSpot build
2670 Mandy Chung Oracle JDK-8051377 (jdeps) Recommend supported API to replace use of JDK internal API
2670 Mandy Chung Oracle JDK-8051376 (jdeps) Add filtering capability
2670 Mandy Chung Oracle JDK-8051374 (jdeps) use @jdk.Exported to determine supported vs JDK internal API
2670 Ivan Gerasimov Google JDK-8050921 (smartcardio) Invert reset argument in tests in sun/security/smartcardio
2670 John Coomes Twitter JDK-8051295 make gc src file exclusion more automatic
2670 Robert Mckenna Oracle JDK-8051289 [TEST_BUG] test/script/basic/JDK-8026161.js fails with java.lang.UnsatisfiedLinkError
2670 Robert Mckenna Oracle JDK-8051265 (tz) Support tzdata2014c
2670 Robert Mckenna Oracle JDK-8051264 [macosx] setDisplayMode crashes
2670 Robert Mckenna Oracle JDK-8051263 [macosx] huge native memory leak in AWTWindow.m
2670 Robert Mckenna Oracle JDK-8051262 [TEST_BUG] sun/misc/Version/Version.java doesn't understand two-digit HotSpot minor version numbers
2670 Robert Mckenna Oracle JDK-8051257 Regression: postscript size increase from 6u18
2670 Robert Mckenna Oracle JDK-8051256 IM candidate window appears on the South-East corner of the display.
2670 Robert Mckenna Oracle JDK-8051254 (tz) Support tzdata2014b
2670 Robert Mckenna Oracle JDK-8051253 Review comments from 8035897
2670 Robert Mckenna Oracle JDK-8051252 [TEST] Child process error stream is not empty!
2670 Robert Mckenna Oracle JDK-8051251 Better memory allocation for file descriptors greater than 1024 on macosx
2670 Robert Mckenna Oracle JDK-8051248 [TEST_BUG] test/sun/util/calendar/zi/Zoneinfo.java incorrectly calculates raw GMT offset change time
2670 Robert Mckenna Oracle JDK-8051244 TEST_BUG: java/nio/channels/Selector/SelectAfterRead.java fails intermittently
2670 Robert Mckenna Oracle JDK-8051243 (tz) Support tzdata2014a
2670 Robert Mckenna Oracle JDK-8051236 Serial incompatibility in java.util.TreeMap.NavigableSubMap
2670 Robert Mckenna Oracle JDK-8051231 [TEST_BUG] java/awt/DataFlavor/MissedHtmlAndRtfBug/MissedHtmlAndRtfBug.html: test frames remain after test execution
2670 Robert Mckenna Oracle JDK-8051222 With active Securitymanager JAXBContext.newInstance fails
2670 Robert Mckenna Oracle JDK-8051211 Increment hsx 25.11 build to b03 for 8u11-b11
2670 Robert Mckenna Oracle JDK-8051209 Increment hsx 25.11 build to b02 for 8u11-b04
2670 Robert Mckenna Oracle JDK-8051208 Update hsx version to hs25.11 with b01 for 8u11 release
2670 Robert Mckenna Oracle JDK-8051199 new hotspot build - hs25.20-b22
2670 Mike Duigou Independent JDK-8051053 hgforest: some shells run read in sub-shell and can't use fifo
2670 Mike Duigou Independent JDK-8051052 get_source.sh outputs 'integer expression expected' messages
2670 Mike Duigou Independent JDK-8051051 Add Mercurial Version check to get_source.sh
2670 Mike Duigou Independent JDK-8051050 hgforest: allow local clone of extra repos
2670 Mike Duigou Independent JDK-8051049 Better concurrency in hgforest.sh
2670 Mike Duigou Independent JDK-8051048 Add sequential operation support to hgforest
2670 Mike Duigou Independent JDK-8051047 Some hgforest.sh commands don't receive parameters
2670 Mike Duigou Independent JDK-8051046 add "serve" command and --quiet and --verbose options to hgforest
2671 David Holmes Oracle JDK-8050969 Let jprt run configure when building
2671 Alejandro Murillo Independent JDK-8050951 new hotspot build - hs25.20-b21
2672 Chris Hegarty Independent JDK-8050858 Reduce possible timing noise in com/sun/jndi/ldap/LdapTimeoutTest.java
2672 Chris Hegarty Independent JDK-8050857 Improve diagnostic output in com/sun/jndi/ldap/LdapTimeoutTest.java
2673 Petr Pchelko Oracle JDK-8047076 GtkFileDialog strips user inputted filepath
2673 Ivan Gerasimov Google JDK-8049250 (smartcardio) Need a flag to invert the Card.disconnect(reset) argument
2673 Philip Race Oracle JDK-8050369 CustomMediaSizeName class matching to standard media is too loose
2674 Philip Race Oracle JDK-8050267 Default printer media is ignored
2674 Sean Coffey Oracle JDK-8049466 Test sun/security/pkcs11/Signature/TestDSAKeyLength.java fails intermittently on Solaris 11 in 8u40 nightly
2674 Petr Pchelko Oracle JDK-8050141 [macosx] test java/awt/image/ImageIconHang.java fails with NPE
2676 Svetlana Steuck Oracle JDK-8047186 jdk.net.Sockets throws InvocationTargetException instead of original runtime exceptions
2677 Alejandro Murillo Independent JDK-8049916 new hotspot build - hs25.40-b02
2677 Sean Coffey Oracle JDK-8049917 OutputStreamHook doesn't handle null values
2677 Sean Mullan Oracle JDK-8050000 XML Signature performance issue caused by unbuffered signature data
2677 David Holmes Oracle JDK-8049994 Support invoking Hotspot tests from top level
2677 David Holmes Oracle JDK-8049929 Configure --with-jvm-variants=client,server,x produces default outputdir containing comma
2677 Vladimir Kozlov Oracle JDK-8049903 Introduce umbrella header prefetch.inline.hpp
2677 Vladimir Kozlov Oracle JDK-8049902 Introduce umbrella header orderAccess.inline.hpp
2678 Mikhail Cherkasov Oracle JDK-8049887 PNGMetadata.getAsTree() sets bitDepth to invalid value
2679 Dmitry Markov Oracle JDK-8049577 NPE when changing Windows theme
2680 Lance Andersen Oracle JDK-8049633 remove invalid test entry from TEST.groups
2680 Andrew Brygin Azul JDK-8049598 Test test/sun/awt/image/bug8038000.java fails with ClassCastException
2681 Mike Duigou Independent JDK-8049468 Collections.checkedList checking bypassed by List.replaceAll
2681 Mike Duigou Independent JDK-8049467 CheckedQueue.offer calls wrong method on wrapped queue
2681 Bengt Rutisson Oracle JDK-8049327 [TESTBUG] gc/logging/TestGCId.java assumes default PrintGCID value is true
2681 Ivan Gerasimov Google JDK-8048884 TEST BUG: NativeErrors.java uses wrong path name in exec
2681 David Holmes Oracle JDK-8049412 Jtreg /jdk/TEST.groups should be changed for profiles
2683 Vicente Arturo Romero Zaldivar Oracle JDK-8049076 javac, wildcards and generic vararg method invocation not accepted
2684 Michael Fang Oracle JDK-8049128 8u20 l10n resource file translation update 2 - jaxp
2684 Weijun Wang Oracle JDK-8049315 Broken links to jarsigner and keytool docs in java.security package summary
2686 Sean Coffey Oracle JDK-8049036 java/net/URLPermission/nstest/lookup.sh NoClassDefFoundError when run in concurrent mode
2686 Sergey Bylokhov Amazon JDK-8049059 AWT crashes inside CCombinedSegTable::In called from Java_sun_awt_windows_WDefaultFontCharset_canConvert
2686 Petr Pchelko Oracle JDK-8048861 Sorting columns in JFileChooser fails with AppContext NPE
2687 Christian Tornqvist Oracle JDK-8048931 Set T family feature bit on Niagara systems
2687 Dmitry Markov Oracle JDK-8048717 [macosx] javax.swing.PopupFactory issue with null owner
2687 Markus Grönlund Oracle JDK-8048875 Ensure ClassLoaderDataGraph::classes_unloading_do only delivers klasses from CLDs with non-reclaimed class loader oops
2687 Joe Wang Oracle JDK-8037948 Improve documentation for org.w3c.dom package
2688 Weijun Wang Oracle JDK-8048696 JDK KRB5 module throws OutOfMemoryError when CCache is corrupt
2688 Weijun Wang Oracle JDK-8048087 Cannot read ccache entry with a realm-less service name
2690 Brent Christian Oracle JDK-8044473 Allow for extended set of platform MXBeans
2691 Bengt Rutisson Oracle JDK-8042767 Cleanup SuspendibleThreadSet
2691 Bengt Rutisson Oracle JDK-8048522 Add a GC id as a log decoration similar to PrintGCTimeStamps
2691 Vicente Arturo Romero Zaldivar Oracle JDK-8044835 Fix timing of varargs access check, per JDK-8016205
2692 Alejandro Murillo Independent JDK-8048141 Update the Hotspot version numbers in Hotspot for JDK 8u40
2694 Dan Smith Oracle JDK-8048019 javac crashes when encountering an unresolvable interface
2694 Robert Field Oracle JDK-8046060 Different results of floating point multiplication for lambda code block
2695 Kumar Srinivasan VMWare JDK-8047887 Fix raw and unchecked lint warnings in asm
2697 Coleen Phillimore Oracle JDK-8047880 host_klass invariant fails when verifying newly loaded JSR-292 anonymous classes

No changesets log

JDK-8186393 Release Note: Message digest algorithms are now enabled by default for SunPKCS11 provider on Solaris
JDK-8148189 Lambda method names are unnecessarily unstable
JDK-8129268 "fx:info" arguments "copyright" and "license" do nothing
JDK-8129264 javafxpackager doesn't support local installation as fx tasks supports
JDK-8129263 Create a Gradle plugin for JavaFX
JDK-8098504 [Monocle] Implement software solution for double buffering
JDK-8098442 [Monocle] Make sure all methods in the X11 port have javadoc
JDK-8098441 [Monocle] Make sure all methods in Monocle used by the X11 port have javadocs
JDK-8098439 Add versioning to monocle NativePlatform/NativePlatformFactory
JDK-8098435 [packager] Document Simple DMG Bundler Argument
JDK-8098434 Group theme css in single css files
JDK-8098433 Adapt CSS Analyzer to SubScene implementation
JDK-8098418 Document 'signBundle' bundler argument
JDK-8098334 Document Java Packager Secondary Launchers
JDK-8098313 [ScrollPane, TextArea] Introduce minViewportWidth and minViewportHeight properties
JDK-8098305 Java FX Unit tests improvements
JDK-8098302 Add Spinner Control
JDK-8098300 Support FontSmoothingType "LCD" for Canvas' fillText
JDK-8098294 [CSS] Add support for specifying durations
JDK-8098282 "A bound value cannot be set" exception should print the name of the property that is causing the problem
JDK-8098280 Provide media support for libav version 54 and 55
JDK-8098267 Implement BI_BITFIELDS BMP format support
JDK-8098266 Restore missing comments that were lost in lambda conversion
JDK-8098263 Preloader#handleXxxNotification JavaDoc could be better
JDK-8098260 Add a gradle "cleanAll" task to clean everything, including buildSrc/build
JDK-8098258 [Text] Hitting an empty Text returns insertion index out of text bounds
JDK-8098254 StringConverter support for LocalDate/LocalTime/LocalDateTime
JDK-8098248 Provide accessibility support for FX
JDK-8098245 Packager API: provide an access to Mac categories
JDK-8098228 Umbrella for Changes for JEP-208 - Java Packager Improvements
JDK-8098226 Implement auto-mipmap support
JDK-8098222 [packager] Simple DMG Generation
JDK-8098220 Add a isAlphaTestShader() method to BaseGraphics Class
JDK-8098219 'Wrap in' and 'Unwrap' commands should be available for all relevant containers (incl. FlowPane & TilePane)
JDK-8098217 FXOMSaver.NAME_SPACE_FXML should depends on FXMLLoader.FXML_VERSION
JDK-8098207 Improve preferences robustness
JDK-8098204 Content panel should rely on SubScene
JDK-8098199 Code cleanup: Better naming for scene antialiasing in toolkit and prism
JDK-8098196 'Wrap in' and 'Unwrap' commands should be available for ButtonBar
JDK-8098181 [Accessibility] Add accessibility support for Charts
JDK-8098172 Integrate new Packager API support for open source Maven and Gradle bundler projects
JDK-8098140 SwingFXUtils.fromFXImage will add an alpha channel
JDK-8098122 Add support for vertex normals for meshes, in addition to smoothing groups
JDK-8098112 Remove unused ShapeUtil.rasterizeGlyphOutline method and relevant prism settings
JDK-8098100 Native bundles: add support to create file association
JDK-8098097 Providing Node.localToWindow()
JDK-8098096 [Quantum] Cleanup renderLock usage to call QuantumToolkit runWith/WithoutRenderLock
JDK-8098093 [HelloSlider] Change / Add couple of vertical sliders to the example
JDK-8098079 NGCanvas should take advantage of new 1-step clip support
JDK-8098076 add option to disable native bundler codesign
JDK-8098071 [CSS] Reduce CssMetaData boilerplate code
JDK-8098050 Add Window setUserData and user data to other non-Node classes
JDK-8098048 [Accessibility] Implement ContextMenu
JDK-8098042 [Android] Add Android Platform to monocle
JDK-8098039 Enforce NPOT requirement on desktop and embedded for 3D support
JDK-8098036 jfxrtJarExcludes property rework
JDK-8098006 Clean up warnings in control component
JDK-8098002 Implement Alpha test functionality for the embedded platform
JDK-8097988 Clean up Glass GTK compile warnings
JDK-8097985 Enable JavaFX to build with VS 2012 and VS 2013
JDK-8097937 Relax restriction on creating Scene only on FX App thread
JDK-8097928 Add Formatted TextField control
JDK-8097925 Provide missing convenience constructors to controls classes
JDK-8097923 [Ensemble8] Need various improvements in Dialog sample
JDK-8097920 [TableView and others] Additional constructor: PropertyValueFactory( String property, int index )
JDK-8097919 Create Visual Unit Tests for newly supported VertexFormat type
JDK-8097915 [Canvas] Canvas needs a fast rectangular clip capabiity
JDK-8097900 [PACKAGER] Remove cachecertificates from fx:permissions
JDK-8097897 Alert class Javadoc example needs improvement
JDK-8097880 Wrap command should propagate static properties to the new container
JDK-8097872 Remove CSS workaround for RT-37173 from DocumentWindow.css
JDK-8097870 Hook up SceneBuilder for building
JDK-8097867 Support multiple entry points in native installer
JDK-8097863 ES2: Need to provide query and print out (on verbose) support for OpenGL ES2 implementation dependent limits
JDK-8097860 [Accessibility] Review a11y enums
JDK-8097856 Support 3D on the embedded platform
JDK-8097844 Messages about library imports may be more precise
JDK-8097833 [Ensemble] Add Spinner control sample app
JDK-8097830 Add a non empty flavor of DialogPane in the Library
JDK-8097828 [Linux] enable building 32-bit Linux on 64-bit systems
JDK-8097824 [Spinner] Add LocalTime SpinnerValueFactory
JDK-8097815 Preferences cleaning
JDK-8097809 Model vram limit parameters on the Java VM heap limit parameters
JDK-8097791 Add javafx.scene.control.Alert class
JDK-8097789 [CSS] Add ability to resolve the URL given with an @import statement relative to the FX runtime
JDK-8097787 [Canvas] Provide GraphicsContext API to set dashed line stroke
JDK-8097777 [macosx] Separate QTKit platform code from core media code so it can be removed for MAS
JDK-8097769 Remove workaround for DTL-6628
JDK-8097761 Use Lambda in Snapshot1Test.java
JDK-8097757 Add ButtonBar component to the Library
JDK-8097697 Review API for 8u40
JDK-8097692 Document 'signBundle' bundler argument for javapackager command
JDK-8097679 Embedded Jar sizes have increased since 8u6
JDK-8097643 Correct OpenJFX ARM build documentation
JDK-8097595 SB should use the new impl_findStyles() API
JDK-8097583 Accept code contribution / concept for OS-specific button ordering using button order string and specification of button type
JDK-8097530 Document new JVMUserOptionsService API
JDK-8097517 [Accessibility] enable a11y by default on supported platforms
JDK-8097506 [Controls, Spinner] Add key binding to increment and decrement the Spinner
JDK-8097505 [a11y] ToggleButton does not report its selection state
JDK-8097500 [CSS] ProgressIndicator does not spin anymore since 8u20
JDK-8097496 HelloHighContrast throws NPE
JDK-8097494 [Chart] HelloStackedAreaChart has a missing symbol
JDK-8097489 [ButtonBar] Handle changing the ButtonData on a button dynamically
JDK-8097484 [Gtk] Remove "Failed in XOpenDisplay" warning message
JDK-8097476 Selection lost after Trim Document To Selection job
JDK-8097460 “tickLableRotation” property can not work as expected
JDK-8097459 [Accessibility] Intermittent crash / relaunch on exit on Windows 7 with Narrator
JDK-8097447 [ListView] ListView: selection/focus state broken after insert item
JDK-8097444 Embedded, 3D: Rendering artifacts on the Freescale iMX6 device
JDK-8097438 Shape.strokeDashArray property should be hidden
JDK-8097435 Update copyright header for files modified in 2014
JDK-8097433 Prism texture resource management code reports a non-fatal assertion failure.
JDK-8097429 UserJvmOptionsService.setUserJVMOptions Needs to save preferences to disk
JDK-8097428 [Printing] ManagedResource issues with threading and multiple ResourceFactories.
JDK-8097427 [HelloAccordion] Artifacts draw when last item expanded (software pipeline)
JDK-8097425 [LINUX] No Debian bundle is in the artifacts of the Nightly
JDK-8097418 Regression: Parameters passed into dtjava.js are ignored
JDK-8097416 ButtonBar -fx-focus-traversable initialValue should agree with the focusTraversable property
JDK-8097390 SwingNode: IllegalArgumentException about "null source" when closing combobox
JDK-8097382 [Accessibility, API] rename a11y methods
JDK-8097377 Preview/JavaFX Theme throws NPE when no document window is opened
JDK-8097347 [FXML] ProxyBuilder does not support read-only collections
JDK-8097344 [Accessibility] Not able to delete Tab via primary action on "X" button of the tab
JDK-8097337 "Stopped working" message shown on application exit
JDK-8097328 [SwingNode]: Swing Nodes have serious rendering artifacts when first displayed on the primary Stage
JDK-8097316 [TableView] api doc of edit(...) incomplete
JDK-8097314 [JFXPanel] Two popup windows in WebEngine on OS X 10.10
JDK-8097310 [Charts] Series: NPE when adding data items multiple times
JDK-8097302 Extra characters in translated javapackager/javafxpackager man pages for 8u40
JDK-8097299 [Build] fix WINDOWS_NATIVE_COMPILE_ENVIRONMENT
JDK-8097297 [packager] Provide friendly APIs to access User JVM Preferences
JDK-8097293 [DatePicker] Does not change to new selected value if modal window is shown in DatePicker-action
JDK-8097271 [TabPane] The tab disappeared after the index changed
JDK-8097265 Blank page prints when printed node contains any 3D content
JDK-8097263 [Regression] Animation in Progress Bar is out of place
JDK-8097257 Additional app-thread checks should be added (back) after RT-17716
JDK-8097245 'Paste Into' could attempt to add the copied node as a graphic of the selected node (when selected node not a container).
JDK-8097237 Update the protocol for references of docs.oracle.com to HTTPS
JDK-8097235 [Ensemble8] Alert type not initialized, so dialog cannot be dismissed
JDK-8097226 [Accessibility, Traversal, HelloRadioButton] When using Arrow Keys, selected Radio Button will not wrap around from first to last and vice versa.
JDK-8097224 BoxBlur effect leads to runtime exception in embedded JavaFX
JDK-8097214 [SplitPane] Cannot set divider position in multiple splitpanes at once on button setOnAction()
JDK-8097210 [Dialogs] Fix layout issues
JDK-8097199 [Stage, Linux] In HelloSanity, the 'Back from minimize' button does not restore the stage
JDK-8097189 [macosx] setjmp/longjmp changes the process signal mask on OS X
JDK-8097180 2u Scenebuilder build stuck with signing on Mac OSX with Client jar version 2.4.0.0.0
JDK-8097178 [Bundlers] all the bundles stopped working with SegFault under MacOS
JDK-8097155 PopupControl$CSSBridge changed to extend Pane in 8u40
JDK-8097154 ConcurrentModificationException if an attempt is made to remove an accelerator whilst an accelerator callback is being processed
JDK-8097148 Unit test failure in tests written for RT-34493
JDK-8097126 [DialogPane] ContentText sometimes not displayed
JDK-8097115 [Monocle] Exception on Multitouch-Event using Monocle on Linux
JDK-8097113 Gtk: FX exits with GTK error when DISPLAY not set, should throw Exception
JDK-8097112 Add Single Touch Non-Fullscreen Test
JDK-8097110 StyleClass froze SceneBuilder
JDK-8097108 [VirtualFlow] Cells with a height depending on their width are not correctly resized and positioned
JDK-8097101 Setting a property from the inspector may have no effect on Preview
JDK-8097089 JavaFX applets do not start on Mac OS X yosemite
JDK-8097088 [Transform] transform(Bounds) and inverseTransform(Bounds) produce incorrect results
JDK-8097081 scenebuilder rejects negative scale values
JDK-8097076 [Mac] Update build system to properly support Xcode 5 and later
JDK-8097062 [Bundlers] 64-bit Linux bundles stopped working with the segmentation fault
JDK-8097058 [ListView] ListView.ListViewFocusModel#itemsContentListener is called twice
JDK-8097046 Item chosen from auto-suggest menu is not applied immediately
JDK-8097045 Get rid of unused CubicCurve shaders
JDK-8097043 [Android] key mapping overflow
JDK-8097027 [Accesssibility, Windows] ListView should not read "colunn one row xx"
JDK-8097020 Intermittent unit test failure in com.sun.glass.ui.monocle.input.RotateTest
JDK-8097016 [Dialog] Alert dialogs does not show the complete message
JDK-8097009 Multiple Identical Methods are created in Sample Controller Skeleton
JDK-8097000 Re-enable SelectBindingTests which relied on old logging behavior
JDK-8096958 [Accessibility API] remove getAccessible() and the Accessible
JDK-8096952 [JFXPanel] Scene Antialiasing doesn't work in JFXPanel
JDK-8096949 [LineChart] Calling setForceZeroInRange doesn't update LineChart
JDK-8096948 Shape.setSmooth() can leak setting to any following Region nodes
JDK-8096942 [Javadoc] Need to clearly document the effect of SceneAntialiasing on 2D primitives
JDK-8096938 [ColorPicker, RTL] On color palette, arrow keys don't work well in RTL orientation.
JDK-8096930 [Accessibility] Mnemonics should be properly formed for proper text-to-speech support
JDK-8096926 BorderStroke constructor doesn't respect widths
JDK-8096922 [TableView] TableColumns are not garbage collected
JDK-8096909 Wrong touch coordinates for a window not at the origin (0,0)
JDK-8096897 Can not use Edit > Paste Into when selecting an empty TitledPane, Tab or ScrollPane
JDK-8096896 TreeTableView editing cell via edit(index, column) results in wrong cell entering editmode
JDK-8096895 Dirty document icon still there after Save As
JDK-8096892 [Spec] Cursor.setVisible behavior is unspecified
JDK-8096885 Inspector Search section no longer remembers size as in 1.1
JDK-8096884 [TableView] Cant get the Table Column from a selected TableView Cell in version 8u20
JDK-8096883 Typo in FontWeight.findByWeight() documentation
JDK-8096864 [TabPane] Tab not moved after reordering of tabs
JDK-8096862 [CSS] CustomColorDialog cannot be skinned by adding stylesheet to scene.
JDK-8096849 Numerous unit test failures in SimpleSwipeTest
JDK-8096848 [TabPane] ContextMenu on Tab is lost when the tab is moved
JDK-8096842 Using fx:include crashes hierarchy/controller view in scenebuilder 2.0
JDK-8096827 removing font causes fxml file to break
JDK-8096809 [Monocle] Fall back to headless screen if we cannot access the framebuffer
JDK-8096786 [JFXPanel, Mac] WebView draws duplicate image on Retina display
JDK-8096767 [iOS] JavaFX does not compile with iOS8 SDK
JDK-8096759 [MAC] $APPDIR in Info.plist is no longer handled by the launcher
JDK-8096758 KIT: InspectorPanelController.showMode initial value is null
JDK-8096757 [CSS, SceneGraph] Node lookup with TabPane
JDK-8096754 [CSS, Control] Improve handling of Control.getUserAgentStylesheet()
JDK-8096752 SceneBuilder does not open FXML with fx:script
JDK-8096749 OutOfMemoryError with FadeTransition under certain circumstances
JDK-8096748 [CSS] ConcurrentModificationException when changing user-agent stylesheets
JDK-8096747 [Accessibility, Mac] hello.HelloDatePicker with voiceover enabled throws NPE when a different local is selected
JDK-8096719 [Ensemble] Add TextField with formatter sample to Ensemble
JDK-8096716 [Canvas] GraphicsContext.{fill/stroke}Poly{line/gon}() methods do not flush transform
JDK-8096708 Hierarchy Panel is laid out with an Inset
JDK-8096699 [Dialogs] Default button for Alert dialog does not have focus on Mac and Linux
JDK-8096687 Dashed border with width is broken
JDK-8096677 [Lens] Exclude Lens classes and shared libraries
JDK-8096668 [Ensemble, TextFlow] Missing repaint after 'Hello' string is rotated and translated
JDK-8096654 [packager] Mac App Store bundler produces NPEs on non-mac platforms
JDK-8096653 Accelerator editor does not work anymore
JDK-8096649 CSS -fx-pref-width et al do not accept "infinity" value
JDK-8096644 [TableView] Regression TableView: cannot start editing via keyboard
JDK-8096638 [Accessibility, JAWS] Fix TableView
JDK-8096633 TableView focus/selection broken when adding a new column
JDK-8096626 Update Java FX release version from 8u20 to 8u40 in 8u-dev forest
JDK-8096620 CSS Warnings when Color chooser is opened
JDK-8096598 [Dialogs] Need to specify how Dialog.close() is handled
JDK-8096593 [Accessibility, Mac] DatePicker crashes VoiceOver on OS X 10.10
JDK-8096591 [Dialog] Dialogs with owner window set should inherit stylesheets
JDK-8096579 [Stage, Windows] Bad rendering of Icons
JDK-8096572 [Accessibility] Support JAWS
JDK-8096562 gradle -PCONF=DebugNative fails with VS2010 due to '/FS' argument
JDK-8096540 Pagination leak
JDK-8096539 [Accessibility] HelloSpinner throws NPE when using primary action on the ComboBox
JDK-8096530 [TreeView] No selection list update after TreeItem is removed from TreeView.
JDK-8096509 [AreaChart] Legend rendering has slightly changed
JDK-8096505 [Build] bad warning checking CONF
JDK-8096501 Authorizing multiline on TextField is confusing
JDK-8096492 Vertical spacing of Hierarchy items changes height when different nodes are selected.
JDK-8096483 [WebView] Java Logger settings corrupt webview
JDK-8096468 Exception after using Style Class auto-suggest menu and then clicking in Style property
JDK-8096463 SB should resolve lookups defined in a .root style class
JDK-8096459 [Monocle] ZoomTests are being failing (probably because of the timing in inertia issue)
JDK-8096457 [Bundlers] second launcher is not created under OS X
JDK-8096444 TableColumn: default comparator should use Collator for String types
JDK-8096436 Slider in Hvalue/Vvalue editor is not initialized properly
JDK-8096427 Map- and SetExpression invalidation listeners cause eventual NPEs when removing themselves
JDK-8096425 Touch Drag/Move not working on eGalax Touchscreen b111 -> b112
JDK-8096420 [TableView] TableView selection performance (regression in 8u20)
JDK-8096417 [Dialog] Calling Dialog.setHeaderText after Dialog.showAndWait leads to strange effects if header was null before
JDK-8096411 Invalid Change object when listening to selected items of a table
JDK-8096409 [Accessibility] Define title, description, and help
JDK-8096405 In "JavaFX CSS Reference Guide" for Release: JavaFX 8 missing new JavaFX Controls
JDK-8096378 [CSS] loading user-agent stylesheets one at a time from PlatformImpl is inefficient
JDK-8096371 [Dialogs] Alert with Yes/No buttons can be closed with the ESC key, but alt-F4, etc are vetoed
JDK-8096359 [Canvas] Significant performance issue with extra clip and temp buffer validations
JDK-8096348 Stackoverflow on JavaFX Application Thread
JDK-8096336 Dialog opens non-centered to the stage, and gets more off-center the larger the dialog content
JDK-8096333 Permissions of shared libraries incorrect in JDK
JDK-8096312 [WebView] DEBUG build fails with unresolved symbols
JDK-8096304 ArrayindexoutOfBoundsException from Parent.updateCachedBounds
JDK-8096289 [EnsembleApp] Icon for Spinner is the same as progress bar
JDK-8096284 Zoom gesture inertia too agressive
JDK-8096282 Typos in cssref.html
JDK-8096280 JavaBeanProperties fixed DescriptorListenerCleaner still causes memory leaks
JDK-8096274 [Font] ConcurrentModificationException in PrismFontFactory
JDK-8096269 Content Panel can fail to visualise CSS changes from external style sheet
JDK-8096255 Unit test timeout failure in ImageRace test
JDK-8096252 Inspector might ensure values for hValue / vValue on ScrollPane are within bounds
JDK-8096243 [ListView] Removing multiple items including the selected item leads to inconsistent and wrong selection state
JDK-8096235 [TableView] TableView selection problem with SHIFT (visual not updated)
JDK-8096208 FormatStringConverter should convert only full Strings
JDK-8096199 [TabPane] Tab.setContextMenu(null) throws NPE when the tab is not assigned to a TabPane (regression from 8)
JDK-8096186 NPE when a Node is deleted
JDK-8096163 [CSS] NPE while processing a file with @import statement referring CSS files of jfxrt.jar
JDK-8096145 Some tests doesn't test actual controls classes
JDK-8096143 [Accessibility,Mac] NPE in MacAccessible.flipBounds when closing full-screen Stage while running VoiceOver
JDK-8096140 SB metadata need adjustment after Node.role and Node.roleDescription renaming
JDK-8096136 [ComboBox] Editable ComboBox doesn't handle IM events if it gets focus through focus traversal keys.
JDK-8096130 [Ensemble8] Spinner sample clips text field in some of the spinner examples
JDK-8096123 GridPane decoration off after using "Trim Document to Selection"
JDK-8096121 [TreeTableView] both root and the second child are selected when the root's first child is deleted.
JDK-8096105 [TextArea] TextArea still visible when height set to 0 (regression)
JDK-8096080 [Monocle] Touch does not work on MB86S70
JDK-8096073 Exception adding data point to stacked area chart without symbols
JDK-8096068 Preview -> DialogPane should not use current FXOMDocument
JDK-8096066 Region is not properly clipped when defined by a shape
JDK-8096063 [Dialogs] The buttons in the DialogPane are not focus-traversable
JDK-8096054 Copy command fails when selected object contains references
JDK-8096049 [Toolbar] Combo box unexpectedly shows in toolbar overflow menu
JDK-8096044 [WebView] data-protocol not supported in sandboxed WebView
JDK-8096041 [TableView] Selecting a single item after having multiple items selected in a TableView can cause one Change where the newly selected item is both removed and added.
JDK-8096032 A splitter shows up even when there is no search pattern setup in InspectorPanelController
JDK-8096016 Zoom doesn't work well in swpipeline.
JDK-8096001 Javadoc is missing for several methods of the Node class
JDK-8095999 [Dialogs] The header text of a Dialog is not resized properly
JDK-8095994 [TableView, Header] TableView hides header in case that all columns are hidden
JDK-8095989 Need to print warning when j2d pipeline is selected as primary renderer
JDK-8095981 VirtualFlow uses forEach
JDK-8095972 [ColorPicker, Traversal] StackOverflowError when pressing traversal keys on color palette.
JDK-8095971 Selection lost after undoing import file
JDK-8095956 [ListView] Regression: ListView auto-selecting first item on focusGained
JDK-8095932 [Packager] Unable to start application when user JVM options are provided
JDK-8095931 ClassCastException after TreeTableColumn setText(...)
JDK-8095929 [Accessibility] implement a set focus action
JDK-8095903 SB hangs when setting invalid value to -fx-region-border
JDK-8095898 [HelloPopupMenu] Sample needs additional controls for Accessibility testing
JDK-8095889 Windows Vista: JVM crash after dragging the file dialog opened by FileChooser or DirectoryChooser
JDK-8095887 Remove "/arch:sse" from 64-bit Windows build
JDK-8095884 Allow animated GIF to be loaded partially if it has errors in the data stream
JDK-8095881 [TableView] incorrect extend selection after inserting items
JDK-8095859 [Accessibility] Improve TreeTableView support for Screen Readers
JDK-8095857 Dropping an object between two GridPane rows does not reorganize the grid content correctly
JDK-8095854 [HelloRadioButton] Sample needs additional controls for Accessibility testing
JDK-8095846 [RTL, ColorPicker] Inconsistent format of web color code in Custom Colors dialog.
JDK-8095844 [FXMLLoader]: Null builderFactory makes it impossible to load many types of classes
JDK-8095832 ColorPicker throw exceptions
JDK-8095811 SceneBuilder always writes default properties when saving, even when original FXML file omitted them.
JDK-8095806 Mac: Assertion failures when exiting VideoCube test
JDK-8095803 Selection breaks when GridPane contains fx:include children
JDK-8095800 [Gtk, Mac] Japanese IME, unable to distinguish focused composing text
JDK-8095791 [CSS] App hangs when setting style to -fx-region-border
JDK-8095789 [Accessibility] Make Spinner accessible
JDK-8095787 [WebView] HTML canvas clip() functionality broken
JDK-8095777 [Dialogs] Text cut off in Dialogs API when wrapped over multiple lines
JDK-8095771 [Linux] StrokeType drawn incorrectly on Ubuntu (non-native Pisces)
JDK-8095769 [Charts] Series: NPE when adding data items after deletion of data
JDK-8095768 Monocle EGL fails to initialize on imx.6
JDK-8095747 Selecting a side tab scrolls tabs out of view
JDK-8095741 [Dialogs] HelloAlert ESC and (x) do not close dialog that only has 'OK'
JDK-8095731 [ComboBox] ComboBox does not reflect change in button cell immediately
JDK-8095730 Cannot load custom fxml file with scenebuilder 2.0
JDK-8095727 [Dialogs] Replace placeholder graphics with proper, approved dialog graphics
JDK-8095722 Win: Huge Memory Consumption for Transparent Stage
JDK-8095715 [packager] LauncherUserJVMOptions native headers incorrect
JDK-8095698 [Decora] Render bug animating over node with lighting effect
JDK-8095689 [ComboBox] ComboBox: can't null selectedItem
JDK-8095674 [ColorPicker, Modena] Colorpicker changes size depending on the currently selected color
JDK-8095648 ListView may not return the selected item (Regression)
JDK-8095647 [packager] MacOSX Does not respect JVMUserOptions
JDK-8095644 [Accordion] Accordion throws IndexOutOfBoundsException after remove all panes
JDK-8095629 [packager] Eliminate reliance on classpath based resource overrides
JDK-8095617 [CSS] errors in cssref html causing issues in various browsers
JDK-8095610 [Monocle] Robot screen/pixel capture is broken
JDK-8095608 Repeated ListProperty.bindContent() silently breaks the list
JDK-8095596 Changing focus order for GridPane by Hierarchy Pane doesn't work
JDK-8095578 Using external keyboard on Mac, 'DEL' key in inspector textfield delete current node
JDK-8095550 [CSS] Warning messages in media Ensemble tests (regression)
JDK-8095537 Spinner: StackOverflow on in editable spinner
JDK-8095532 [Accessibility] SHOW_MENU action should be handled in Node
JDK-8095501 [packager] MSI Bundler fails when multiple extensions are present
JDK-8095495 Mac launcher in fxpackager no longer builds with SDK 10.9
JDK-8095486 [Bundlers] "mac.dmg.simple" option make MacDmgBundler stuck with message "-processKernelRequest: will sleep received" message
JDK-8095484 Copy / Paste is broken
JDK-8095471 [TableView] TableCell border lines are rendered incorrectly
JDK-8095465 [Monocle] correct i.MX6 detection
JDK-8095447 [ListView, et al] IOOBE when clearAndSelect called in certain circumstances
JDK-8095446 [TableView] IOOBE when using bindings API with SelectionModel selectedItems list
JDK-8095431 [Bundlers] ant bundling fails with NPE when using file associations
JDK-8095415 On Mac the packager fails with NPE when facing multiple matching identities for signing
JDK-8095402 Should Axis be allowed to be wrapped in another container?
JDK-8095396 Unable to produce a Mac AppStore package with the Ant interface (but fine with packager Java API)
JDK-8095390 Multiple selection lost after performing Use Computed Sizes
JDK-8095388 ConcurrentModificationException when SubScene.setUserAgentStylesheet() is called
JDK-8095387 DialogPane: Exception when both header and headerText are set
JDK-8095368 [CSS] Enum values should not be treated as value references to be looked up
JDK-8095353 [JFXPanel] Access denied when scrolling in WebView in Sandboxed Applet
JDK-8095347 Owned and Modal Windows should not be minimizable/maximizable
JDK-8095342 [Ensemble] QuadCurve example uses labels that refer to "cubic curve"
JDK-8095329 [TableView] setFixedCellSize causes new columns to be blank
JDK-8095328 [CSS] add 'indefinite' as a value for duration type
JDK-8095324 [Printing] Cups - incorrect paper size
JDK-8095307 fx:jar produces corrupted manifest if named or unnamed param length exceeds 56 characters
JDK-8095298 [Accessibility, Traversal, ChoiceBox] ChoiceBox without default selection can't be expanded using common methods
JDK-8095288 [Accessibility, Windows7] Combobox list items are counted incorrectly
JDK-8095280 Thread classloader gets lost through the JFX launch process
JDK-8095277 GTK: FileChooser w/ExtensionFilter's localized caption crashes JVM on Ubuntu
JDK-8095264 The plist of 2.0 GA is not fully correct
JDK-8095263 Missing @since tags in SpinnerValueFactory
JDK-8095258 [Linux, Mac] Prism build script unnecessary mixing of 2 different compilers
JDK-8095255 [Unit Tests] RotateTest and ScrollThresholdTest failed on Mac and Windows
JDK-8095252 "prefViewportHeight" property is in the wrong position
JDK-8095242 FilteredList: null predicate should be allowed and indicate no filtering
JDK-8095233 [Image] Deadlock intializing ByteBgra and ByteBgraPre from multiple threads
JDK-8095225 [Region] After RT-38297, rectangular Region borders are drawn incorrectly
JDK-8095221 The Windows launcher generated by the packager fails to load msvcr100.dll on 32-bit OS
JDK-8095210 [Javadoc] ScheduledService example uses non-existent constructor with Duration argument
JDK-8095208 All Defaults and Overrides are saved to JVM User Args file
JDK-8095206 Auto-suggest menus are showing focus when they do not have it
JDK-8095192 [Mac, Retina] Image loading for @2x images may try to append @2x suffix to wrong part of URL
JDK-8095188 Service docs should indicate that a running Task does not prevent it from being GCed
JDK-8095161 [PieChart, RTL] PieChart labels and label lines don't align the data.
JDK-8095157 effect clipping not working on retina Macbook Pros
JDK-8095154 javafx.animation.Animation#impl_finished swallows exceptions
JDK-8095152 [Dialogs] HelloDialogs toy throws NPE with custom graphic
JDK-8095143 cache property should be enabled when cacheHint property is set
JDK-8095142 [Monocle] x86egl build fails with warnings
JDK-8095134 [ToggleGroup] RadioButton (and ToggleButton) is not selected by pressing space bar
JDK-8095127 run-subset.sh still won't run 3 last tests
JDK-8095110 [Dialogs] Develop proper CSS styling for dialogs for Modena and Caspian stylesheets
JDK-8095102 [Accessibility, Mac] VoiceOver reads items incorrectly when ListView scrolled.
JDK-8095099 [CSS] Serious rendering artifacts running Ensemble8
JDK-8095093 NPE when using X or Y rotationAxis
JDK-8095091 KIT : InspectorPanelController.setExpandedSection() breaks and raises an NPE
JDK-8095062 [CSS] StyleablePropertyFactoryTest: reintroduce test for StyleableProperty
JDK-8095044 [media] Mac native platform code doesn't compile with parfait compilers
JDK-8095036 [Mavericks, Yosemite] Showing a stage on a retina screen is sometimes scaled twice
JDK-8095031 [Combobox, Touch] HelloSanity: cannot scroll long combobox popup with touch, something gets selected before scroll is performed
JDK-8095025 TabPane->menu button->items.textProperty not updated on change
JDK-8095009 [packager] Packaging with a JRE as installed fails codesign on OSX 10.9.5 or 10.10
JDK-8095002 [TableView] Focused row changes incorrectly
JDK-8094994 [Accessibility, Windows] Implement text traversal actions
JDK-8094979 Use computed sizes menu item should be enabled when a TableColumn / TreeTableColumn is selected
JDK-8094961 [TreeView] TreeView scrolls when selected in SceneBuilder (regression)
JDK-8094952 packager - throw verification error for per-user services/daemons
JDK-8094943 Shader compile failure with PickTest3D on i.MX6
JDK-8094936 [JFXPanel, Mac] popups + -Djavafx.embed.singleThread=true causes deadlock
JDK-8094934 Typo error in JavaFX 8 CSS reference guide
JDK-8094932 [LineChart] Javafx 8 Line Chart does not plot data in order
JDK-8094925 [Service,WebView] Security exception in Service.cancel and URLLoaderThreadFactory when running sandboxed applet
JDK-8094923 [CSS] Using setUserAgentStylesheet() with @import syntax issue
JDK-8094907 cell factory defined in FXML leads to ClassNotFoundException
JDK-8094887 [TextFieldTableCell] (and others) to cancel or commit edit on focus lost causes new cell to be edited
JDK-8094872 Issue with 16 bit color
JDK-8094866 Media produces extraneous debugging when running Ensemble8
JDK-8094860 [MAC] SegFault when calling the launcher generated by the packager
JDK-8094839 [Accessibility, JAWS] Enhanced text support for JAWS
JDK-8094823 [toys] HelloComboBox has controls that run off the right edge of the window
JDK-8094811 Scene and scenegraph leak when the Stage is closed
JDK-8094799 ListPropertyBase: doesn't notify changeListener in bidi-binding
JDK-8094796 [Dialogs] Import samples into rt/toys
JDK-8094786 javapackager throws NPE for invalid value for "-srcdir" argument
JDK-8094755 Missing import clause when adding custom component
JDK-8094742 Spinner CSS and minor Modena tweaks needed
JDK-8094739 [SWT, Swing] DnD cannot be done with image data type
JDK-8094719 [Quantum] Deadlock in PresentingPainter, UploadingPainter if resource factory is null
JDK-8094717 [Monocle] Show absolute axis bounds in GetEvent
JDK-8094712 [CSS] HelloSanity does not get the right CSS file when run from an IDE
JDK-8094689 Unit test failure in Snapshot1Test after fix for RT-17716
JDK-8094671 Scene Builder crashes when using custom control
JDK-8094652 Gtk: Need unit test for RT-37974
JDK-8094640 alt key should put focus onto first menubar menu
JDK-8094633 [Linux] JavaFX Media does not run on Ubuntu 14.04
JDK-8094625 Glass/GTK should support removing Window.MINIMIZABLE, Window.MAXIMIZABLE
JDK-8094623 [PACKAGER] launcher is not able to start SceneBuilder, at least on Mac
JDK-8094622 Launcher produced by packager of 8u20 requires msvcp100.dll
JDK-8094620 Creating a ContextMenu on the JavaFX-Launcher thread causes an IllegalStateException
JDK-8094613 [CSS] Arrows from simple ListSpinner 3rd-party control are not visible
JDK-8094602 [TreeItem] Incompatible API change to TreeItem$TreeModificationEvent constructor
JDK-8094594 [Charts, Axis] TickMark's textVisible property is ignored
JDK-8094585 User property not rendered on Content after an FX Theme is set then unset
JDK-8094582 CSS Panel: property values font size is smaller than SB 2.0
JDK-8094564 [HelloTextArea, Ubuntu] Window comes up razor thin instead of a "nice size"
JDK-8094559 Unwrap command should be available for BorderPane and TabPane
JDK-8094553 [Packager] __pthread_tpp_change_priority error
JDK-8094549 [SW] Software pipeline renders transparent gradients slightly darker than normal
JDK-8094533 Javapackager not calling post-image script on MacOSX for PKG
JDK-8094516 @font-face not working
JDK-8094514 [Packager] User friendly API doesn't alter JVM options
JDK-8094512 [Mac] Unit test failures in test_rt_39559_useKeyboard_selectAll tests
JDK-8094507 Japanese translations for javapackager/javafxpackager man pages for 8u40
JDK-8094505 Document mac.CFBundleVersion bundler argument
JDK-8094496 Menu accelerator does not work if menu item has been added dynamically
JDK-8094495 [toys] HelloRadioButton and HelloToggleButton contain misquote
JDK-8094493 Need a more accurate center of pixel sampling for supporting 1 sample per pixel rendering
JDK-8094484 Auto Suggest Popup has changed appearance
JDK-8094473 [ListView] Wrong change events fire in ListView
JDK-8094467 [CSS] Absolute URL in stylesheet does not work
JDK-8094460 [CSS] ComboBox size issue with custom CSS
JDK-8094457 [SwingNode, DND] : drag-and-drop does not work
JDK-8094456 TreeTableView doesn't maintain position properly when cells count changes
JDK-8094450 Update nroff to integrate changes made in 8u40
JDK-8094445 [MacOS] Undo/redo stack is broken when using keyboard
JDK-8094439 NPE on node delete
JDK-8094437 JavaFX exe installer fails on Windows 8.1
JDK-8094434 [Dialog] Using ButtonBar.BUTTON_ORDER_NONE leads to IllegalStateException
JDK-8094431 [TreeTableView] items are misaligned after being grouped, but only when using CONSTRAINED_RESIZE_POLICY
JDK-8094430 Wrap In commands may not keep children order
JDK-8094425 Content panel may break when root is a custom component
JDK-8094422 Bindings class spits out a lot of unneeded log messages
JDK-8094421 Set up RE build environment for SB 2.0.1 EA promoted builds
JDK-8094420 Insert -> Menu not enabled while it should
JDK-8094413 [Logger] JavaFX apps fail to start if jfr.jar is removed from JRE
JDK-8094412 [Monocle] Mouse input in VirtualBox not recognized
JDK-8094408 [CSS] Parser doesn't handle {1,4} except for -fx-padding
JDK-8094402 Content panel sometimes ignores drag gesture on Mac
JDK-8094400 Dashed border computation incorrect
JDK-8094399 [Canvas] Several tests get IllegalStateException: Operation requires resource lock
JDK-8094397 Update the JDK build number to 8-b132 in build.properties
JDK-8094383 [Accessibility] add an 'accessibility on' API
JDK-8094362 [Dialogs, t13y] "Hide Details" translation has ellipsis ("...") for some locales
JDK-8094359 Setting a property from the inspector may have no effect on content
JDK-8094355 Unit tests for SwingFXUtils.fromFXImage
JDK-8094352 [Dialogs] HelloAlert ESC closes the dialog but the close button does not
JDK-8094340 [Dialogs] Dialog opens on the wrong screen (monitor) if main stage is moved in multi monitor setups
JDK-8094335 RTL orientation, ComboBox popup is not aligned with the ComboBox.
JDK-8094333 [TextArea] Text scrolled and initial position of scrollbar moved from top (8u20) to bottom (8u40)
JDK-8094331 [Bundlers] file associations are not working in OEL
JDK-8094327 Gtk: dead keys don't work on European keyboard layouts
JDK-8094323 [TableView] TableView selection problem with SHIFT
JDK-8094313 Overlapping 3D transformed 2D shapes have dirty edges in Scene with depth buffer
JDK-8094311 Update javapackager/javafxpackager man pages for 8u40
JDK-8094310 File chooser does not use the current fxml directory as initial directory (regression)
JDK-8094307 Selecting an Effect in the EffectsPicker dismisses the popup
JDK-8094300 [packager] Working directory for Mac OS bundles is always home directory, not app directory
JDK-8094298 KeyCombination matching is broken (at least on Linux)
JDK-8094296 [Accessibility] Node properties for role and roleDescription inconsistently named
JDK-8094294 [CSS, Tooltip] styleable parent is null when tooltip is manually shown
JDK-8094274 [Media] Use of QuickTime prevents Mac AppStore Submission
JDK-8094267 [Accessibility] HelloTreeView hangs on Windows 7 when running Narrator
JDK-8094266 [ComboBox] Popup not updated when items are added
JDK-8094257 Android: Some preview images in Ensemble8 are not displayed
JDK-8094250 A typo in ViewPainter.getPixelScaleFactor
JDK-8094248 [Swing, Mac, JFXPanel] Context menu with setOnContextMenuRequested doesn't work properly in Swing embedded JavaFX
JDK-8094247 FX needs to install additional finish listener to prevent FX shutdown
JDK-8094243 [Dialog] Graphic is not cleared from Dialog when property 'graphic' is set to null
JDK-8094239 [EnsembleApp] Add dialogs sample to Ensemble
JDK-8094214 Missing libraries and poor performance on armv7hf target compared to armv6hf target
JDK-8094207 Javapackager Windows installers should write to local-user registry keys by default
JDK-8094194 [Mac, Retina] SubScene contents are blurry
JDK-8094181 [SWT, Windows] NPE on Scene$ClickCounter when maximize the window by double click title bar.
JDK-8094179 [Tab] Regression caused by bad hashCode in Tab class
JDK-8094166 [Dialogs] Expandable content dialogs do not display properly when expanded
JDK-8094159 Multi-line comments in build scripts need curly braces
JDK-8094115 [a11y] Intermittent NPE running HelloSanity or SceneBuilder with Narrator
JDK-8094112 [TreeItem|TreeCell]Graphics of TreeItem sometimes becomes invisible after collapsing any node
JDK-8094108 [Accessibility] HelloPagination gets RuntimeException: Accessbility requested for node not on a scene
JDK-8094083 [TEST ONLY] Intermittent failure in StylesheetTest.testRT_31316_with_complex_scenegraph
JDK-8094078 ProgressIndicator/ProgressBar continue to animate when removed or made invisible
JDK-8094044 [TableView] selectedItem and selectedIndex inconsistent
JDK-8094030 [Packager] Preferences "/" is changed to "\"
JDK-8094019 RTL orientation, submenu overlaps its parent menu.
JDK-8094015 InvocationTargetException in graphics:test
JDK-8094011 [Bundlers] default classpath recognition stopped working in Linux
JDK-8094008 Missing @since tags for some 8u40 API
JDK-8094003 [Charts] StackedBarChart rendered incorrectly
JDK-8094002 api doc of Task.call incomplete
JDK-8093991 CSS Analyzer: 'Reveal in Inspector' does not work
JDK-8093967 [packager] Wix 3.9 not autodetected in MSI bundler
JDK-8093960 [JFXPanel] MacOS X issue with Clipboard between Swing and JavaFX
JDK-8093957 When I use 'Arial' or 'Hiragino Sans GB' font in a TextArea, the arrow 'Down' is not working well
JDK-8093954 [packager] Allow for easier configuration of CFBundleVersion for Mac/Mac App Store
JDK-8093951 [Packager] NPE when FA_ICON is used for MSI bundler via Java API
JDK-8093937 Sizing fonts with CSS em can result in wrong size font being displayed
JDK-8093919 [Memory leak] MenuBar MenuBarSkin
JDK-8093900 [Bundlers] rpm packages fails to run after install
JDK-8093895 Javadoc should not suggest calling dialog.showAndWait().get() without checking isPresent()
JDK-8093892 TabPane does not update the tab name correctly
JDK-8093878 [packager] Default argument lambdas should be well behaved
JDK-8093868 Scene Builder dmg icon is now the SB icon (Mac)
JDK-8093859 [WebView] URLLoader throws an exception on 401 HTTP error with no body
JDK-8093857 Content Panel and Preview Window fail to visualise CSS edits from Style Sheet attached using Preview > Scene Style Sheets > Add a Style Sheet...
JDK-8093856 Some controls can only be created on the FX application thread
JDK-8093849 Disable building WebKit on linux-armv6 platforms
JDK-8093842 [Dialog] Dialog does show application icon in title bar
JDK-8093813 Platform.isSupported(MEDIA|WEB) passes when it should not on embedded
JDK-8093802 TreeTableViewMouseInputTest test_rt30394 unit test is not stable
JDK-8093796 [TreeTableView] Wrong javadocs for TreeTableViewSelectionModel (copy / paste)
JDK-8093787 Unwrap command should remove static properties from the children
JDK-8093773 [macosx] Media crashes when changing EQ band center frequency
JDK-8093771 [Accessibility] Put a11y code back
JDK-8093770 Unit tests hang when running web test
JDK-8093768 Embedded - enable freetype/pango path by default
JDK-8093766 JavaFX Packager's launcher only works with JDK not JRE
JDK-8093750 Mac: Application processes termination prematurely when a nested event loop is running
JDK-8093746 Windows: Compiler error reported when using parfait (clang++)
JDK-8093745 [ScrollPane] Connecting a ScrollPane to a scenegraph reset hvalue / vvalue (cont'd)
JDK-8093732 Cannot start Modena application
JDK-8093726 Potential NPE if es2 pipeline initialization fails
JDK-8093721 RTL orientation, ChoiceBox popup is not aligned with the ChoiceBox.
JDK-8093693 fxpackager test failure in sandbox
JDK-8093669 NPE on evaluate expression
JDK-8093666 [TableView] TableView vertical mouse wheel scrolling does not go to the bottom (screen at a time or fast wheel setting)
JDK-8093664 FilteredList reports a size of zero until a Predicate is supplied.
JDK-8093660 [packager] Respect command line arguments in self contained applications
JDK-8093648 [Printing, Mac] Printing hangs if printing more than specified number of pages
JDK-8093647 [SceneBuilder,MenuBar] NullPointerException in Cascading menu when running SceneBuilder
JDK-8093643 [Bundlers] automatically fetched application name misses Unicode symbols
JDK-8093637 AssertionError when adding custom component
JDK-8093635 [JFXPanel] WebView in Applet leads to NullPointerException in setCursor
JDK-8093622 href value for jfx:javafx-runtime in JNLP is obsolete
JDK-8093619 [Dialog] No API for adding custom dialog validation and preventing dialog from being closed
JDK-8093613 [Accessibility, HelloMenuButton] Left Arrow Key will not open Menu Button with Left Arrow Icon available
JDK-8093604 LinearGradient with too many stops can cause failure later during Scene background fill
JDK-8093599 [Packager] userJvmOptions are not propagated using CLI bundler
JDK-8093584 Listener on selected items list within MultipleSelectionModel (TreeView) reports not existing state
JDK-8093576 [CSS] SubScene.setUserAgentStylesheet() not resilient to stress
JDK-8093574 [CSS] DatePicker and ProgressIndicator drawn with non-transparent background
JDK-8093566 [3D] Shapes can be very blurry in 3D rotations if not started in the 2D plane
JDK-8093565 Scrollpane does not scroll
JDK-8093561 Undo stack not synched when using Undo/Redo keyboard shortcuts
JDK-8093559 [DialogPane] NPE on setExpanded if there's nothing to expand
JDK-8093550 -fx-spacing used wrong in .menubar in modena.css
JDK-8093537 [FXML] "Introduction to FXML" contains false code example
JDK-8093532 [CSS] lexer should not consume @font-face and @import as one token
JDK-8093434 NPE when chaining Lighting effect with other effects
JDK-8093429 NPE in VirtualFlow
JDK-8093329 Create a unit test for RT-36241
JDK-8093320 [TableView] Multi-Select TableView: Bound list on selected items is not in sync
JDK-8093310 Ensemble8 - correct @conditionalFeatures tags
JDK-8093300 [SpltPane] Cannot set divider position in multiple splitpanes at once under certain conditions
JDK-8093292 [Monocle] GetEvent shows events as integer values instead of constant names
JDK-8093283 Some styling rules are not applied when Hierarchy panel is used outside of SceneBuilderApp
JDK-8093277 [Javadoc] scene AA, depth buffer / test should say that they are for 3D
JDK-8093268 [Monocle/Embedded] exception when using virtual keyboard
JDK-8093250 [Bundlers] passing JVM options is broken
JDK-8093248 run-subset.sh won't run the HelloFXCanvas demo
JDK-8093236 GStreamer fails to build on Debian Jessie
JDK-8093232 Exception when choosing to view sample data in CSS Picking Mode
JDK-8093217 [Glass, Mac] While a stage is in fullscreen mode you cannot open another stage on top of the fullscreen stage
JDK-8093208 SplitPane example in docs refers to getChildren() whereas the method is getItems()
JDK-8093190 Rendering is disturbed by mouseover or focus move checkbox and radio of WebView
JDK-8093183 [StackedAreaChart]: StackedAreaChart y-axis should be always a ValueAxis
JDK-8093159 CustomMenuItem setHideOnClick(false) not working with newest java version
JDK-8093153 [Monocle] Cannot read events on 64-bit systems
JDK-8093147 [Quantum] Control ActionEvent is fired on Stage closing and the App hangs if modal window is then shown
JDK-8093146 [LineChart] Calling setAutoRanging on LineChart with false and then true doesn't work
JDK-8093134 CategoryAxis.tickLabelRotation doesn't work properly with autoRanging
JDK-8093133 [Dialog] DialogPane's expandable content does not grow and shrink vertically
JDK-8093129 NullPointerException in ContextMenuContent.disposeContextMenu
JDK-8093119 [StackedAreaChart] Display problem with StackedAreaChart when the axis is not displayed
JDK-8093113 [Accessibility] Implement scrolling
JDK-8093110 Unknown error 0x80DE0001 when trying to drag TreeView node
JDK-8093107 A node remains invisible if clip has been set while it was not visible
JDK-8093106 [Bundlers] content type is not set for Windows when specifying file associations
JDK-8093104 'Wrap in' and 'Unwrap' commands should be available for TextFlow
JDK-8093103 [Axis] Y-Axis can not handle big values
JDK-8093091 [SplitPane] Pixels cut off when GridPane inside SplitPane
JDK-8093088 Blend Effect Clipping and/or Truncating when attached to Polygons
JDK-8093082 restore Monocle GetEvent as a stand alone diagnostic
JDK-8093081 [Linux, Font] "AR PL UMing" fonts can't be rendered when font size is 11 - 16.
JDK-8093079 Suggested Style Class Menu not alphabetically ordered
JDK-8093037 TableView: incorrect update of focusedCell on navigating with ctrl-up/down
JDK-8093019 [Accessibility] Application crash / relaunch on exit on Windows 7 when using Narrator
JDK-8093015 A ListView control's items do not refresh when placed inside a SubScene node.
JDK-8093011 [Dialogs] Write unit tests
JDK-8093006 [Animation] Transitions with short durations can result in NaN output which can confuse applications.
JDK-8092996 [Dialogs] Externalise default graphic file references
JDK-8092992 Assertion error when adding ButtonTypes to a DialogPane
JDK-8092987 OpenJFX build should fail fast if jfxrt.jar is in the JDK used to build
JDK-8092977 Mac: FileChooser.show() crashes in NSSavePanel when running in sandboxed environment
JDK-8092965 MenuBar in SubScene does not work
JDK-8092964 Fix SingleTouchTest: touch count check
JDK-8092952 [ListView] Shift + Up/Down arrow keys don't work well after Ctrl+A
JDK-8092949 [Dialogs] HelloDialogs Exception dialog jumps uncontrollably when resized from corners or top or bottom
JDK-8092939 [Dialog] Font size of DialogPane content is too big
JDK-8092937 [javadoc] Bad HTML in JavaBeanProperty and ReadOnlyJavaBeanProperty classes
JDK-8092928 [Charts,CSS] Memory leak in PieChart
JDK-8092921 DebugNative fxpackager Windows build produces macro redefinition warnings
JDK-8092908 GridPane: Wrap in... issue
JDK-8092896 "gradle -PCONF=DebugNative" doesn't produce debugging symbols for packager
JDK-8092872 [Accessibility API] add alternate text property.
JDK-8092862 [Accessibility, HelloPopupMenu] Opening Popup Menu submenu with Space Bar does not select first entry in list, can cause NPE
JDK-8092852 [Mac] AVFoundation player never sends FINISHED state at end of stream
JDK-8092850 Exception and failure when trying to use Wrap In command on tab graphic
JDK-8092840 [ScrollPane] minViewport{Height,Width} are taking effect only after changing prefViewport{Height,Width}
JDK-8092832 Text Fill of Label change color the "#" hexadecimal color interpreted as event build method ...
JDK-8092821 [TableView] TableView et al: support update for items that are equal
JDK-8092812 [HTMLEditor] need focused states when a child really has focus
JDK-8092811 [Windows] fxpackager tests fail with VS2013
JDK-8092809 CSS Analyzer: css properties values are overriden by the children
JDK-8092803 Date/time converters use unwanted format patterns
JDK-8092799 Arrange commands used with multi-selection have degraded since 1.1
JDK-8092798 Add launcher tests for ContextClassLoader
JDK-8092793 [Menu] When setting custom font size, the sub menu doesn't adjoin its parent menu
JDK-8092775 [Accessibility] Handle TITLE consistently for Labeled
JDK-8092764 Document that Modena uses a non-transparent background by default
JDK-8092761 Issue with file names with underscore (_)
JDK-8092758 Document the image file formats supported by javafx.scene.image.Image
JDK-8092754 [Dialogs] ChoiceDialog default constructor throws NullPointerException
JDK-8092753 KIT : LibraryPanelController.setDisplayMode() breaks and raises an NPE
JDK-8092747 [ComboBox] Popup does not respond to visibleRowCountProperty after it was shown for the first time
JDK-8092745 [Monocle] Scroll with the wheel test failed
JDK-8092736 [packager] some cleanup for native code in launcher
JDK-8092713 [Dialogs] TextInput and Choice dialogs should compare result against ButtonData, not ButtonType
JDK-8092712 Exceptions in sandboxed app when dragging text within WebView
JDK-8092711 [TOY] hello.HelloDialogs throwing null pointer exceptions
JDK-8092710 Cannot select root node at opening time from the Hierarchy
JDK-8092699 Preloader does not show when packaged as .exe. However when the Application Jar is run with java -jar it shows up.
JDK-8092696 [MAC] With Java 8 U40 b08 the product doesn't start up
JDK-8092682 Need to re-evaluate the BND constants set in the Pisces rasterizer for non AA shapes
JDK-8092669 DoubleProperty.doubleProperty() Javadoc needs small fix
JDK-8092660 [Animation] Combinations of transitions don't work as expected (circle should fade in)
JDK-8092657 ImageStorageTest fails in NetBeans
JDK-8092656 [Canvas] NPE or crash in SWGraphics.fillRect running Canvas demos on SW pipe
JDK-8092654 [ButtonBar] IllegalStateException when dynamically changing buttons
JDK-8092648 [TabPane] Tabs can be incorrectly made invisible when rearranged
JDK-8092643 unmodifiableObservableMap.entrySet() provides entries in wrong order
JDK-8092620 NLS: javafx8u40 translation message drop 10 integration
JDK-8092600 [Chart] Infinite loop after resizing a chart
JDK-8092583 [ColorPicker,Traversal] "Custom Color.." hyperlink can only be reached via keyboard when there is a user defined color.
JDK-8092580 impl_* methods should not be displayed in documentation
JDK-8092547 [CSS] SceneBuilder logs WARNING: Could not resolve '-sb-base-dark' when loading fxml file
JDK-8092532 NPE in AutoSuggestEditor.initialize() when running in sample Eclipse plugin
JDK-8092530 Behavior and access of Control#getUserAgentStylesheet method changed in 8u40
JDK-8092523 Clicking a stop in ColorPicker dismisses the popup.
JDK-8092516 [SWT] FXCanvas doesn't deliver drag exited events after successful drop
JDK-8092515 [Linux] JavaFX media tests crash with 8u40
JDK-8092500 [packager] Packaged app fails when presented with a standalone JRE
JDK-8092494 [TableView] LastLine is not fully visible when scrolling.
JDK-8090307 [Monocle] Implement native cursor for odroid
JDK-8088409 Reduce memory footprint of WCImageDecoderImpl
JDK-8075029 [macosx] Mac 10.10: Application run with splash screen has focus issues
JDK-8074983 JRE 8U25 and 8u31 b32 cannot launch Java Web Start with proxy pac but works fine for 7u67
JDK-8074658 Replace missing APIs from 8u40
JDK-8074169 Mac OS Incompatibility between JDK 6 and 8 regarding input method handling
JDK-8074163 JavaWS fails with proxy autoconfig due to missing "dnsResolve"
JDK-8073648 jjs (the Nashorn JavaScript tool) prints erroneous line "null"
JDK-8073245 Known Issue: Performance degradation on G1 on Solaris when large pages are requested
JDK-8073137 [doc] Release note the mJRE removal in previous releases
JDK-8069451 Roaming user profiles by USER_JPI_PROFILE env variables doesn't work anymore
JDK-8069183 Reliable, reproducable SIGSEGV
JDK-8068993 "Installing With a Configuration File" of JavaSE Installation Guide has errors
JDK-8068969 Add missing information to AppModel
JDK-8067251 RegisterDeploy ping not working correctly
JDK-8067236 DRS with non-force version run rule can block when it should not.
JDK-8067111 Exception in compiler: java.lang.AssertionError: isSubClass E
JDK-8066541 An unknown compilation problem occurred
JDK-8066447 8u40: URL.openConnection fails with exception if "use browser settings" is set and browser itself uses system settings
JDK-8066446 not compressing the non-english msi's will speed up the build
JDK-8066077 java.util.MissingResourceException
JDK-8065974 VM hangs because threads fail to synchronize at safepoint
JDK-8065921 Resource Management tests should be updated with @requires tag
JDK-8065675 Deprecate the Endorsed-Standards Override Mechanism
JDK-8065598 jdeps incorrectly reports javax.jnlp as JDK internal APIs
JDK-8065241 invokevirtual: selection errors should apply to Step 1 as well as Step 2
JDK-8065228 HeapMetricTest stability fixes
JDK-8065069 jdk8u40 l10n resource file translation update 2
JDK-8064823 PIT : compiler/6329104/Test6329104.sh fails due to execution time variation
JDK-8064742 TOI: JEP 156: G1 GC: Reduce need for full GCs
JDK-8064459 Tomcat Server Crashing Due to JVM crash
JDK-8064456 Change the order of linux proxy detection
JDK-8064358 JnlpxArgs NullPointerException
JDK-8064280 Jnlp fails to load with CouldNotLoadArgumentException
JDK-8062867 jfx:javafx-runtime element no longer used
JDK-8062634 TOI: JEP C110: React to Memory Pressure
JDK-8062633 Complete all required TOI for 8u40 release
JDK-8062502 Make the MacJREInstallerTests scheme shared across project
JDK-8062407 jucheck incorrectly uses cached iftw-au.exe if already present in %TEMP%
JDK-8061860 EP-JDK-8044192: SQE Test Plan for Scalable Native Memory Tracking
JDK-8061643 JavaWS fails with proxy autoconfig due to missing "resolve" permission
JDK-8061621 *** java.lang.instrument ASSERTION FAILED ***: "!errorOutstanding" with message transform method call failed at JPLISAgent.c line: 844
JDK-8061598 Missing release note: Interfaces need to be present when compiling against their implementations
JDK-8061435 too much delay between welcome and progress dialog
JDK-8061342 javaws help message in Japanese is corrupted
JDK-8060719 TrustDecider.checkMainJarManifest will fail for fx app with embedded certificate.
JDK-8060669 Webstart cache path error for Java >= 7u65
JDK-8060667 SWT cannot load native look&feel
JDK-8060665 Step 6:There are java.io.FileNotFoundException and ava.lang.ClassNotFoundException thrown in java console after clicking "Continue" Button,and there is no security dialog with "Run" Button .
JDK-8060647 Oracle Linux 5.x: Expired JRE disabled in the browser automatically and no native dialog prompting for the JRE update
JDK-8060644 Unit Test Failures due to RDF and other 8u5 changes.
JDK-8060188 Integrate new version of Java VisualVM based on VisualVM 1.3.8 into JDK
JDK-8060185 Update GC tuning guide with new default values for G1HeapWastePercent and G1MixedGCLiveThresholdPercent
JDK-8060180 jmc man page has incorrect options
JDK-8060057 No checkbox "Enable JAB" after installation of public JRE 8 (only x86 JRE)
JDK-8060023 Startup performance regressions after JDK-8038423
JDK-8060002 Change link to Java SE Advanced and Java SE Suite on docs landing pages
JDK-8059808 Debug trace controlled by SystemUtil flag not enabled when JPI_PLUGIN2_DEBUG is set
JDK-8059458 JRE 8u20 fails to install on Windows Server 2012 with encrypted (BitLocker) system drive.
JDK-8059387 Unexpected SSV warning appears on Linux for FX applet requesting JRE 1.7+
JDK-8059148 Resourced or Red
JDK-8059134 Update copyright year to 2015 in tutorials
JDK-8059133 Update copyright year to 2015 in guides build
JDK-8059089 Typo in Installer Removal Tool UE, "hightly"
JDK-8059076 Spacing bug in policytool.html
JDK-8058884 Reconcile deoptimizing recompilation with code splitting
JDK-8058782 Deployment Rule Set run Application without signing
JDK-8058731 need to document known issues with Third party's JCE providers
JDK-8058688 RSA links broken in the Java Cryptography Architecture Standard Algorithm Name Documentation
JDK-8058670 Broken links in Coding Tips
JDK-8058668 Broken links in 12 Preloaders for JavaFX Applications
JDK-8058340 Solaris 8u40 (8u ds-dev) builds fail
JDK-8058306 Java Web Start raises "Unable to create a shortcut for " dialog
JDK-8058149 Broken link in Applets and Java Web Start Applications
JDK-8057991 Java Access Bridge, regression, NPE, occurs randomly
JDK-8057924 Sort includes and verify copyright for new files
JDK-8057865 Broken link in 16 JRE Installation for Microsoft Windows
JDK-8057716 Putback if 8055179 missed TrustDeciderDialogTest
JDK-8057713 Destroy resource context and clean out allocation context
JDK-8057633 NIO and NIO.2 Examples contain duplicated lines of code
JDK-8057621 jmc man page needs new link to javacomponents
JDK-8057166 Make sure that --optimistic-types=[true|false] is documented for 8u40
JDK-8057085 64bit offline isn't compressed
JDK-8057013 UserAccessorProperty caching prevents HotSpot from profiling MethodHandles, sinking box2d performance through lack of inlining
JDK-8055905 Remove unsused method CollectedHeap::unsafe_max_alloc()
JDK-8055841 Unable to install online 8u20 bundle if 8u25 existed on the system
JDK-8055785 Modifications of I/O methods for instrumentation purposes
JDK-8055707 Clarify that an IPV4 stack is required for IPV6 to work
JDK-8055701 Incomplete letters displayed in Java update Welcome dialog
JDK-8055660 Broken link for Signed JNLP files on deploy tutorial page
JDK-8055350 Do not need to remove colons from the hash value for a DRS rule
JDK-8055297 Allow compiler to throw JS errors
JDK-8055179 Security Dialog for unsigned jnlp still different in jnlp Application case.
JDK-8055175 [de] Truncation issue in EULA dialog.
JDK-8055067 Incorrect CertPathParameters declaration in JSSE Reference Guide sample code
JDK-8054971 Applet is blocked when requesting sandbox permission and loading loose resource
JDK-8054966 Bad link in Javadoc guide
JDK-8054852 Broken link in Extension Mechanism Architecture page
JDK-8054851 Broken links in Documentation Contents of index.html
JDK-8054663 netbeans project for all releases is titled jdk9
JDK-8054633 [since-tag]: javadoc for corba classes has invalid @since tag
JDK-8054561 require patching and bsdiff for all install builds
JDK-8054382 Update RTM documentation
JDK-8054200 Access Bridge; add definitions for bits 8 and 9 for for new accelerator support
JDK-8054190 15.13: Clarify how enclosing instance for inner class constructor ref is identified
JDK-8054182 15.12.2.6: Clarify the return type of 'getClass'
JDK-8054168 FX application fails to get loaded after accept authentication dialog
JDK-8053884 Existing Java method cannot be called from JavaScript in IE
JDK-8052106 [jcck] extra mnemonics in security dialog.
JDK-8051950 Create separate media platform that uses AV Foundation for Mac OS X 10.8 or later
JDK-8051901 Implement checks for global let statements
JDK-8051900 Implement scoping of let in for-let loops
JDK-8051888 Add support for 'let' and 'const' to parser and AST
JDK-8051701 [de] Minor truncation in Uninstall out-of-date versions dialog
JDK-8051688 Complete development work for Accessibility
JDK-8051686 Complete development work for new Alert Dialog
JDK-8051685 Complete development work for new Formatted TextField control
JDK-8051684 Complete development work for new Spinner control
JDK-8051635 closed/compiler/6507107/HeapwalkingTest.java sometimes works too long
JDK-8051598 regression - java_arguments not accepted after Update to 7u65
JDK-8051494 One More File for JavaFX client authentication dialog is not a JavaFX-based dialog
JDK-8051387 Replace references to Rhino with references to Nashorn
JDK-8051292 Fix typos and errors in "Java Networking and Proxies" document
JDK-8051282 [TEST_BUG] java/awt/image/JPEGInputStreamTest.java fails
JDK-8051198 The fix for https://bugs.openjdk.java.net/browse/JDK-8037883 is still not good enough - unit test failure on linux-i586: com.sun.javaws.PreloaderTest.testProgressInOfflineMode
JDK-8051196 Disable CacheUtilTest.testNoCodebase on Linux
JDK-8051195 new unit test failure on linux-amd64: com.sun.javaws.PreloaderTest.testProgressInOfflineMode
JDK-8051194 Fix server issue in some tests and WebServer
JDK-8051193 DeployCacheHandlerTest NPE due to server resourse cleanup
JDK-8051192 jdk9-client build failure caused by a jar not found
JDK-8051191 BaseDirTest.testUserDir Failure on linux
JDK-8051189 Exclude some tests that failed or causes error on Linux
JDK-8051188 Fix Deployment Unit Test Timeout on Hudson
JDK-8051187 FileNotFoundException when SetupHelper.blackListJarFile
JDK-8051186 Make the starting web server port in sun.tests.helpers.WebServer configurable via an environment variable
JDK-8051185 hudson junit test JNLPSignedResourcesHelperTest.java failures observed on mac but not windows
JDK-8051184 Improve com/sun/deploy/security/RootCertStore.java so that it warns about missing system certificates file
JDK-8051183 Typo in the fix for 8033492
JDK-8051182 Deploy unit test to 100% pass rate
JDK-8051181 Provide a way to override the default junit timeout of 10 minutes when running the deployment test suite
JDK-8051180 Disable crashing deploy unit tests
JDK-8051179 sun.plugin2.applet.FXAppletSecurityManagerTest: Error and Failure
JDK-8051178 com.sun.javaws.security.JNLPSignedResourcesHelperTest: crash
JDK-8051177 sun.plugin2.applet.AWTAppletLifecycleTest.testAppletHasParentBeforeInit test failure
JDK-8051176 sun.plugin2.applet.Applet2DownloadTest : Caused an ERROR
JDK-8051175 Both testCheckConnectWithContext and testCheckConnect started failing after recent sync from the sandbox
JDK-8051174 sun.plugin2.applet.SerialAppletTest.testInitNormalSerialApplet: Caused an ERROR
JDK-8051173 com.sun.jnlp.JNLPPreverifyClassLoaderTest.testInternalGzip: JNLPPreverifyClassLoader.initialize: FAILED
JDK-8051172 sun.plugin2.applet.JNLPAppletPreloaderTest: 5 errors
JDK-8051171 com.sun.deploy.registration.RegisterDeployTest failed
JDK-8051170 com.sun.deploy.cache.CacheEntryTest.testReadSigningData failed
JDK-8051169 sun.plugin2.applet.SignedAsBLOBJarTest: 5 similar errors due to ExitException
JDK-8051168 sun.plugin2.applet.JNLP2ClassLoaderTest: 11 errors
JDK-8051167 sun.plugin2.applet.Applet2ClassLoaderTest -- Your security settings have blocked an untrusted application from running
JDK-8051166 sun.plugin2.main.server.JVMManagerTest Failed
JDK-8051165 sun.plugin2.message.LaunchJVMAppletMessageTest failed
JDK-8051164 com.sun.javaws.LaunchDownloadHttpsTest failed
JDK-8051163 Both testcases testLoadClassFromLazyBlackListJar and testLoadClassFromLazyBlackListJar_NoCache caused an error
JDK-8051162 sun.plugin2.applet.SignedCachedJarTest failed
JDK-8051161 com.sun.jnlp.DownloadServiceImplTest.testRemoveAndLoadPart: NPE at ToolkitStore.get().getAppContext()
JDK-8051160 sun.plugin2.applet.viewer.JNLP2ViewerTest failed on Mac
JDK-8051159 SetupHelpers.blackListJarFile is out dated
JDK-8051158 Unit test error PolicyParserTest
JDK-8051157 com.sun.deploy.uitoolkit.impl.awt.ui.DownloadWindowForServiceTest: progress should be hidden after download
JDK-8051156 Investigate com.sun.javaws.security.JNLPSignedResourcesHelperTest.DISABLED_testWarmupValidationWithSignedJNLP
JDK-8051154 sun.plugin2.applet.JNLP2ClassLoaderTest.testFindGetBasics: Error
JDK-8051151 Applet with jnlp.Packenabled=True And jnlp.versionEnabled=True Fails
JDK-8051150 [nightly] Plugin doesn't work for javafx applets since from build 25.03.2014
JDK-8051143 Run rule not working in case of html applet
JDK-8051142 security prompt is shown twice when 'Do not show' checkbox is checked
JDK-8051141 Applet caller check should not compare URLs
JDK-8051137 RMI thread can no longer call out to AWT thread for webstart app
JDK-8051132 loading browser proxy via config script should not trigger JAR download
JDK-8051129 JRE 7u51 Plugin Failing to Run Older JRE Version < 1.6.0
JDK-8051119 JDK 8u5. When user click "Cancel" in Security warning dialog, wrong message is shown
JDK-8051118 Array out of bounds exception in PluginMain.performSSVValidation
JDK-8051116 The case:api/javax_jnlp/SingleInstanceService/index.html#AddRemove failed automatically
JDK-8051106 Relaunch to JRE 5 does not work
JDK-8051105 Accessibility class in jar on -xbootclasspath/a is not loaded by jvm
JDK-8051098 [nightly] JNLP file invalid parsing
JDK-8051095 Regression- Java Control Panel Advanced tab failed to display
JDK-8051094 Link error: launcher.c:(.text+0x1a97): undefined reference to `_stprintf'
JDK-8051090 CacheTest Failure
JDK-8051087 JNLP with java-vm-args whose length exceeded 512 chars failed to get loaded with CouldNotLoadArgumentException
JDK-8051085 JUnit test compilation error on non Windows platform
JDK-8051080 Java.Lang.Reflect.InvocationTargetException When Cache Has Disabled
JDK-8051077 Disable timeout junit tests
JDK-8051076 Disable SecurityBaseline.backgroundUpdate for JUnit test
JDK-8051075 JNLPSignedResourcesHelperTest sometimes timeout on Windows
JDK-8051074 [Nightly test failure]: PreloaderDelegateTest.testEarlyError
JDK-8051073 Investigate MemoryCacheTest, JNLPSignedResourcesHelperTest, JVMManagerTest and JnlpUpdateTest
JDK-8051072 Some JNLPSignedResourcesHelperTest tests fail on linux-amd64
JDK-8051006 The warning message displays the app name and publisher as "UNKNOWN" if cache is disabled
JDK-8050967 SQE Test PLAN for Nashorn ClassFilter Support
JDK-8050965 JEP-JDK-8042946: SQE Test PLAN for Nashorn Optimistic Typing
JDK-8050838 JRE Install Error in localized Windows 8.1 after join in AD domain
JDK-8050813 Option values are not italicized on JDK 8 keytool documentation page
JDK-8050428 JavaFX client authentication dialog is not a JavaFX-based dialog
JDK-8050396 G1: Enabled G1CollectedHeap::stop()
JDK-8050395 Build failure from multiple ptrace.h
JDK-8050394 assert(ex_map->jvms()->same_calls_as(_exceptions->jvms())) failed: all collected exceptions must come from the same place
JDK-8050392 new hotspot build - hs25.20-b20
JDK-8050280 Java Access Bridge: F key shortcuts not working if Ctrl, Alt, Shift modifier used
JDK-8050161 Metaspace events are missing from JFC files
JDK-8050073 DEV PLAN for Nashorn Optimistic Typing
JDK-8050017 Improve Java Control Panel support for High DPI
JDK-8049680 8.4.1: Clarify that a receiver parameter need not be followed by formal parameters
JDK-8049562 Remove unused is_root checks and closures
JDK-8049541 Broken exception site list GUI- Unable to add a site to the list
JDK-8049502 deploy.dll needs to stop copying javaws.exe to the system dir
JDK-8049433 Deployment .jar files are missing in JAVA_HOME\lib, when installer calls RegisterDeployEx() from deploy.dll
JDK-8049291 Complete single source native launcher development work
JDK-8049088 Close icon not highlighted and no name/description readable by screen readers
JDK-8049066 msi uninstaller not localized
JDK-8049060 JDK installer "Java Setup" dialog a11y issue
JDK-8049053 RFE: Instructions Not Clear For Adding Site To ESL
JDK-8048904 out-of-date dialogs are not displayed correctly in sv
JDK-8048889 DOC: Doc Tasks for Native Memory Tracking documentation
JDK-8048881 [mac] Too long pipe names: sometimes duplicate names arises when many applets on page
JDK-8048880 MacNPAPIJavaPlugin incorrectly constructed which sometimes causes Applet not to load
JDK-8048713 Java Control Panel doesn't display correctly in high resolution
JDK-8048712 Remove AppInfo.getFutureBlock*** methods
JDK-8048502 Multiple applet jars are reported to Java Usage Tracker incorrectly
JDK-8048501 8u20: FX app fails to connect domain:80 while this domain is allowed in cross domain file
JDK-8048326 18.2: Clarify that some constraints should never be encountered
JDK-8048324 18.5.3: Fix cross-references
JDK-8048224 Large pages allocated on Linux are not only on the Java Heap
JDK-8048125 JEP 209: JavaFX Scene Builder Update
JDK-8048122 VPAT: Mnemonics not set for integrated JRE Uninstall Tool buttons
JDK-8048089 ClientConfig.refreshIfNeeded() doesn't restore properties with "active." prefix.
JDK-8047325 [macosx] Fix hard-wired paths to JavaVM.framework
JDK-8047324 Move com.sun.java.browser.dom and com.sun.java.browser.net to deploy
JDK-8047253 Mutable is translated as immutable at Pattern#splitAsStream
JDK-8047243 jmc should be described as a supported tool in JDK Tools page for JDK 7 onwards
JDK-8047241 jvisualvm should be described as a supported tool in JDK Tools page for JDK 7 onwards
JDK-8047240 jcmd should be described as a supported tool in JDK Tools page for JDK 7 onwards
JDK-8047182 VPAT: "Uninstall out-of-date versions" dialogs - JAWS issues
JDK-8046957 sunpkcs11 SessionManager improvement
JDK-8046782 Test hidden methods in JFR
JDK-8046775 Shortcuts are not created for javaws x64 with JRE 7u55 on Windows OS
JDK-8046772 Documentation for -XX:StartFlightRecording=maxsize is incorrect
JDK-8046734 Exceptions pages need cleanup
JDK-8046722 18.2.4: Equality constraints fail to account for primitive types
JDK-8046709 Java Control Panel Security Level Radio Buttons do not have name, screen read not able to read the name
JDK-8046703 JEP 210: LambdaForm Reduction and Caching
JDK-8046501 DRS - cert based run rule doesn't work when running offline
JDK-8046489 15.1: Clarify that void expressions may be lambda bodies
JDK-8046476 VPAT: Application Blocked dialog issues
JDK-8046380 RPM internal names must match the standard bundle file name patterns
JDK-8046353 push/pop
JDK-8046261 JEP 207: Leverage CPU Instructions to Improve SHA Performance on SPARC
JDK-8046146 JEP 156: G1 GC: Reduce need for full GCs
JDK-8046038 JEP 203: Nashorn: Lexically-Scoped Variable & Constant Declarations
JDK-8044192 JEP 195: Scalable Native Memory Tracking
JDK-8043965 Xverify:remote description is wrong
JDK-8043820 4.12.4: Clarify effectively final for local variables
JDK-8043717 JEP 202: Nashorn Class Filter
JDK-8043697 JEP 206: Modernize the JavaFX Media Stack on Mac OS X
JDK-8043353 9.7.4: Clarify that "closest annotation" doesn't directly jump to type names
JDK-8043350 JEP 205: New Controls for JavaFX
JDK-8043344 JEP 204: JavaFX Accessibility
JDK-8043191 5.5: Clarify that invokedynamic can trigger initialization
JDK-8043190 5.5: Trigger interface initialization on default method invocation
JDK-8043188 12.4.1: Trigger interface initialization on default/static method invocation
JDK-8043060 JEP 208: Java Packager Improvements
JDK-8042946 JEP 196: Nashorn Optimistic Typing
JDK-8042626 Exception occurs when writing many texts to java console
JDK-8042344 18.5.4: Need bounds ensuring parameter types are the same
JDK-8041994 8.1.4: Superclass/superinterface "depends" relationship misses imported qualified names
JDK-8041730 Nashorn documentation bug
JDK-8041589 Java tuning white paper needs to be updated with G1
JDK-8041504 Caller-Allowable-Codebase update for 7u55/8u5
JDK-8041383 Restore Java-Security Dialog truncated
JDK-8040180 Extend and improve documentation about Large pages
JDK-8040176 Document -XX:ObjectAlignmentInBytes flag
JDK-8040079 jstat documentation needs to be updated for metaspace
JDK-8039950 JRE installer accessibility issues
JDK-8039447 [TESTBUG] CDS server testing should be added into JDK 8u40
JDK-8039386 Document in Java PKCS#11 Reference Guide how to disable native solaris pkcs11, for installation or process, and add samples for specific disabledMechanisms or SecureRandom and KeyStore services
JDK-8039299 18.5.2: Need broader definition of "dependency" between input/output variables
JDK-8039048 Accessing Tomcat 8.0.3 via HTTPS doesn't work using TLS 1.2 GCM with ucrypto provider
JDK-8038881 10.2: Clarify formulation of an array type
JDK-8038747 18.5.2: Consider lambdas appearing as nested invocation arguments inside other lambdas
JDK-8038645 Application-Library-Allowable-Codebase's documentation should be improved
JDK-8038294 Missing documentation for $OPTIONS in "Nashorn and Shell scripting" guide
JDK-8038293 Nashorn and Shell Scripting additional built-in function section is wrong
JDK-8038292 whitespace missing in examples in jjs tool doc page
JDK-8037858 [Nashorn] Wrong static type return value on some assignment operators
JDK-8037813 Image on in-progress dialog is not localized
JDK-8037788 15.12.2.5: Need to account for lambda bodies with no return expressions
JDK-8037590 The name for PerfDataSaveToFile flag is incorrect in HotSpot VM Options document
JDK-8037417 javaws fails to launch app with empty href in jnlp file if Application-Library-Allowable-Codebase is used
JDK-8037323 Grammar bugs in JLS8
JDK-8037303 There is no information in the release notes of changes in jdk6 which exist in jdk7
JDK-8037039 18.2.4: Do not generate a bound of the form alpha=
JDK-8035652 No optimistic code generated running some arithmetic operations
JDK-8035408 Misprint in "Connecting to the JMX Agent Programmatically" chapter
JDK-8035144 Expires value in MSK timezone in HTTP Header of response does not get respected by plugin.
JDK-8034259 12.5: Clarify that non-constant string + always returns a new String
JDK-8034149 15.27: Avoid ambiguous use of the term "ambiguous"
JDK-8033401 Password Based Encryption example in JCA guide should be updated to use new JDK 8 strong PBE algs
JDK-8032927 JNLP Information Title Tag can override Application-Name manifest attribute
JDK-8032835 Security Dialogs should display OU/O field for Publisher if CN field is empty
JDK-8032725 Description of default maximum heap size need correction
JDK-8031989 Provide API to get all the JNLP artifacts
JDK-8031723 Formatting changes for JNI specification
JDK-8030678 14.10: Clarify that the "top-level class" may be an interface
JDK-8029579 "Application Error" dialog will show up after click "OK" on "Application Blocked" dialog
JDK-8028113 We need to size arrays better
JDK-8027809 ClassNotFound exception when loading jnlp applet in nested resource tag
JDK-8027019 Sometimes, codebase property is not written in .lap file in cache before loading app
JDK-8023095 Applet with legacy_lifecycle=true and jdwp properties destroyed on browseaway
JDK-8023094 web start short cut icon disappear when launch disconnected
JDK-8016641 Cross compilation not as documented
JDK-8011182 Unable to enable the last jre remaining on the system
JDK-6845304 HTMLStyleElement can't be cast to LinkStyle
JDK-4528312 docs: Unclear how to generate overview-summary.html

Committer push log

Karen Kinnear, Oracle

Bug Summary
JDK-8062114 interface initialization for default methods

Aleksej Efimov, Oracle

Bug Summary
JDK-8058233 (tz) Support tzdata2014g
JDK-8062541 (tz) Support tzdata2014i
JDK-8065782 (tz) Support tzdata2014j
JDK-8051014 FEATURE_SECURE_PROCESSING can not be turned off on a validator through SchemaFactory
JDK-8049707 getTextContent doesn't return string in JAXP
JDK-8054106 JAX-WS handles wrongly xsd:any arguments for Web services
JDK-8036981 JAXB not preserving formatting for xsd:any Mixed content
JDK-8050473 NPE seen in XMLDocumentFragmentScannerImpl.setProperty since 7u40b33
JDK-8058234 Several test failing after update to tzdata2014g
JDK-8064389 XML parser returns corrupt attribute value

Alexandr Scherbatiy, BellSoft

Bug Summary
JDK-8056149 [headless] DataTransferer.getInstance throws ClassCastException in headless mode
JDK-8058299 [headless] JPopupMenu creation in headless mode with JDK9b23 causes NPE
JDK-8054415 [macosx] Do not use the base image in the MultiResolutionBufferedImage constructor
JDK-8064886 [macosx] Incorrect thread access when showing splash screen
JDK-8064884 [macosx] java -splash does not honor @2x hi dpi notation for retina support
JDK-8066412 [macosx] TwentyThousandTest test failed with OOM
JDK-8065627 Animated GIFs fail to display on a HiDPI display
JDK-8062657 AWT fails on generic non-reparenting window managers
JDK-8066591 closed/javax/swing/JComboBox/4212498/bug4212498.java:Edit the value in the text field and then press the tab key, the number don't increase
JDK-8057156 Fourth mouse button (wheel) is treated like second button - isPopupTrigger returns true
JDK-8057698 JCK8's api/javax_swing/JDesktopPane/descriptions.html#getset failed with GTKLookAndFeel on Linux and Solaris run
JDK-8066100 JColorChooser no longer supports drag and drop between two JVM instances
JDK-8062897 JComboBox actionListener never receives "comboBoxEdited" from getActionCommand
JDK-8064871 ownedWindowList access requires synchronization in Window.setAlwaysOnTop() method

Anton Litvinov, Oracle

Bug Summary
JDK-8066758 [TEST_BUG] test/sun/awt/dnd/8024061/bug8024061.java fails
JDK-8061223 ArrayIndexOutOfBoundsException occurs when Container with overridden getComponents() is deserialized
JDK-8050839 Java app receives javax.print.PrintException: Printer is not accepting job.
JDK-8059873 ScrollBar doesn't become active when tabs are created more than frame size
JDK-8049334 SortingFocusTraversalPolicy throws IllegalArgumentException from the sort method

Alejandro Murillo, Independent

Bug Summary
JDK-8068911 [TESTBUG] New tests in gc/survivorAlignment/ fails
JDK-8068910 Add tests on alignment of objects copied to survivor space
JDK-8066510 Disable JPRT submissions from the hotspot repo
JDK-8055217 Make jdk8u40 the default jprt release for hs25.40
JDK-8050951 new hotspot build - hs25.20-b21
JDK-8049916 new hotspot build - hs25.40-b02
JDK-8051910 new hotspot build - hs25.40-b03
JDK-8054159 new hotspot build - hs25.40-b04
JDK-8054550 new hotspot build - hs25.40-b05
JDK-8055155 new hotspot build - hs25.40-b06
JDK-8055786 new hotspot build - hs25.40-b07
JDK-8055952 new hotspot build - hs25.40-b08
JDK-8056299 new hotspot build - hs25.40-b09
JDK-8057649 new hotspot build - hs25.40-b10
JDK-8058275 new hotspot build - hs25.40-b11
JDK-8058798 new hotspot build - hs25.40-b12
JDK-8059204 new hotspot build - hs25.40-b13
JDK-8059618 new hotspot build - hs25.40-b14
JDK-8059655 new hotspot build - hs25.40-b15
JDK-8061275 new hotspot build - hs25.40-b16
JDK-8061861 new hotspot build - hs25.40-b17
JDK-8062589 new hotspot build - hs25.40-b18
JDK-8064361 new hotspot build - hs25.40-b19
JDK-8064854 new hotspot build - hs25.40-b20
JDK-8065385 new hotspot build - hs25.40-b21
JDK-8066061 new hotspot build - hs25.40-b22
JDK-8066647 new hotspot build - hs25.40-b23
JDK-8068631 new hotspot build - hs25.40-b24
JDK-8069209 new hotspot build - hs25.40-b25
JDK-8048141 Update the Hotspot version numbers in Hotspot for JDK 8u40
JDK-8068729 Usage of UseHugeTLBFS, UseLargePagesInMetaspace and huge SurvivorAlignmentInBytes cause crashes in CMBitMapClosure::do_bit

Anton Nashatyrev, Oracle

Bug Summary
JDK-8065130 Dragged and Dropped data is corrupted for two data types

Albert Noll, Oracle

Bug Summary
JDK-8054894 "klass->is_loader_alive(_is_alive)) failed: must be alive" for anonymous classes
JDK-8056270 "unexpected yanked node" opto/postaloc.cpp:139
JDK-8054403 'assert(klass->is_loader_alive(_is_alive)) failed: must be alive' during VM_CollectForMetadataAllocation
JDK-8054624 8040121 is broken
JDK-8062627 [TESTBUG] ciReplay/* tests fail after 8034775
JDK-8062031 [TESTBUG] compiler/whitebox/ tests fail : must be osr_compiled (reappeared in nightlies)
JDK-8062292 [TESTBUG] compiler/whitebox/MakeMethodNotCompilableTest.java fails with "must not be in queue"
JDK-8061303 [TESTBUG] Whitebox tests fail with -XX:CompileThreshold=100
JDK-8058427 assert(which != imm_operand) failed: instruction is not a movq reg, imm64
JDK-8058426 closed/compiler/6595044/Main.java failed with timeout
JDK-8062621 CompileQueue::free_all() code is incorrect
JDK-8062629 compiler/7200264/TestIntVect.java fails with: Test Failed: AddVI 0 < 4
JDK-8062619 compiler/startup/SmallCodeCacheStartup.java timed out in RT_Baseline
JDK-8060441 compiler/whitebox/ tests fail : must be osr_compiled
JDK-8054585 Duplicate definitions in vm/runtime/sharedRuntimeTrans.cpp versus math.h in VS2013
JDK-8062620 Excessive number of tests timing out on nightly testing due to fix for 8040798
JDK-8062625 Failing to initialize VM when running with negative value for -XX:CICompilerCount
JDK-8062628 Fix of JDK-8034775 neglects to account for non-JIT VMs
JDK-8055726 Test compiler/classUnloading/methodUnloading/TestMethodUnloading.java does not work with non-default GC

Anton Tarasov, JetBrains

Bug Summary
JDK-8059745 [TESTBUG] fix the @run line of the test: jdk/test/java/awt/Focus/SortingFTP/JDK8048887.java
JDK-8059030 Mac: JFXPanel deadlocks in jnlp mode

Anthony Petrov, Oracle

Bug Summary
JDK-8054914 [JLightweightFrame] Support DnD for SwingNode

Abhijit Saha, Independent

Bug Summary
JDK-8055521 Incorrect radio button behavior
JDK-8060615 Increment hsx 25.25 build to b02 for 8u25-b11
JDK-8069421 Increment hsx 25.31 build to b02 for 8u31-b05
JDK-8069423 Increment hsx 25.31 build to b03 for 8u31-b06
JDK-8069424 Increment hsx 25.31 build to b04 for 8u31-b08
JDK-8069415 Increment minor version of HSx for 8u31 and initialize the build number
JDK-8060612 Increment minor version of HSx25 for 8u25 and initialize the build number
JDK-8069425 Increment the build value to b05 for hs25.31 in 8u31-b08
JDK-8069426 Increment the build value to b06 for hs25.31 in 8u31-b10
JDK-8069428 Increment the build value to b07 for hs25.31 in 8u31-b11
JDK-8060602 Resolve autoconf and other merge issue from 8u20 to 8u25
JDK-8060631 TimeZoneNamesTest should be removed

Anthony Scarpino, Oracle

Bug Summary
JDK-8064378 -Xcheck:jni changes cause many JCK failures in api/javax_crypto tests in SunPKCS11
JDK-8057141 CertificateFactory.getInstance("X.509").generateCertificates(InputStream) does not throw CertificateException for invalid input
JDK-8055505 Consider re-enabling PKCS11 mechanisms previously disabled due to Solaris bug 7050617
JDK-8055226 Re-enabling CBC_PAD PKCS11 mechanisms for Solaris
JDK-8042161 sun.security.pkcs11.SessionManager is scalability blocker

Attila Szegedi, Independent

Bug Summary
JDK-8055609 (function() "hello")() crashes in Lexer with jdk9
JDK-8055617 (function(x){var o={x:0}; with(o){delete x} return o.x})() evaluates to 0 instead of undefined
JDK-8055552 8037534 breaks richards Octane benchmark
JDK-8055630 [TEST_BUG] Test hideLocationProperties.js fail on Window due to backslash in path.
JDK-8055651 [TEST_BUG] test/script/trusted/JDK-8055107.js fails with access control exception
JDK-8057771 [TEST_BUG] Tests for let&const keywords in Nashorn
JDK-8055556 Access to undefined scoped variables deoptimized too much
JDK-8055643 Add "nashorn.args.prepend" system property
JDK-8055610 Add a regression test for the passing test cases from JDK-8042304
JDK-8055549 Add more test cases to check static types
JDK-8055615 Add regression tests for passing test cases of JDK-8024971
JDK-8055607 apply on apply is broken
JDK-8055612 ArrayLiteral mutability caused trouble in optimistic types
JDK-8047331 Assertion in CompiledFunction when running earley-boyer after Merge
JDK-8057831 AtomicInteger is treated as primitive number with optimistic compilation
JDK-8055641 Auto format caused warning in CompositeTypeBasedGuardingDynamicLinker
JDK-8055646 Avoid creation of empty type info files
JDK-8055604 Avoid repeated flattening of nested ConsStrings
JDK-8064318 b36 of 9 introduces regressions over b35 when running lyra
JDK-8055186 Backport Nashorn optimistic typing to 8u repository
JDK-8064593 Binary logical expressions can have numeric types
JDK-8055618 bindings created for declarations in eval code are not mutable
JDK-8061299 Boolean used as optimistic call return type
JDK-8055562 BranchOptimizer produces bad code for NaN FP comparison
JDK-8055546 Check that deoptimizing recompilations are correct
JDK-8055529 Clean up the bin directory
JDK-8059536 Code duplication in handling of break and continue
JDK-8059537 Code duplication in split emitter
JDK-8055576 Collapse long sequences of NOP in Nashorn bytecode output
JDK-8055649 Compile-time expression evaluator was missing variables
JDK-8060725 Compile-time expression evaluator wasn't seeing into ArrayBufferViews
JDK-8055594 Constant folding for unary + should produce int for boolean literals
JDK-8060247 Creating symbols for declared functions shouldn't be a special case
JDK-8055608 Deoptimization type information peristence
JDK-8064589 Deoptimization type information persistence doesn't work - "Failed to calculate version dir name"
JDK-8055593 Deoptimizing negation produces wrong result for zero
JDK-8055538 Developers should be able to pass nashorn properties and enable/disable JFR from command line
JDK-8055581 Enable history for empty property maps
JDK-8055592 Ensure exceptions related to optimistic recompilation are not serializable
JDK-8055620 eval within 'with' statement does not use correct scope if with scope expression has a copy of eval
JDK-8055611 eval("23", ({})[/x/]) crashes with ArrayIndexOutOfBoundsException with optimistic compilation
JDK-8055629 Explicit constructor overload selection should work with StaticClass as well
JDK-8055650 Extension directives to turn on callsite profiling, tracing, AST print and other debug features locally
JDK-8055575 Fix corner cases of JDK-8041995
JDK-8055565 Fix RewriteException debug object return value
JDK-8055579 Fix yet another corner case of JDK-8041995
JDK-8055616 function f(){ var a=1; with({ get a() { return false } }) return a }; f() throws TypeError with optimistic compilation
JDK-8047166 Function("do with({}) break ; while(0);")() crashes with AssertionError from CompilationPhase.java:437
JDK-8055613 Function("switch((null >> x3)) { default: {var x; break ; }\nthrow x; }")() results in AssertionError in LocalVariableTypesCalculator
JDK-8066134 Function.prototype.bind doesn't work on all callables
JDK-8067216 Fuzzing bug: Assertion error related to bytecode slots
JDK-8066887 Fuzzing bug: CodeGenerator load unitialized slot
JDK-8067160 Fuzzing bug: constant folding of ternary operator and IfNode with constant test
JDK-8067159 Fuzzing bug: duplicate integer switch cases
JDK-8067161 Fuzzing bug: StackMapTable error: bad offset, ClassFormatError
JDK-8066886 Fuzzing bug: Undefined object type assertion when computing TypeBounds
JDK-8055591 Get rid of global optimistic flag
JDK-8055631 Global object initialization via javax.script API should be minimal
JDK-8055645 Global.initConstructor and ScriptFunction.getPrototype(Object) can have stricter types
JDK-8060726 Immediately invoked function expressions cause lot of deoptimization
JDK-8061596 Implement optimistic splitter
JDK-8055571 Improve performance of Nashorn equality operators
JDK-8055577 Index selection of overloaded java new constructors
JDK-8058103 Instead of not skipping small functions in parser, make lexer avoid them instead
JDK-8056145 iteration fails if index var is not used
JDK-8055632 javax.script.filename variable should not be enumerable with nashorn engine's ENGINE_SCOPE bindings
JDK-8055639 jdeps is not PATH on Mac, results in ant clean test failure on Mac
JDK-8056165 jdk.nashorn.internal.codegen.ApplySpecialization$1.leaveIdentNode() should throw stackless Exception
JDK-8056163 jdk.nashorn.internal.codegen.CompilationPhase.setStates() is hot in class installation phase
JDK-8056159 jdk.nashorn.internal.ir.Node.hashCode() delegates to Object.hashCode() and is hot
JDK-8056162 jdk.nashorn.internal.runtime.Source.getContent() does excess Object.clone()
JDK-8056160 jdk.nashorn.internal.{codegen.CompilationPhase|runtime.Timing} should use System.nanoTime
JDK-8055648 jjs exits interactive mode if exception was thrown when trying to print value of last evaluated expression
JDK-8055624 JSON.parse('{"0":0, "64":0}') throws ArrayindexOutOfBoundsException
JDK-8055614 large string size RangeError should be thrown rather than reporting negative length
JDK-8064451 Logical NOT operator throws NullPointerException for null Boolean return values
JDK-8061595 Make AST serializable
JDK-8055586 Make code caching work with optimistic typing and lazy compilation
JDK-8055582 Make equality tests inline better
JDK-8055590 Make optimistic exception handlers smaller
JDK-8055606 Make sure that there is no difference in test exercise behavior between lazy and non lazy
JDK-8055626 Minor API convenience functions on "Java" object
JDK-8055601 MultiGlobalCompiledScript used to cache method handle and strict mode - not anymore
JDK-8055589 Nashorn : all tests failed with java.security.AccessControlException
JDK-8055599 nashorn properties leak memory
JDK-8055536 NASHORN TEST: Create tests to test markdown javascript engine work with Nashorn.
JDK-8056166 Nashorn: all tests failed with AccessControlException
JDK-8055642 Nashorn: AssertionError when use __DIR__ and ScriptEngine.eval()
JDK-8055539 Need regression test for bug JDK-8010731
JDK-8055545 New tests need to be written for optimistic typing feature
JDK-8055555 NPE in unboxInteger
JDK-8058883 NullPointerException at jdk.nashorn.internal.codegen.LocalVariableTypesCalculator.symbolIsUsed(LocalVariableTypesCalculator.java:224)
JDK-8055580 Octane test harness in Nashorn is missing an argument for print_always
JDK-8055598 On-demand compiled top-level program doesn't need :createProgramFunction
JDK-8055553 OptimisticRecompilationTest fails on staging repo nashorn/jdk9/nashorn due to test framework
JDK-8055633 OptimisticTypesPersistence.java should use java.util.Date instead of java.sql.Date
JDK-8055621 Persistent code store is broken after optimistic types merge
JDK-8061620 Pessimistic LMUL used where optimistic should be
JDK-8056158 Questionable String.intern() in jdk.nashorn.internal.ir.IdentNode()
JDK-8056161 Questionable use of parallelStream() in jdk.nashorn.internal.runtime.Context$ContextCodeInstaller.initialize()
JDK-8055622 readFully does not handle ConsString file names
JDK-8058236 Reduce the RecompilableScriptFunctionData footprint
JDK-8055625 Reduce time spent in jdk.nashorn.internal.ir.Node.accept/java.lang.Class.cast(Object)
JDK-8055573 Reduce variability at JavaAdapter call sites
JDK-8058102 Remove "eval id" from eval locations
JDK-8055537 Remove nashorn repo "bin" scripts to avoid confusion with JDK bin launcher programs
JDK-8064824 Remove NativeArray link logic fields
JDK-8060690 Reports for optimistic test run overwrite those for pessimistic run
JDK-8055605 Running uncompilable scripts throws NullPointerException
JDK-8055640 ScriptObjectMirror causing havoc with Invocation interface
JDK-8055634 Separate src and test execution sandbox directories
JDK-8059750 Single class loader is used to load compiled bytecode
JDK-8057926 Skip nested functions on reparse
JDK-8062733 Some arithmetic operations have unnecessary widening
JDK-8055596 Some tests fail with non-optimistic compilation
JDK-8055623 String concatenation with optimistic types is slow
JDK-8055644 test/script/external/test262/test/suite/ch12/12.6/12.6.4/12.6.4-2.js fails with tip
JDK-8055636 Test262 tests for ECMAScript 5 now in branch "es5-tests"
JDK-8055533 Tidy up Nashorn codebase for code standards
JDK-8055534 Tidy up Nashorn codebase for code standards (August 2014)
JDK-8064717 Trivial bugfixing and exception reuse in ApplySpecialization
JDK-8055647 type info cache may be disabled for test262 and tests explicitly changing that property should use @fork
JDK-8055619 Type info caching accidentally defeated
JDK-8055578 Type-based optimizations interfere with continuation methods
JDK-8055600 TypeError: Cannot apply "with" to non script object
JDK-8055597 Unnecessary restOf check in CodeGenerator.undefinedCheck
JDK-8059535 Unnecessary work in deoptimizing recompilation
JDK-8055572 Use strongly referenced generic invokers
JDK-8055637 Wrong type calculated for ADD operator with undefined operand

Andrew Brygin, Azul

Bug Summary
JDK-8056081 [macosx] Large JTable cell results in a OutOfMemoryException
JDK-8058953 JDK demo applets not running with >=7u40 or (JDK 8 and JDK 9)
JDK-8053933 KeyEvent can not be accepted in quick mouse clicking
JDK-8049598 Test test/sun/awt/image/bug8038000.java fails with ClassCastException

Brent Christian, Oracle

Bug Summary
JDK-8044473 Allow for extended set of platform MXBeans
JDK-8064288 sun.management.Flag should loadLibrary()

Brian Burkhalter, Oracle

Bug Summary
JDK-8058750 [TEST_BUG] Bad fonts in BigIntegerTest
JDK-8058751 [TEST_BUG] More bad characters in BigIntegerTest
JDK-8058748 BigDecimal is no longer effectively immutable
JDK-8058749 BigIntegerTest does not exercise Burnikel-Ziegler division
JDK-8062595 Modifications of server socket channel accept() methods for instrumentation purposes
JDK-8061380 Wrong NumberFormat.format() HALF_UP rounding when last digit exactly at rounding position greater than 5

Bengt Rutisson, Oracle

Bug Summary
JDK-8049327 [TESTBUG] gc/logging/TestGCId.java assumes default PrintGCID value is true
JDK-8048522 Add a GC id as a log decoration similar to PrintGCTimeStamps
JDK-8060131 After JDK-8047976 gc/g1/TestSummarizeRSetStatsThreads fails
JDK-8042767 Cleanup SuspendibleThreadSet
JDK-8042305 CMS: enable time based triggering of concurrent cycles
JDK-8059460 Ergonomics for GC thread counts should update the flags
JDK-8059878 Force young GC to initiate marking cycle when stat update is requested
JDK-8059890 G1: Change the default values for G1HeapWastePercent and G1MixedGCLiveThresholdPercent
JDK-8058565 Make heap region region type in G1 HeapRegion explicit
JDK-8057536 Refactor G1 to allow context specific allocations
JDK-8063103 Type annotations not retained during class redefine / retransform
JDK-8057752 WhiteBox extension support for testing

Calvin Cheung, Oracle

Bug Summary
JDK-8048151 Allow easy configurations for large CDS archives
JDK-8052313 Backport CDS tests from JDK-9 to jdk8_u40
JDK-8057115 Change "8048150: Allow easy configurations for large CDS archives" triggers conversion warning with older GCC
JDK-8061206 Exclude AIX from VS.NET make/windows/projectcreator.make
JDK-8058264 java.net.URLClassLoader.findClass uses exceptions in control flow
JDK-8062586 VM Crashes in MetaspaceShared::generate_vtable_methods while creating CDS archive with limiting SharedMiscCodeSize

Chris Hegarty, Independent

Bug Summary
JDK-8066804 [TEST_BUG] sun/net/www/http/HttpClient/StreamingRetry.java failed intermittently
JDK-8053971 Collections.checkedList(empty list).replaceAll((UnaryOperator)null) doesn't throw NPE after JDK-8047795
JDK-8050857 Improve diagnostic output in com/sun/jndi/ldap/LdapTimeoutTest.java
JDK-8058323 NetworkInterface.getHardwareAddress can return zero length byte array when run with preferIPv4Stack
JDK-8050858 Reduce possible timing noise in com/sun/jndi/ldap/LdapTimeoutTest.java

Sean Coffey, Oracle

Bug Summary
JDK-8062670 (str) contentEquals checks the String contents twice on mismatch
JDK-8051580 [macosx] (awt) setjmp/longjmp changes the process signal mask on OS X
JDK-8057813 Alterations to jdk_security3 test target
JDK-8051582 awt_Plugin no longer needed
JDK-8059311 com/sun/jndi/ldap/LdapTimeoutTest.java fails with exit_code == 0
JDK-8051581 DTDBuilder should be run in headless mode
JDK-8059564 GSSContext.acceptSecContext fails when a supported mech is initiator preferred
JDK-8049036 java/net/URLPermission/nstest/lookup.sh NoClassDefFoundError when run in concurrent mode
JDK-8055526 new hotspot build - hs25.20-b23
JDK-8049917 OutputStreamHook doesn't handle null values
JDK-8057756 SSLv2Hello protocol may be filtered out unexpectedly
JDK-8049466 Test sun/security/pkcs11/Signature/TestDSAKeyLength.java fails intermittently on Solaris 11 in 8u40 nightly
JDK-8055383 Two tests failed with "java.net.SocketException: Bad protocol option" on Windows after 8029607
JDK-8055382 Type of Service (TOS) cannot be set in IPv6 header
JDK-8051579 X11 dependencies should be removed from Mac OS X build.

Coleen Phillimore, Oracle

Bug Summary
JDK-8059642 Allocation of more then 1G of memory using Unsafe.allocateMemory is still causing a fatal error on 32bit platforms
JDK-8056024 Change 8037816 breaks HS build on PPC64 and CPP-Interpreter platforms
JDK-8047880 host_klass invariant fails when verifying newly loaded JSR-292 anonymous classes
JDK-8047195 Improve performance of Class.getClassLoader()
JDK-8058273 Internal Error: mallocTracker.cpp:146 fatal error: Should not use malloc for big memory block, use virtual memory instead
JDK-8042592 redefining method used by multiple MethodHandles crashes VM
JDK-8061554 SIGSEGV VirtualMemoryTracker::remove_released_region

Christian Tornqvist, Oracle

Bug Summary
JDK-8062326 [TESTBUG] Detailed Native Memory Tracking (NMT) data is not verified as output at VM exit
JDK-8064628 [TESTBUG] MallocSiteHashOverflow.java should be enabled for 32-bit platforms
JDK-8056263 [TESTBUG] Re-enable NMTWithCDS.java test
JDK-8058166 [TESTBUG] Test is needed to verify correctness of malloc tracking
JDK-8064630 assert(_count > 0) failed: Negative counter when running runtime/NMT/MallocTrackingVerify.java
JDK-8055243 Make jdk8u40 the default release
JDK-8048931 Set T family feature bit on Niagara systems
JDK-8064629 Update use of GetVersionEx to get correct Windows version in hs_err files

David Buck, Oracle

Bug Summary
JDK-8064324 BCEL corrupts debug data of methods that use generics
JDK-8064554 BCEL still corrupts generic methods if bytecode offsets are modified
JDK-8065638 JVM_GetVersionInfo fails to zero structure
JDK-8063111 stability issues when being launched as an embedded JVM via JNI

Dmitry Cherepanov, Azul

Bug Summary
JDK-8059136 Reverse removal of applet demos [backout 8015376]

Daniel Daugherty, Oracle

Bug Summary
JDK-8034005 cannot debug in synchronizer.o or objectMonitor.o on Solaris X86 debug/jvmg bits
JDK-8033602 wrong stabs data in libjvm.debuginfo on JDK 8 - SPARC

Daniel Fuchs, Oracle

Bug Summary
JDK-8057591 [TEST_BUG] java/util/logging/CheckZombieLockTest.java fails with NoSuchFileException
JDK-8059463 FileHandler may throw NPE if pattern is a simple name and the lock file already exists
JDK-8066907 LogManager unecessarily calls JavaAWTAccess from within a critical section
JDK-8049857 Regression on java.util.logging.FileHandler

David Holmes, Oracle

Bug Summary
JDK-8036616 [TESTBUG] Embedded: sun/jvmstat/monitor/MonitoredVm/CR6672135.java should be launched with -XX:+UsePerfData
JDK-8067232 [TESTBUG] runtime/CheckEndorsedAndExtDirs/EndorsedExtDirs.java fails with ClassNotFoundException
JDK-8055858 [Testbug] Some tests are being executed and fail under profiles
JDK-8051400 Add hotspot testset to jprt.properties
JDK-8061757 Add jtreg jobs to JPRT for Hotspot
JDK-8061758 Add sanity test for minimal VM in test/Makefile
JDK-8049929 Configure --with-jvm-variants=client,server,x produces default outputdir containing comma
JDK-8049412 Jtreg /jdk/TEST.groups should be changed for profiles
JDK-8050969 Let jprt run configure when building
JDK-8061759 Minimal VM build broken after gcId.cpp was added
JDK-8049994 Support invoking Hotspot tests from top level
JDK-8054559 Support SKIP_BOOT_CYCLE=false when invoked from JPRT
JDK-8061888 TraceClassLoading expects there to be a (Java) caller when you load a class with the bootstrap class loader

Dan Smith, Oracle

Bug Summary
JDK-8048019 javac crashes when encountering an unresolvable interface

Dmitry Markov, Oracle

Bug Summary
JDK-8048717 [macosx] javax.swing.PopupFactory issue with null owner
JDK-8054216 [macosx] Language specific keys does not work in applets when opened outside the browser
JDK-8049577 NPE when changing Windows theme
JDK-8058286 Using tables in JTextPane leads to infinite loop in FlowLayout.layoutRow

Dmeetry Degrave, Oracle

Bug Summary
JDK-8054142 NPE from JapaneseEra when a new era is defined in calendar.properties

Dmitriy Samersoff, Independent

Bug Summary
JDK-8058250 SA: Constantpool lookup for invokedynamic is not implemented

Erik Gahlin, Oracle

Bug Summary
JDK-8046783 Add hidden field to methods for event based tracing
JDK-8062372 java/lang/instrument/DaemonThread/TestDaemonThread.java regularly fails due to exceeded timeout
JDK-8055682 sun/jvmstat/monitor/MonitoredVm/MonitorVmStartTerminate.java timed out
JDK-8028474 sun/jvmstat/monitor/MonitoredVm/MonitorVmStartTerminate.sh timeout, leaves looping process behind

Erik Helin, Oracle

Bug Summary
JDK-8054982 -Xcheck:jni should support checking of GetPrimitiveArrayCritical
JDK-8054994 Check JNI ReleaseStringChars / ReleaseStringUTFChars verify_guards test inverted

Eric Mccorkle, @metricspace.net

Bug Summary
JDK-8065132 Parameter annotations not updated when synthetic parameters are prepended
JDK-8055063 Parameter#toString() fails w/ AIOOBE for ctr of inner class w/ generic type
JDK-8067039 Revert changes to annotation attribute generation

Erik Joelsson, Oracle

Bug Summary
JDK-8065232 Add --with-copyright-year option to configure
JDK-8059834 New Nasgen dependencies to Nashorn breaks the JDK 9 build - bootstrapping problem?

Goetz Lindenmaier, SAP

Bug Summary
JDK-8067323 ppc64: argument and return type profiling, fix problem with popframe

Hannes Wallnoefer, Oracle

Bug Summary
JDK-8067228 __noSuchMethod__ binds to this-object without proper guard
JDK-8060724 ant test262parallel in Nashorn spends a significant amount of time after almost all the tests are run
JDK-8056978 ClassCastException: cannot cast jdk.nashorn.internal.scripts.JO*
JDK-8061317 Concatenating an array and converting it to Java gives wrong result
JDK-8063131 Different versions of nashorn use same code cache directory
JDK-8067244 dust.js performance regression caused by primitive field conversion
JDK-8058237 Global constants get in the way of self-modifying properties
JDK-8051889 Implement block scoping in symbol assignment and scope computation
JDK-8058885 Indexed or polymorphic set on global affects Object.prototype
JDK-8063132 java.lang.String methods not available on concatenated strings
JDK-8057980 let & const: remaining issues with lexical scoping
JDK-8046202 Make persistent code store more flexible
JDK-8059236 Memory leak when executing octane pdfjs with optimistic typing
JDK-8062656 Nashorn incorrectly binds "this" for constructor created by another function
JDK-8065747 Nashorn should just warn on code store instantiation error
JDK-8057691 Nashorn: let & const declarations are not shared between scripts
JDK-8058311 Non-serializable fields in serializable classes
JDK-8067285 NPE in ScriptObject.clone() when running with object fields
JDK-8060018 NPE restoring cached script with optimistic types disabled
JDK-8066598 OOM on Window/Solaris in test compile-octane-splitter.js
JDK-8058310 Single quotes must be escaped in message resource file
JDK-8062673 Throwing object with error prototype causes error proto to be caught
JDK-8059813 Type Info Cache flag must must be documented
JDK-8062655 User accessors require boxing and do not support optimistic types
JDK-8057021 UserAccessorProperty guards fail with multiple globals

Henry Jen, Oracle

Bug Summary
JDK-8065267 adjust-mflags.sh failed build with GNU Make 4.0 with -I
JDK-8065386 AIX: fix adjust-mflags.sh to build with GNU Make 4.0 (adapt 8028407 for AIX)

Harold Seigel, Oracle

Bug Summary
JDK-8051002 Incorrectly merged share/vm/classfile/classFileParser.cpp was pushed to 8u20
JDK-8051757 Regression in verifier for method call from inside of a branch
JDK-8055302 super() in a try block in a ctor may need to cause VerifyError
JDK-8051410 VerifyError on backward branch

Ivan Gerasimov, Google

Bug Summary
JDK-8064413 (coll) IdentityHashMap is resized before exceeding the expected maximum size
JDK-8064271 (fc) FileChannel.size() returns 0 for block devices on Linux
JDK-8056097 (fs) bad error handling in java.base/unix/native/libnio/fs/UnixNativeDispatcher.c
JDK-8064401 (fs) Path.register doesn't throw IllegalArgumentException if multiple OVERFLOW events are specified
JDK-8064400 (fs) Path.register doesn't throw IllegalArgumentException if multiple OVERFLOW events are specified, part 2
JDK-8064402 (fs) Path.register(..) clears interrupt status of thread with no InterruptedException
JDK-8054910 (process) ProcessBuilder leaks native memory
JDK-8064410 (ref) ReferenceQueue.remove(timeout) may return null even if timeout has not expired
JDK-8049720 (smartcardio) CardTerminal.connect('direct') does not work on MacOSX
JDK-8050921 (smartcardio) Invert reset argument in tests in sun/security/smartcardio
JDK-8049250 (smartcardio) Need a flag to invert the Card.disconnect(reset) argument
JDK-8064396 BitSet.toString() can throw IndexOutOfBoundsException
JDK-8058676 ByteArrayOutputStream capacity should be maximal array size permitted by VM
JDK-8066169 Core reflection should use final fields whenever possible
JDK-8057952 Duplicate closure of file descriptors leads to unexpected and incorrect closure of sockets
JDK-8064412 java/lang/ref/EarlyTimeout.java: elapsed time 981 is less than timeout 1000
JDK-8064397 java/util/BitSet/BSMethods.java failed with: java.lang.OutOfMemoryError: Java heap space
JDK-8065537 Misplaced parentheses in sun.net.www.http.HttpClient break HTTP PUT streaming
JDK-8064408 SequenceInputStream with lots of empty substreams can cause StackOverflowError
JDK-8048884 TEST BUG: NativeErrors.java uses wrong path name in exec
JDK-8064411 TEST_BUG: java/lang/ref/EarlyTimeout.java fails with a non-adequate message

Igor Ignatyev, Oracle

Bug Summary
JDK-8058351 [TEST_BUG] Test library enhancement in lib/testlibrary/jsr292/com/oracle/testlibrary/jsr292/Helper.java
JDK-8057681 add jprt_optimized targets
JDK-8066408 compiler/EliminateAutoBox/UnsignedLoads.java fails with client vm
JDK-8057929 Develop sanity tests on SPARC's SHA instructions support
JDK-8057928 Develop tests for new command-line options related to SHA intrinsics
JDK-8054551 memory leak in jmm_SetVMGlobal
JDK-8057927 Move compiler/intrinsics/mathexact/sanity/Verifier to compiler/testlibrary and extend its functionality
JDK-8058352 New tests for LambdaForm Reduction and Caching feature
JDK-8054552 new WB API :: get/setVMFlag
JDK-8057682 typo in export_optimized_jdk

Ioi Lam, Oracle

Bug Summary
JDK-8066671 -XX:+PrintSharedArchiveAndExit does not exit the VM when the archive is invalid
JDK-8061651 Add an interface to the JVM's Class/Resource Lookup Index Cache for improving sun.misc.URLClassPath search time
JDK-8047937 Class Data Sharing clean up and refactoring
JDK-8057094 Minor class loading clean-up
JDK-8065840 Some CDS optimizations should be disabled if bootclasspath is modified by JVMTI
JDK-8065841 WB_AddToBootstrapClassLoaderSearch calls JvmtiEnv::create_a_jvmti when not in _thread_in_vm state

Igor Veresov, Oracle

Bug Summary
JDK-8059097 8058744 needs a test case
JDK-8066973 Array Out Of Bounds Exception causes variable corruption
JDK-8059096 Crash in C1 OSRed method w/ Unsafe usage
JDK-8057968 CTW should not make MH intrinsics not entrant
JDK-8057887 Hotspot should use PICL interface to get cacheline size on SPARC
JDK-8059391 java/lang/instrument/NativeMethodPrefixAgent.java fails due to VirtualMachineError: out of space in CodeCache for method handle intrinsic
JDK-8059797 JVM crashes with "unexpected index type" assert in LIRGenerator::do_UnsafeGetRaw
JDK-8058266 Move _highest_comp_level and _highest_osr_comp_level from MethodData to MethodCounters
JDK-8055337 Segmentation error while running program
JDK-8062363 SIGBUS in C2 compiled method weblogic.wsee.jaxws.framework.jaxrpc.EnvironmentFactory$SimulatedWsdlDefinitions.
JDK-8058267 Test vm/mlvm/meth/stress/compiler/deoptimize. Assert in src/share/vm/classfile/systemDictionary.cpp: MH intrinsic invariant
JDK-8058646 Tiered compilation performance drop in PIT

Jaroslav Bachorík, DataDog

Bug Summary
JDK-8059659 JDI: ReferenceType.visibleMethods() return wrong visible methods
JDK-8047073 Some javax/management/ fails with JFR
JDK-8042123 Support default and static interface methods in JDI, JDWP and JDB

John Coomes, Twitter

Bug Summary
JDK-8057535 add a thread extension class
JDK-8057731 add an extension class for argument handling
JDK-8060467 CMS: small OldPLABSize and -XX:-ResizePLAB cause assert(ResizePLAB || n_blks == OldPLABSize) failed: Error
JDK-8057818 collect allocation context statistics at gc pauses
JDK-8057658 Enable G1 FullGC extensions
JDK-8054970 gc src file exclusion should exclude alternative sources
JDK-8058235 identify GCs initiated to update allocation context stats
JDK-8051295 make gc src file exclusion more automatic
JDK-8057824 methods to copy allocation context statistics
JDK-8057827 notify an obj when allocation context stats are available
JDK-8057710 Refactor G1 heap region default sizes
JDK-8057642 refactor gc argument processing code slightly

Joel Borggrén-Franck, Oracle

Bug Summary
JDK-8062027 (ann) Cannot reference field of inner class in an anonymous class
JDK-8054987 (reflect) Add sharing of annotations between instances of Executable
JDK-8054984 (reflect) Constructor.getAnnotatedReceiverType() returns wrong value
JDK-8065192 javac Attr crashes with NPE in TypeAnnotationsValidator visitNewClass
JDK-8064391 More thread safety problems in core reflection
JDK-8058632 Revert JDK-8054984 from 8u40

Jiangli Zhou, Google

Bug Summary
JDK-8047935 Adding new API for unlocking diagnostic argument for SharedArchiveFile
JDK-8064735 Change certain errors to warnings in CDS output

Jan Lahoda, Oracle

Bug Summary
JDK-8056020 @SuppressWarnings("deprecation") does not work when overriding deprecated method
JDK-8064879 Compiler error when anonymous class uses method with parametrized exception
JDK-8066175 Compiler Error when obtaining .class property
JDK-8057028 Exception in compiler: java.lang.AssertionError: isSubClass T
JDK-8061314 NullPointerException when compiling specific code.
JDK-8057027 Type inference may be skipped for a complex receiver generic method in a parameter position

Jon Masamitsu, Oracle

Bug Summary
JDK-8062603 assert(_heap_alignment >= _space_alignment) failed: heap_alignment less than space_alignment
JDK-8062690 ConcurrentMarkThread::slt may be invoked before ConcurrentMarkThread::makeSurrogateLockerThread causing intermittent crashes
JDK-8054195 Make UseNUMA enable UseNUMAInterleaving

Joe Wang, Oracle

Bug Summary
JDK-8037948 Improve documentation for org.w3c.dom package

Jesper Wilhelmsson, Oracle

Bug Summary
JDK-8058269 [TESTBUG] gc/g1/TestHumongousShrinkHeap.java fails due to OOM
JDK-8053901 Add a way to verify an extended set of command line options
JDK-8056235 CMM Testing: 8u40 an allocated humongous object at the end of the heap should not prevents shrinking the heap
JDK-8062055 GC cleanup phase can cause G1 skipping a System.gc()
JDK-8065305 Make it possible to extend the G1CollectorPolicy
JDK-8054041 Refactor test framework for dynamic VM options
JDK-8056056 Remove unnecessary inclusion of HS_ALT_MAKE from solaris Makefile
JDK-8055006 Store original value of Min/MaxHeapFreeRatio

Kevin Walls, Oracle

Bug Summary
JDK-8058933 JVM hangs at getAgentProperties after attaching to VM with lower IntegrityLevel
JDK-8063097 Make PrintGCApplicationStoppedTime print information about stopping threads

Konstantin Shefov, Azul

Bug Summary
JDK-8060696 [TEST_BUG] Test java/awt/Graphics2D/DrawString/DrawStringCrash.java fails with OutOfMemoryError
JDK-8066785 [TESTBUG] java/lang/invoke/LFCaching/LFMultiThreadCachingTest.java failed - timeout
JDK-8061226 [TESTBUG] java/lang/invoke/LFCaching/LFSingleThreadCachingTest.java and LFMultiThreadCachingTest.java failed on some platforms due to java.lang.VirtualMachineError
JDK-8061225 [TESTBUG] Reinvokers with arity >253 can't be cached
JDK-8058878 TEST_BUG: Make java/lang/invoke/LFCaching/LFGarbageCollectedTest.java skip arrayElementSetter and arrayElementGetter methods
JDK-8064893 TestHumongousShrinkHeap.java can not be run with -XX:+ExplicitGCInvokesConcurrent

Kumar Srinivasan, VMWare

Bug Summary
JDK-8064292 [asm] refresh internal ASM version v5.0.3
JDK-8047887 Fix raw and unchecked lint warnings in asm
JDK-8055502 Launcher changes for native memory tracking scalability enhancement

Vladimir Kozlov, Oracle

Bug Summary
JDK-8066649 8u backport for 8065618 is incorrect
JDK-8057989 Add C2 x86 intrinsic for BigInteger::multiplyToLen() method
JDK-8051378 AIX: Change "8030763: Validate global memory allocation" breaks the HotSpot build
JDK-8061428 assert(adr_type != NULL) failed: expecting TypeKlassPtr
JDK-8058238 assert(false) failed: only Initialize or AddP expected macro.cpp:943
JDK-8058240 assert(result == NULL || result->is_oop()) failed: must be oop
JDK-8064839 Bug in locking code when UseOptoBiasInlining is disabled: assert(dmw->is_neutral()) failed: invariant
JDK-8066653 C2 escape analysis prevents VM from exiting quickly
JDK-8066496 C2 RA incorrectly removes kill projections
JDK-8054959 C2 support for SHA on SPARC
JDK-8062576 CompilerThread seems to occupy all CPU in a very rare situation
JDK-8051774 Concurrency problem in PcDesc cache
JDK-8054958 Expand functionality of PredictedIntrinsicGenerator
JDK-8057964 Extend CompileCommand=option to handle numeric parameters
JDK-8057966 Fix AIX build after the Extend CompileCommand=option change 8055286
JDK-8051913 Fix bad field access check in C1 and C2
JDK-8049902 Introduce umbrella header orderAccess.inline.hpp
JDK-8049903 Introduce umbrella header prefetch.inline.hpp
JDK-8061571 It should be possible to explicitly disable usage of TZCNT instr w/ -XX:-UseBMI1Instructions
JDK-8057965 JDK-8055286 changes are incomplete.
JDK-8054858 JVM crashed in Compile::start() during method parsing w/ UseRTMDeopt turned on
JDK-8057884 Missing MemNode::acquire ordering in some volatile Load nodes
JDK-8054376 Move RTM flags from Experimental to Product
JDK-8059226 Names of rtm_state_change and unstable_if deoptimization reasons were swapped in 8u40
JDK-8054947 Optimize code generated by C2 for Intel's Atom processor
JDK-8057880 PPC64: implement template interpreter for ppc64le
JDK-8059641 Recent bugfixes in ppc64 port.
JDK-8058239 Recursive method that was compiled by C1 is unable to catch StackOverflowError
JDK-8054924 Refactor DigestBase.engineUpdate() method for better code generation by JIT compiler
JDK-8062074 SPECjvm2008-MPEG performance regressions on x64 platforms
JDK-8058162 Tests run TypeProfileLevel=222 crash with guarantee(0) failed: must find derived/base pair
JDK-8057909 Unable to build --with-debug-level=optimized on OSX
JDK-8054805 Update CLI tests on RTM options to reflect changes from JDK-8054376
JDK-8054384 VerifyStack logic in Deoptimization::unpack_frames does not expect to see invoke bc at the top frame during normal deoptimization

Marcus Lagergren, Independent

Bug Summary
JDK-8058110 Additional arguments to Function.prototype.apply messes up actual arguments passed
JDK-8064778 Cosmetics: The recompile log produces double lines for some reason
JDK-8057825 emitted socket arg becomes null in avatar.js http tests
JDK-8064821 GlobalConstants produces wrong result with Object.defineProperty
JDK-8060477 GlobalConstants.findSetMethod calls DynamicLinker.getLinkedCallSiteLocation, which does Throwables
JDK-8063032 JDK-8061391 regresses typescript: OOME with too fat SparseArrayData instances
JDK-8058212 jdk/nashorn/internal/scripts/JO* classes are missing from the generated methods dump
JDK-8058218 Lots of trivial classes are generated by Nashorn compiler
JDK-8058194 Make class dumping available outside --compile-only mode
JDK-8063031 Missing ArrayBuffer.isView() Method
JDK-8066144 Missing resource type.error.not.an.arraybuffer
JDK-8059231 Octane Raytrace fails when optimistic typing turned off
JDK-8064718 push() on frozen array increases its length property
JDK-8063029 Remove all Joni and test Warnings
JDK-8059578 Significant parser/frontend overhead in recompilation of avatar.js
JDK-8025435 Specialized library functions for optimistic typing
JDK-8058222 Still, lots of trivial classes are generated by Nashorn compiler
JDK-8062140 String.concat needs to have optimistic builtin versions
JDK-8063030 String.prototype.charCodeAt called with invalid index throws ClassCastException
JDK-8065129 Test NASHORN-377.js fails on Solaris sparc

Svetlana Steuck, Oracle

Bug Summary
JDK-8047186 jdk.net.Sockets throws InvocationTargetException instead of original runtime exceptions
JDK-8066121 Nashorn: Tests failed on Windows when in output contains path to script

Lance Andersen, Oracle

Bug Summary
JDK-8049633 remove invalid test entry from TEST.groups

Jonathan Lu, Independent

Bug Summary
JDK-8056986 AIX: Provide a better fontconfig.properties file

Mikhail Cherkasov, Oracle

Bug Summary
JDK-8049014 [macosx] Endless loop in EDT on Mac
JDK-8063140 NPE in sun/lwawt/macosx/CPlatformWindow::toFront after JDK-8060146
JDK-8049887 PNGMetadata.getAsTree() sets bitDepth to invalid value
JDK-8054405 Unexpected mnemonic in JFileChooser

Mandy Chung, Oracle

Bug Summary
JDK-8051376 (jdeps) Add filtering capability
JDK-8051377 (jdeps) Recommend supported API to replace use of JDK internal API
JDK-8051374 (jdeps) use @jdk.Exported to determine supported vs JDK internal API
JDK-8064667 Add -XX:+CheckEndorsedAndExtDirs flag to JDK 8
JDK-8065702 Deprecate the Extension Mechanism
JDK-8065765 Missing space in output message from -XX:+CheckEndorsedAndExtDirs

Maurizio Cimadamore, Oracle

Bug Summary
JDK-8052388 Cannot assign a value to final variable in lambda
JDK-8043927 javac, code valid in 7 is not compiling for 8
JDK-8062272 StackOverflowError at com.sun.tools.javac.code.Types.lub
JDK-8058094 Wrong, confusing error when non-static varargs referenced in static context

Mike Duigou, Independent

Bug Summary
JDK-8051046 add "serve" command and --quiet and --verbose options to hgforest
JDK-8051051 Add Mercurial Version check to get_source.sh
JDK-8051048 Add sequential operation support to hgforest
JDK-8051049 Better concurrency in hgforest.sh
JDK-8049467 CheckedQueue.offer calls wrong method on wrapped queue
JDK-8049468 Collections.checkedList checking bypassed by List.replaceAll
JDK-8051052 get_source.sh outputs 'integer expression expected' messages
JDK-8051050 hgforest: allow local clone of extra repos
JDK-8051053 hgforest: some shells run read in sub-shell and can't use fifo
JDK-8051047 Some hgforest.sh commands don't receive parameters
JDK-8052200 SynchronizedNavigableSet tailSet uses wrong mutex

Michael Fang, Oracle

Bug Summary
JDK-8049128 8u20 l10n resource file translation update 2 - jaxp
JDK-8065181 Japanese translation for a warning from javac looks incorrect.
JDK-8065157 jdk8u40 Japanese man page file translation update
JDK-8059177 jdk8u40 l10n resource file translation update 1
JDK-8069122 l10n resource file update for JDK-8068491

Mikael Gerdin, Oracle

Bug Summary
JDK-8059107 G1 Code Root Migration performs poorly
JDK-8059108 G1: Code root hashtable updated incorrectly when evacuation failed
JDK-8058209 Race in G1 card scanning could allow scanning of memory covered by PLABs
JDK-8059106 Refactor Hashtable to allow implementations without rehashing support

Markus Grönlund, Oracle

Bug Summary
JDK-8048875 Ensure ClassLoaderDataGraph::classes_unloading_do only delivers klasses from CLDs with non-reclaimed class loader oops
JDK-8065382 Fixup headers and definitions for INCLUDE_TRACE
JDK-8056049 getProcessCpuLoad() stops working in one process when a different process exits
JDK-8055662 Update mapfile for libjfr

Michael McMahon, Oracle

Bug Summary
JDK-8042622 Check for CRL results in IllegalArgumentException "white space not allowed"
JDK-8062838 jdk.net.Sockets.setOption/getOption does not support IP_TOS

Yumin Qi, Oracle

Bug Summary
JDK-8064841 [TESTBUG] Allow WhiteBox test to access JVM offsets
JDK-8062484 CDS test failed: assert((size % os::vm_allocation_granularity()) == 0) failed when limiting SharedMiscDataSize

Morris Meyer, Oracle

Bug Summary
JDK-8054960 Add iterators to GrowableArray

Mark Sheppard, Oracle

Bug Summary
JDK-8059539 [TEST_BUG] java/net/InetAddress/IPv4Formats.java failed because hello.foo.bar does exist

Sean Mullan, Oracle

Bug Summary
JDK-8050000 XML Signature performance issue caused by unbuffered signature data

Naoto Sato, Oracle

Bug Summary
JDK-8058687 jdk build is broken due to the changeset of JDK-8033370

Masayoshi Okutsu, Independent

Bug Summary
JDK-8054493 DateTimeFormatter "MMMMM" returns English value in Japanese locale
JDK-8060451 No Russian time zones mapping for Windows

Petr Pchelko, Oracle

Bug Summary
JDK-8048551 [macosx] Disable usage of system menu bar if AWT is embedded in FX
JDK-8065376 [macosx] Potential incomplete fix for JDK-8031485
JDK-8046819 [macosx] sigsegv (0Xb) Being Generated When Starting JDev With Voiceover Running
JDK-8050141 [macosx] test java/awt/image/ImageIconHang.java fails with NPE
JDK-8047076 GtkFileDialog strips user inputted filepath
JDK-8048861 Sorting columns in JFileChooser fails with AppContext NPE

Peter Levart, Independent

Bug Summary
JDK-8051918 (process) Merge UNIXProcess.java.bsd & UNIXProcess.java.linux
JDK-8047340 (process) Runtime.exec() fails in Turkish locale

Poonam Bajaj Parhar, Oracle

Bug Summary
JDK-8044406 JVM crash with JDK8 (build 1.8.0-b132) with G1 GC

Philip Race, Oracle

Bug Summary
JDK-8050369 CustomMediaSizeName class matching to standard media is too loose
JDK-8050267 Default printer media is ignored
JDK-8050963 Endless loop in native code of sun.java2d.loops.ScaledBlit
JDK-8064370 PrinterJob NPE when drawing translucent image with null user clip
JDK-8064381 Swing applications not being displayed properly
JDK-8057616 Upgrade JDK to use LittleCMS 2.6
JDK-8056133 xrender: text drawn after setColor(Color.white) is actually black

Paul Sandoz, Oracle

Bug Summary
JDK-8057969 Fork/Join task ForEachOps.ForEachOrderedTask clarifications and minor improvements
JDK-8057659 Improve CompletableFuture resource usage
JDK-8057709 Improve ForkJoin thread throttling
JDK-8066677 Remove network-related seed initialization code in ThreadLocal/SplittableRandom

Rickard Backman, Oracle

Bug Summary
JDK-8058107 compiler/6340864/TestLongVect.java timeout with
JDK-8055699 java/lang/Character/CheckProp test times out

Robert Field, Oracle

Bug Summary
JDK-8046060 Different results of floating point multiplication for lambda code block
JDK-8056051 int[]::clone causes "java.lang.NoClassDefFoundError: Array"
JDK-8058112 Invalid BootstrapMethod for constructor/method reference
JDK-8065057 javac complex method references: revamp and simplify
JDK-8062855 javac NPE or VerifyError for code with constructor reference of inner class
JDK-8065059 JVM cannot access constructor though ::new reference although can call it directly
JDK-8065058 lambda reference to inner class in base class causes LambdaConversionException
JDK-8065060 Lambda: NPE while obtaining method reference through lambda expression
JDK-8065061 VerifyError when running successfully compiled java class

Robert Mckenna, Oracle

Bug Summary
JDK-8068858 $jdk/api/javac/tree contains docs for nashorn
JDK-8051243 (tz) Support tzdata2014a
JDK-8051254 (tz) Support tzdata2014b
JDK-8051265 (tz) Support tzdata2014c
JDK-8051263 [macosx] huge native memory leak in AWTWindow.m
JDK-8051264 [macosx] setDisplayMode crashes
JDK-8051252 [TEST] Child process error stream is not empty!
JDK-8051231 [TEST_BUG] java/awt/DataFlavor/MissedHtmlAndRtfBug/MissedHtmlAndRtfBug.html: test frames remain after test execution
JDK-8066582 [TEST_BUG] java/lang/ProcessBuilder/Basic.java failed with: java.lang.AssertionError: Some tests failed
JDK-8051262 [TEST_BUG] sun/misc/Version/Version.java doesn't understand two-digit HotSpot minor version numbers
JDK-8051289 [TEST_BUG] test/script/basic/JDK-8026161.js fails with java.lang.UnsatisfiedLinkError
JDK-8051248 [TEST_BUG] test/sun/util/calendar/zi/Zoneinfo.java incorrectly calculates raw GMT offset change time
JDK-8072019 AIX port of "8050807: Better performing performance data handling"
JDK-8051251 Better memory allocation for file descriptors greater than 1024 on macosx
JDK-8071382 Calling a @FunctionalInterface from JS leaks internal objects
JDK-8071385 Forgot to add a test model to JDK-8068573
JDK-8054427 Ftp download does not work properly for ftp user without password
JDK-8051256 IM candidate window appears on the South-East corner of the display.
JDK-8051209 Increment hsx 25.11 build to b02 for 8u11-b04
JDK-8051211 Increment hsx 25.11 build to b03 for 8u11-b11
JDK-8054426 java/lang/ProcessBuilder/Basic.java fails intermittently: waitFor took too long
JDK-8065238 javax.naming.NamingException after upgrade to JDK 8
JDK-8068857 jdeps needs a different mechanism to recognize javax.jnlp as supported API
JDK-8051199 new hotspot build - hs25.20-b22
JDK-8071384 POJO setter using [] syntax throws an exception
JDK-8051257 Regression: postscript size increase from 6u18
JDK-8071383 REGRESSION: test/script/external/test262/test/suite/ch11/11.2/11.2.3/S11.2.3_A3_T5.js fails with tip
JDK-8051253 Review comments from 8035897
JDK-8051236 Serial incompatibility in java.util.TreeMap.NavigableSubMap
JDK-8071381 SHA1WithDSA with key > 1024 bits not working
JDK-8051244 TEST_BUG: java/nio/channels/Selector/SelectAfterRead.java fails intermittently
JDK-8054428 Unexpected RuntimeExceptions being thrown by SSLEngine
JDK-8051208 Update hsx version to hs25.11 with b01 for 8u11 release
JDK-8068485 Update references of download.oracle.com to docs.oracle.com in javadoc makefile
JDK-8068495 Update the protocol for references of docs.oracle.com to HTTPS in langtools.
JDK-8068491 Update the protocol for references of docs.oracle.com to HTTPS.
JDK-8051222 With active Securitymanager JAXBContext.newInstance fails

Roland Westrelin, Red Hat

Bug Summary
JDK-8066243 C2's range check smearing allows out of bound array accesses
JDK-8062149 C2: Incorrectly compiled char[] array access crashes JVM
JDK-8055285 Make replace_in_map() on parent maps generic
JDK-8066955 opto/node.hpp:355, assert(i < _max) failed: oob: i=1, _max=1
JDK-8067299 SIGSEGV with +TraceDeoptimization in Deoptimization::print_objects
JDK-8064322 The escape analysis with G1 cause crash assertion src/share/vm/runtime/vframeArray.cpp:94

Roger Riggs, Oracle

Bug Summary
JDK-8057751 CompileNativeLibraries for custom build
JDK-8062635 Enable custom CompileJavaClasses.gmk
JDK-8062639 Enable hook for custom doc generation
JDK-8065397 Remove ExtendedPlatformComponent.java from EXFILES list

Sergey Bylokhov, Amazon

Bug Summary
JDK-8065209 [D3D] The fix for JDK-8029253 should be ported to d3d pipeline
JDK-8066986 [headless] DataTransferer.getInstance throws ClassCastException in headless mode
JDK-8067174 [macosx] "Pinch to zoom" does not work since jdk7
JDK-8065206 [macosx] Aqua LaF should use BI.TYPE_INT_ARGB_PRE for a better performance
JDK-8058308 [macosx] Performance problems with Retina display on Mac OS X
JDK-8065208 [OGL] Incorrect clip is used during sw->surface blit in xor mode
JDK-8066275 [OGL] Metrics for a method choice copying of texture should be improved
JDK-8065207 [TEST_BUG] [macosx] In test, the window does not have time to resize before make a screenshot
JDK-8062444 A switch operator in JFrame.processWindowEvent() should be rewritten
JDK-8057956 api/javax_swing/JScrollPane/indexTGF.html#UpdateUI failed with MotifLookAndFeel on all platform
JDK-8049059 AWT crashes inside CCombinedSegTable::In called from Java_sun_awt_windows_WDefaultFontCharset_canConvert
JDK-8066888 Broken link in java.awt.event Interface KeyListener
JDK-8062441 Cleanup of sun.awt.X11 package
JDK-8057830 Crash in Java2D Queue Flusher, OGLSD_SetScratchSurface
JDK-8066755 CTW CRASH: SIGSEGV in ctw/jre/lib/rt_jar/preloading_1 and ctw/jre/lib/rt_jar/sun_awt_X11_ListHelper
JDK-8066276 Default implementation of DrawImage.renderImageXform() should be improved for d3d/ogl
JDK-8049255 Do not prefer indexed properties
JDK-8062443 Font2DTest demo: unused resource files
JDK-8065210 Incorrect color conversion, when bicubic interpolation is used
JDK-8049256 Introspector ignores indexed part of the property sometimes
JDK-8066754 JFileChooser filter uses .toString() instead of getDescription() for filter text on GTK laf
JDK-8065205 JFrame in full screen mode leaves empty workspace after close
JDK-8065211 JInternalFrame title not antialiased in Nimbus LaF
JDK-8059471 OperationTimedOut exception inside from XToolkit.syncNativeQueue call
JDK-8059470 realSync() doesn't work with Xfce
JDK-8065204 Reference to nonexistant Class in javadoc
JDK-8062446 Some of the input validation in the javasound is too strict
JDK-8062442 Unexpected exceptions and timeouts in SF2 parser code
JDK-8062440 Unexpected exceptions in MID parser code

Volker Simonis, Amazon

Bug Summary
JDK-8058111 Upgrade to LittleCMS 2.6 breaks AIX build

Shanliang Jiang, Oracle

Bug Summary
JDK-8066693 [TEST_BUG] javax/management/monitor/CounterMonitorTest.java hangs
JDK-8058792 [TEST_BUG] javax/management/monitor/GaugeMonitorDeadlockTest.java fails intermittently
JDK-8058484 Transient network problems cause JMX thread to fail silenty

Staffan Larsen, Oracle

Bug Summary
JDK-8058436 [TESTBUG] NMTHelper fails to parse NMT output
JDK-8049246 Add API to start JMX agent from attach framework
JDK-8056173 Attach code should propagate errors in Diagnostic Commands as errors
JDK-8059023 hotspot/test/Makefile should use jtreg script from $JT_HOME/bin/jreg (instead of $JT_HOME/win32/bin/jtreg)
JDK-8058437 java/lang/instrument/RedefineBigClass.sh RetransformBigClass.sh start failing after JDK-8055012
JDK-8056172 Propagate errors from Diagnostic Commands as exceptions in the attach framework

Stuart Marks, Oracle

Bug Summary
JDK-8062451 add java/rmi/server/Unreferenced/finiteGCLatency/FiniteGCLatency.java to problem list

Stefan Karlsson, Oracle

Bug Summary
JDK-8049547 Add a version of CompiledIC_at that doesn't create a new RelocIterator
JDK-8054413 Add flag to turn off class unloading after G1 concurrent mark
JDK-8049552 Add missing Klass::oop_is_instanceClassLoader() function
JDK-8049550 Clean the ExceptionCache in one pass
JDK-8049570 Clean up some virtual fucntions in Space class hierarchy
JDK-8049556 Cleanup ClassLoaderData::is_alive
JDK-8059839 CMS: JVM intermittently crashes with "FreeList of size 258 violates Conservation Principle" assert
JDK-8049575 ConcurrentMark::cleanup leaks BitMaps if VerifyDuringGC is enabled
JDK-8049548 Consolidate all CompiledIC::CompiledIC implementations and move it to compiledIC.cpp
JDK-8066779 Crash in InstanceKlass::clean_method_data when _method is NULL
JDK-8049554 Don't use Handle in java_lang_String::print
JDK-8049567 G1 Block offset table does not need to support generic Space classes
JDK-8049579 G1 Class Unloading after completing a concurrent mark cycle
JDK-8049566 G1 Does not use the save_marks functionality as intended
JDK-8049569 G1 HeapRegionDCTOC does not need to inherit ContiguousSpaceDCTOC
JDK-8049563 G1 HeapRegions can no longer be ContiguousSpaces
JDK-8064556 G1: ParallelGCThreads=0 may cause assert(!MetadataOnStackMark::has_buffer_for_thread(Thread::current())) failed: Should be empty
JDK-8059888 Investigate increased GC remark time after class unloading changes in CRM Fuse
JDK-8049564 Linker error when compiling G1SATBCardTableModRefBS after include order changes
JDK-8049551 Make CMS metadata aware closures applicable for other collectors
JDK-8049856 Metadata Full GCs are not triggered when CMSClassUnloadingEnabled is turned off
JDK-8049580 Minor cleanups after G1 class unloading
JDK-8049571 Move object_iterate_careful down from Space to ContigousSpace and CFLSpace
JDK-8049572 Move object_iterate_mem from Space to CMS since it is only ever used by CMS
JDK-8049574 Remove dead oop_iterate MemRegion variants from SharedHeap, Generation and Space classes
JDK-8049559 Remove the do_code_roots parameter from process_strong_roots
JDK-8049576 Remove the is_scavenging flag to process_strong_roots
JDK-8049561 Remove the usage of StarTask from BufferingOopClosure
JDK-8049549 Remove unused _copy_metadata_obj_cl in G1CopyingKeepAliveClosure
JDK-8065227 Report allocation context stats at end of cleanup
JDK-8055281 Several gc/class_unloading/ tests fail due to missed +UnlockDiagnosticVMOptions flag
JDK-8058481 Test gc/class_unloading/TestCMSClassUnloadingDisabledHWM.java was removed, but TEST.groups still refers to it
JDK-8054414 TEST.groups references missing test: gc/class_unloading/TestCMSClassUnloadingDisabledHWM.java
JDK-8058535 TestCMSClassUnloadingEnabledHWM.java fails with '.*CMS Initial Mark.*' missing from stdout/stderr
JDK-8049560 Use BufferingOopClosure for G1 code root scanning
JDK-8049557 Use CLDClosure instead of CLDToOopClosure in frame::oops_interpreted_do
JDK-8049558 Use process_strong_roots to adjust the StringTable

Sundararajan Athijegannathan, Oracle

Bug Summary
JDK-8062374 [TEST_BUG] [nashorn] regresion test failure with TimeZone
JDK-8057767 [TEST_BUG] ant clean test should not fail if one or more external test suites are missing
JDK-8056068 [TEST_BUG] runExternalJsTest method in test/jdk/nashorn/internal/runtime/ClassFilter.java slows down "ant test"
JDK-8058108 [TEST_BUG] sun/tools/jrunscript/jrunscriptTest.sh start failing: Output of jrunscript -l nashorn differ from expected output
JDK-8055948 [TEST_BUG] Two nashorn tests fail in 8u40 nightly build with ClassNotFoundException
JDK-8056164 Anonymous function statements leak internal function names into global scope
JDK-8060129 AssertionError: __noSuchProperty__ placeholder called from NativeJavaImporter
JDK-8067145 BrowserJSObjectLinker does not handle call on JSObjects
JDK-8062248 Issue with date.setFullYear when time other than midnight
JDK-8050977 Java8 Javascript Nashorn exception: no current Global instance for nashorn
JDK-8055861 JDK-8015969.js is silently failing
JDK-8066278 jdk.nashorn.api.scripting package javadoc should be included in jdk docs
JDK-8055807 JSObject and browser JSObject linkers should provide fallback to call underlying Java methods directly
JDK-8061465 nashorn ant build script should have a sanity target
JDK-8050078 Nashorn ClassFilter Support
JDK-8055803 Nashorn misses linker for netscape.javascript.JSObject instances
JDK-8060755 Nashorn: Generated script class name fails --verify-code for names with special chars
JDK-8058623 Overload resolution ambiguity involving ConsString
JDK-8058454 Users should be able to overwrite "context" and "engine" variables
JDK-8058553 With strict mode, bean property assignment of a non-existent property should result in TypeError
JDK-8055736 Wrong "this" passed to JSObject.eval call

Tobias Hartmann, Oracle

Bug Summary
JDK-8062908 compiler/whitebox/IsMethodCompilableTest.java fails with 'method() is not compilable after 3 iterations'
JDK-8064574 crash while compiling java.lang.ref.Finalizer::runFinalizer
JDK-8062534 Multiple OSR compilations issued for same bci
JDK-8062730 Whitebox.deoptimizeMethod() does not deoptimize all OSR versions of method

Thomas Schatzl, Oracle

Bug Summary
JDK-8056115 [TESTBUG] Fix for 8055098 does not contain unit test
JDK-8051419 [TESTBUG] gc/g1/TestSummarizeRSetStats* tests launch 32bit jvm with UseCompressedOops
JDK-8051705 Aborting marking just before remark results in useless additional clearing of the next mark bitmap
JDK-8055652 Bigapp weblogic+medrec fails to startup after JDK-8038423
JDK-8056255 Bitmap verification sometimes fails after Full GC aborts concurrent marking
JDK-8040672 Change the in_cset_fast_test functionality to use the G1BiasedArray abstraction
JDK-8049591 Clean up code and code duplication in re-diryting cards for verification
JDK-8043766 CMM Testing: 8u40 Decommit auxiliary data structures
JDK-8057126 CMM Testing: an allocated humongous object at the end of the heap should not prevents shrinking the heap
JDK-8052413 CMS/G1 GC: add missing Resource and Handle mark
JDK-8051706 Conservative maximum heap alignment should take vm_allocation_granularity into account
JDK-8054014 Eager reclaim leaves marks of marked but reclaimed objects on the next bitmap
JDK-8051703 Early reclamation of large objects in G1
JDK-8051418 Error message in AdaptiveFreeList::verify_stats is wrong
JDK-8058532 Evacuation failure handling in G1 does not evacuate all objects if -XX:-G1DeferredRSUpdate is set
JDK-8037310 Fix visibility of G1ParScanThreadState members
JDK-8060019 Footprint regressions with JDK-8038423
JDK-8054356 G1 asserts at collection exit with -XX:-G1DeferredRSUpdate
JDK-8049596 G1 crashes when run with -XX:-G1DeferredRSUpdate
JDK-8040670 G1 does not retire allocation buffers after reference processing work
JDK-8056114 G1 does not uncommit within the heap after JDK-8038423
JDK-8051708 G1 Full GC needs to support the case when the very first region is not available
JDK-8055358 G1: Clean up usages of heap_region_containing
JDK-8055400 G1: Decommit memory within the heap
JDK-8049590 G1: High "Other" time most likely due to card redirtying
JDK-8049592 G1: Memory usage calculation uses sizeof(this) instead of sizeof(classname)
JDK-8055357 G1: More useful information in a few assert messages
JDK-8058097 G1: Unnecessary NULL check in G1KeepAliveClosure
JDK-8054921 G1: verify that the marking bitmaps have no marks for objects over TAMS
JDK-8040645 G1CodeRootSet::test fails with assert(_num_chunks_handed_out == 0) failed: No elements must have been handed out yet
JDK-8054549 gc/g1/TestEagerReclaimHumongousRegions2.java timeout
JDK-8052410 gc/g1/TestGCLogMessages.java fail with "[Evacuation Failure' found"
JDK-8057163 Incomplete renaming of variables containing "hrs" to "hrm" related to HeapRegionSeq
JDK-8049593 max_heap_for_compressed_oops() declared with size_t, but defined with uintx
JDK-8055653 Missing include in g1RegionToSpaceMapper.hpp results in unresolved symbol of fastdebug build without precompiled headers
JDK-8049595 Move G1ParScanThreadState into its own files
JDK-8055363 Refactor HeapRegionSeq to manage heap region and auxiliary data
JDK-8056289 Remove dead code in G1 concurrent marking code
JDK-8060155 Remove dead code in g1BlockOffsetTable
JDK-8040674 Remove HeapRegionRemSet::clear_incoming_entry
JDK-8054357 Remove some obsolete code in G1CollectedHeap class
JDK-8056019 Rename HeapRegionSeq to HeapRegionManager
JDK-8049594 Swapped usage of idx_t and bm_word_t types in parMarkBitMap.cpp
JDK-8051704 Use of during_initial_mark_pause() in G1CollectorPolicy::record_collection_pause_end() prevents use of seperate object copy time prediction during marking
JDK-8040673 Use the "next" field to iterate over fine remembered instead of using the hash table
JDK-8056116 WB API should be extended to provide information about size and age of object.

Valerie Peng, Oracle

Bug Summary
JDK-8055081 ReplayCacheTestProc test fails with timeout

Vincent Ryan, Oracle

Bug Summary
JDK-8059350 Debug security logging should print Provider used for each crypto operation
JDK-8059476 Typo in keytool resource file

Vladimir Ivanov, Oracle

Bug Summary
JDK-8058641 [TEST_BUG] Ignore java/lang/invoke/LFCaching/LFGarbageCollectedTest until 8057020 is fixed
JDK-8057657 Annotate LambdaForm parameters with types
JDK-8058640 Bit set computation in MHs.findFirstDupOrDrop/findFirstDrop is broken
JDK-8062080 C2: crash while inlining MethodHandle invocation w/ null receiver
JDK-8066027 C2: EliminateAutoBox regression after 8042786
JDK-8059534 Compiled LambdaForms should inherit from Object to improve class loading performance
JDK-8058357 Convert warning("Thread holding lock at safepoint that vm can block on") to fatal(...)
JDK-8062079 EA: ConnectionGraph::split_unique_types does incorrect scalar replacement
JDK-8066021 Enable full LF sharing by default
JDK-8057654 Extract checks performed during MethodHandle construction into separate methods
JDK-8062072 FILL_ARRAYS and ARRAYS are eagely initialized in MethodHandleImpl
JDK-8058122 Fix deprecation and raw lint warnings in java.lang.invoke
JDK-8058121 Fix raw and unchecked warnings java.util.stream
JDK-8050173 Generalize BMH.copyWith API to all method handles
JDK-8058123 Get rid of char-based descriptions 'J' of basic types
JDK-8066022 Get rid of LambdaForm interpretation
JDK-8058129 Get rid of some package-private methods on arguments in j.l.i.MethodHandle
JDK-8066020 GWT branch frequencies pollution due to LF sharing
JDK-8058128 Improve caching of different invokers
JDK-8056926 Improve caching of GuardWithTest combinator
JDK-8058130 Improve caching of MethodHandle reinvokers
JDK-8050877 Improve code for pairwise argument conversions and value boxing/unboxing
JDK-8057922 Improve LambdaForm sharing by using LambdaFormEditor more extensively
JDK-8058132 Improve MethodType.isCastableTo() & MethodType.isConvertibleTo() checks
JDK-8058124 Improvements and cleanups to bytecode assembly for lambda forms
JDK-8066109 Inlining failure of Number.doubleValue() in JSType.toNumeric() causes 15% peak perf regresion on Box2D
JDK-8050887 Intrinsify constants for default values
JDK-8050884 Intrinsify ValueConversions.identity() functions
JDK-8058358 JSR 292 support for PopFrame has a fragile coupling with DirectMethodHandle
JDK-8058125 JSR292: cache and reuse typed array accessors
JDK-8065969 LambdaForm caches should support eviction
JDK-8057042 LambdaFormEditor: ability to derive new LFs from a base LF
JDK-8058361 LogCompilation: annotate make_not_compilable with compilation level
JDK-8058362 LogCompilation: C1: inlining tree is flat (no depth is stored)
JDK-8058131 Make LambdaForm intrinsics detection more robust
JDK-8066029 MaxNodeLimit and LiveNodeCountInliningCutoff should be increased
JDK-8058359 Method marked w/ @ForceInline isn't inlined with "executed < MinInliningThreshold times" message
JDK-8066891 MHs.explicitCastArguments does incorrect type checks for VarargsCollector
JDK-8058626 Missing part of 8057656 in 8u40 compared to 9
JDK-8058639 Missing some checks during parameter validation
JDK-8058126 Move varargsArray from sun.invoke.util package to java.lang.invoke
JDK-8063127 NPE with explicitCastArguments unboxing null
JDK-8058360 Provide descriptive failure reason for compilation tasks removed for the queue
JDK-8058363 ReplacedNodes dumps it's content to tty
JDK-8066028 SIGSEGV in Metadata::mark_on_stack() while marking metadata in ciEnv
JDK-8058127 Small cleanups in java.lang.invoke code
JDK-8050174 Support overriding of isInvokeSpecial flag in WrappedMember
JDK-8058356 Thread holding lock at safepoint that vm can block on: MethodCompileQueue_lock
JDK-8062081 Wrong ciConstant type for arrays from ConstantPool::_resolved_reference

Vicente Arturo Romero Zaldivar, Oracle

Bug Summary
JDK-8047081 Crash on faulty reduce/lambda
JDK-8044835 Fix timing of varargs access check, per JDK-8016205
JDK-8065407 Inference chokes on wildcard derived from method reference
JDK-8051467 javac, additional test case for JDK-8051402
JDK-8051383 javac, follow-up of fix for JDK-8049305
JDK-8049631 javac, Gen.LVTAssignAnalyzer should be refactored, it shouldn't be a static class
JDK-8051384 javac, incorrect bug id in tests for JDK-8050386
JDK-8059711 javac, the same approach used in fix for JDK-8058708 should be applied to Code.closeAliveRanges
JDK-8051402 javac, type containment should accept that CAP <= ? extends CAP and CAP <= ? super CAP
JDK-8049076 javac, wildcards and generic vararg method invocation not accepted
JDK-8058512 Method reference with generic type creates NPE when compiling
JDK-8065389 Missing compile error in Java 8 mode for Interface.super.field access
JDK-8049512 Should ignore nested lambda bodies during overload resolution

Weijun Wang, Oracle

Bug Summary
JDK-8059490 Add @jdk.Exported to com.sun.jarsigner.ContentSigner API
JDK-8049315 Broken links to jarsigner and keytool docs in java.security package summary
JDK-8048087 Cannot read ccache entry with a realm-less service name
JDK-8055724 File ccache only recognizes Linux and Solaris defaults
JDK-8048696 JDK KRB5 module throws OutOfMemoryError when CCache is corrupt
JDK-8049690 NTLM authentication fail if user specified a different realm
JDK-8060452 Unable to initiate SpNego using a S4U2Proxy GSSCredential (Krb5ProxyCredential)

Yuri Nesterenko, Azul

Bug Summary
JDK-8065108 Nashorn: RuntimeException when run command from js with -scripting on Cygwin
JDK-8059654 Nashorn: Some tests fails on windows with AccessControlException
JDK-8055811 Tests for Nashorn ClassFilter Support

Yong Huang, Oracle

Bug Summary
JDK-8057532 ISO 4217 Amendment #159

Zhengyu Gu, Red Hat

Bug Summary
JDK-8057577 [TESTBUG] Add missing NMT2 tests
JDK-8056291 [TESTBUG] Create NMT (Native Memory Tracking) tests for NMT2
JDK-8056256 [TESTBUG] Disable NMTWithCDS.java test as launcher change has yet promoted
JDK-8057579 [TESTBUG] Enable NMT2 tests after NMT2 is integrated
JDK-8057584 [TESTBUG] Misplaced @key stress prevents MallocSiteHashOverflow.java and MallocStressTest.java tests from running
JDK-8057581 [TESTBUG] runtime/NMT/JcmdDetailDiff.java fails on Windows when there are no debug symbols available
JDK-8057582 [TESTBUG] runtime/NMT/VirtualAllocCommitUncommitRecommit.java fails
JDK-8056292 [TESTBUG] Wrong WhiteBox.java was pushed by JDK-8044140
JDK-8056295 assert at share/vm/services/virtualMemoryTracker.cpp:332 Error: ShouldNotReachHere() when running NMT tests
JDK-8056297 Deadlock during NMT2 shutdown on Windows
JDK-8056296 NMT2 leaks memory
JDK-8056294 NMT2: emptyStack missing in minimal build
JDK-8056293 nsk/jdi/VirtualMachine/exit/exit002 crash with detail tracking on (NMT2)
JDK-8057578 Re-enable warning for incompatible java launcher
JDK-8057583 runtime/NMT/CommandLineEmptyArgument.java fails
JDK-8056290 Scalable Native Memory Tracking development