PUSHES REPORT: 8u60

This report shows who pushed the backports to the given release. This usually shows who did the backporting, testing, and review work.

Report generated: Wed Dec 01 02:20:57 CET 2021

Distribution by priority

Count Priority
24 P1
81 P2
301 P3
192 P4
10 P5

Distribution by components

Count Component
608 100% Total
203 33.4% core-libs
106 17.4% core-libs/jdk.nashorn
14 2.3% core-libs/java.lang.invoke
12 2.0% core-libs/java.util:i18n
10 1.6% core-libs/java.net
10 1.6% core-libs
7 1.2% core-libs/javax.script
7 1.2% core-libs/java.time
7 1.2% core-libs/java.lang
5 0.8% core-libs/java.util.concurrent
4 0.7% core-libs/java.util
3 0.5% core-libs/javax.sql
3 0.5% core-libs/java.nio
3 0.5% core-libs/javax.naming
2 0.3% core-libs/java.nio.charsets
2 0.3% core-libs/java.text
2 0.3% core-libs/java.util.jar
1 0.2% core-libs/java.sql
1 0.2% core-libs/java.util.stream
1 0.2% core-libs/java.util.logging
1 0.2% core-libs/java.math
1 0.2% core-libs/java.io
1 0.2% core-libs/java.lang:reflect
142 23.4% hotspot
49 8.1% hotspot/gc
40 6.6% hotspot/compiler
29 4.8% hotspot/runtime
15 2.5% hotspot/svc
8 1.3% hotspot/jvmti
1 0.2% hotspot/test
99 16.3% client-libs
39 6.4% client-libs/java.awt
26 4.3% client-libs/javax.swing
15 2.5% client-libs/2d
9 1.5% client-libs
3 0.5% client-libs/javax.imageio
3 0.5% client-libs/javax.accessibility
1 0.2% client-libs/javax.sound
1 0.2% client-libs/demo
1 0.2% client-libs/java.beans
1 0.2% client-libs/java.awt:i18n
59 9.7% infrastructure
56 9.2% infrastructure/build
3 0.5% infrastructure
29 4.8% tools
20 3.3% tools/javac
7 1.2% tools
2 0.3% tools/launcher
26 4.3% security-libs
11 1.8% security-libs/java.security
6 1.0% security-libs/javax.net.ssl
3 0.5% security-libs/javax.crypto:pkcs11
2 0.3% security-libs/javax.crypto
2 0.3% security-libs/org.ietf.jgss:krb5
1 0.2% security-libs/org.ietf.jgss
1 0.2% security-libs
19 3.1% core-svc
10 1.6% core-svc/java.lang.management
5 0.8% core-svc/javax.management
3 0.5% core-svc/debugger
1 0.2% core-svc/tools
15 2.5% xml
8 1.3% xml/jaxp
4 0.7% xml/jaxb
2 0.3% xml/javax.xml.parsers
1 0.2% xml/jax-ws
5 0.8% deploy
3 0.5% deploy/webstart
1 0.2% deploy/plugin
1 0.2% deploy
4 0.7% globalization
3 0.5% globalization/translation
1 0.2% globalization
3 0.5% other-libs
3 0.5% other-libs/corba
2 0.3% embedded
1 0.2% embedded/hotspot
1 0.2% embedded
1 0.2% docs
1 0.2% docs
1 0.2% performance
1 0.2% performance

Distribution by affiliation

Count Committer
608 100% Total
411 67.6% Oracle
57 9.4% Sean Coffey
46 7.6% Sundararajan Athijegannathan
31 5.1% Hannes Wallnoefer
24 3.9% Thomas Schatzl
17 2.8% David Holmes
16 2.6% Aleksej Efimov
14 2.3% Robert Mckenna
11 1.8% Vladimir Kozlov
10 1.6% Roger Riggs
10 1.6% Alexander Zvegintsev
10 1.6% Anton Nashatyrev
10 1.6% Vladimir Ivanov
9 1.5% Dean Long
9 1.5% Jan Lahoda
8 1.3% Kevin Walls
8 1.3% Tobias Hartmann
8 1.3% Philip Race
7 1.2% Paul Sandoz
7 1.2% Serguei Spitsyn
6 1.0% Markus Grönlund
6 1.0% Bengt Rutisson
5 0.8% Stefan Johansson
5 0.8% Poonam Bajaj Parhar
4 0.7% Svetlana Steuck
4 0.7% Mikhail Cherkasov
4 0.7% Vicente Arturo Romero Zaldivar
4 0.7% Igor Veresov
4 0.7% Shanliang Jiang
4 0.7% Igor Ignatyev
3 0.5% Maurizio Cimadamore
3 0.5% Erik Joelsson
3 0.5% Harold Seigel
3 0.5% Mandy Chung
3 0.5% Jesper Wilhelmsson
3 0.5% Staffan Larsen
2 0.3% Mark Sheppard
2 0.3% Brian Burkhalter
2 0.3% Vincent Ryan
2 0.3% Anthony Scarpino
2 0.3% Daniel Fuchs
2 0.3% Stefan Karlsson
2 0.3% Dan Smith
2 0.3% David Dehaven
2 0.3% Coleen Phillimore
2 0.3% Dmitry Markov
1 0.2% Michael Fang
1 0.2% Xue-Lei Fan
1 0.2% Christian Tornqvist
1 0.2% Valerie Peng
1 0.2% Daniel Daugherty
1 0.2% Pete Brunet
1 0.2% Erik Helin
1 0.2% Nils Eliasson
1 0.2% Magnus Ihse Bursie
1 0.2% David Buck
1 0.2% Alexey Ivanov
1 0.2% David Chase
1 0.2% Joe Darcy
1 0.2% Anton Litvinov
1 0.2% Yumin Qi
82 13.5% Independent
38 6.3% Attila Szegedi
26 4.3% Alejandro Murillo
8 1.3% Abhijit Saha
6 1.0% Masayoshi Okutsu
1 0.2% Marcus Lagergren
1 0.2% Dmitriy Samersoff
1 0.2% Xueming Shen
1 0.2% Vadim Pakhnushev
34 5.6% Amazon
29 4.8% Sergey Bylokhov
5 0.8% Volker Simonis
25 4.1% Azul
13 2.1% Konstantin Shefov
7 1.2% Andrew Brygin
4 0.7% Dmitry Cherepanov
1 0.2% Yuri Nesterenko
20 3.3% Google
20 3.3% Ivan Gerasimov
12 2.0% DataDog
12 2.0% Jaroslav Bachorík
12 2.0% Red Hat
8 1.3% Roland Westrelin
2 0.3% Mario Torre
1 0.2% Omair Majid
1 0.2% Andrew Hughes
10 1.6% BellSoft
10 1.6% Alexandr Scherbatiy
1 0.2% SAP
1 0.2% Goetz Lindenmaier
1 0.2% VMWare
1 0.2% Kumar Srinivasan

Chronological push log:

Days Ago Committer Affiliation Bug Summary
2311 Robert Mckenna Oracle JDK-8132931 [macosx] Crash during JMC or JavaFX execution when NSApplication is controlled by SWT or JavaFX libraries
2331 Abhijit Saha Independent JDK-8131239 [TEST_BUG] two lib/testlibrary tests are failing with "Error. failed to clean up files after test" with jtreg 4.1 b12
2331 Abhijit Saha Independent JDK-8131211 Increment the build value to b03 for hs25.51 in 8u51-b15
2331 Abhijit Saha Independent JDK-8131209 Increment the build value to b02 for hs25.51 in 8u51-b10
2331 Abhijit Saha Independent JDK-8131207 Increment minor version of HSx for 8u51 and initialize the build number
2332 Alejandro Murillo Independent JDK-8130352 JVM times out with vdbench on SPARC M7-16
2332 Alejandro Murillo Independent JDK-8129939 new hotspot build - hs25.60-b23
2332 Alejandro Murillo Independent JDK-8129586 nmethod related crash in CMS
2332 Robert Mckenna Oracle JDK-8081590 The CDS classlist needs to be updated for 8u60
2335 Robert Mckenna Oracle JDK-8130913 Wrong changes were pushed with 8068886
2345 Svetlana Steuck Oracle JDK-8130217 (tz) Support tzdata2015e
2345 Svetlana Steuck Oracle JDK-8130216 [TEST_BUG] test/javax/xml/ws/8046817/GenerateEnumSchema.java creates files in test.src
2346 Svetlana Steuck Oracle JDK-8079361 Broken Localization Strings (XMLSchemaMessages_de.properties)
2349 Paul Sandoz Oracle JDK-8129945 Terminal operation properties should not be back-propagated to upstream operations
2350 Ivan Gerasimov Google JDK-8129859 sun/security/mscapi/ShortRSAKey1024.sh fails intermittently
2350 Attila Szegedi Independent JDK-8129856 Java adapters with class-level overrides should preserve variable arity constructors
2350 Sean Coffey Oracle JDK-8087336 Java 8 cannot load its cacerts in FIPS. no such provider: SunEC
2351 Ivan Gerasimov Google JDK-8080524 [TESTBUG] java/lang/Class/getDeclaredField/FieldSetAccessibleTest.java fails on compact profiles due to unsatisfied dependencies in jsse.jar
2351 Vladimir Ivanov Oracle JDK-8085964 GWT can be marked non-compilable due to deopt count pollution
2351 Alexander Zvegintsev Oracle JDK-8129788 [PIT] Test closed/java/awt/FullScreen/DisplayMode/CycleDMImage.java switches Linux to the single device mode
2351 Alexander Zvegintsev Oracle JDK-8129787 Deadlock with multimonitor fullscreen windows.
2351 Konstantin Shefov Azul JDK-8129784 javax/net/ssl/ciphersuites/DisabledAlgorithms.java fails intermittently
2351 David Holmes Oracle JDK-8129570 AARCH64: testlibrary does not support AArch64
2352 Sean Coffey Oracle JDK-8129583 Empty optional parameters of LDAP query are not interpreted as empty
2352 Konstantin Shefov Azul JDK-8129580 LFMultiThreadCachingTest.java failed with ConcurrentModificationException
2352 Roger Riggs Oracle JDK-8129577 GetVersionEx in java.base/windows/native/libjava/java_props_md.c might not get correct Windows version
2356 Alejandro Murillo Independent JDK-8129314 new hotspot build - hs25.60-b22
2356 Sundararajan Athijegannathan Oracle JDK-8129327 nasgen prototype, instance member count calculation is wrong
2356 Sundararajan Athijegannathan Oracle JDK-8129326 Convert Scope from interface to class
2357 Konstantin Shefov Azul JDK-8129222 TEST_BUG: Tests java/lang/invoke/LFCaching fail when run with -Xcomp option
2357 Konstantin Shefov Azul JDK-8129124 Several java/lang/invoke tests fail due to exhausted code cache
2357 Konstantin Shefov Azul JDK-8129118 java/lang/invoke/MethodHandles/CatchExceptionTest.java fails intermittently
2357 Konstantin Shefov Azul JDK-8129113 [TESTBUG] Timeout java/lang/invoke/MethodHandles/CatchExceptionTest.java
2357 Paul Sandoz Oracle JDK-8129105 LinkedTransferQueue.spliterator can report LTQ.Node object, not T
2358 Andrew Hughes Red Hat JDK-8129095 8077982 giflib upgrade breaks system giflib builds with earlier versions
2358 Omair Majid Red Hat JDK-8121932 SetupNativeCompilation ignores CFLAGS_release for cpp files
2358 Poonam Bajaj Parhar Oracle JDK-8087149 VM hangs in C2Compiler
2358 Roger Riggs Oracle JDK-8114857 java.time package javadoc typos
2358 Roger Riggs Oracle JDK-8114856 java.time javadoc error in DateTimeFormatter::parsedLeapSecond
2358 Roger Riggs Oracle JDK-8114855 Fix typos, errors and Javadoc differences in java.time
2358 Roger Riggs Oracle JDK-8062803 'principal' should be 'principle' in java.time package description
2358 Roger Riggs Oracle JDK-8062796 java.time.format.DateTimeFormatter error in API doc example
2358 Sundararajan Athijegannathan Oracle JDK-8114845 obj."prop" and obj.'prop' should result in SyntaxError
2358 Erik Helin Oracle JDK-8087200 Code heap does not use large pages
2359 Philip Race Oracle JDK-8104577 Remove debugging message from Font2DTest demo
2359 Sundararajan Athijegannathan Oracle JDK-8098846 Global scope is not accessible with indirect load call
2359 Hannes Wallnoefer Oracle JDK-8098832 Strict eval throws ClassCastException with large scripts
2360 Svetlana Steuck Oracle JDK-8068886 IDEA IntelliJ crashes in objc_msgSend when an accessibility tool is enabled
2360 Aleksej Efimov Oracle JDK-8098782 DateFormat for Singapore/English locale (en_SG) is M/d/yy instead of d/M/yy
2360 Hannes Wallnoefer Oracle JDK-8098583 eval within a 'with' leaks definitions into global scope
2360 Vicente Arturo Romero Zaldivar Oracle JDK-8068547 remove unnecessary complexity in Flow and Bits, after JDK-8064857
2360 Volker Simonis Amazon JDK-8098572 EmptyStackException at startup if running with extended or unsupported charset
2360 Alexander Zvegintsev Oracle JDK-8098563 OperationTimedOut exception inside from XToolkit.syncNativeQueue call on Ubuntu 15.04
2360 Staffan Larsen Oracle JDK-8098544 com/sun/jdi tests are failing with "Error. failed to clean up files after test" with jtreg 4.1 b12
2363 Sundararajan Athijegannathan Oracle JDK-8087332 Indirect evals should be strict with -strict option
2363 Sean Coffey Oracle JDK-8087308 Setting IP_TOS on java.net sockets not working on unix
2363 Alejandro Murillo Independent JDK-8087238 new hotspot build - hs25.60-b21
2364 Michael Fang Oracle JDK-8083601 jdk8u60 l10n resource file translation update 2
2364 Igor Ignatyev Oracle JDK-8066885 make DeoptimizeALot dependent on number of threads
2364 Robert Mckenna Oracle JDK-8080957 Coding regression in HKSCS charsets
2364 Robert Mckenna Oracle JDK-8087204 Inet4AddressImpl regression caused by JDK-7180557
2364 Sundararajan Athijegannathan Oracle JDK-8087194 regression: apply on $EXEC fails with ClassCastException
2364 Jan Lahoda Oracle JDK-8087116 NullPointerException compiling annotation values that have bodies
2364 David Holmes Oracle JDK-8087178 Enable hotspot builds on 4.x Linux kernels
2364 David Holmes Oracle JDK-8087177 JVM fastdebug build compiled with GCC 5 asserts with "widen increases"
2365 Roland Westrelin Red Hat JDK-8087148 compiler/eliminateAutobox/6934604/TestIntBoxing.java assert(p_f->Opcode() == Op_IfFalse) failed
2365 Jesper Wilhelmsson Oracle JDK-8086111 BACKOUT - metaspace/shrink_grow/CompressedClassSpaceSize fails with OOM: Compressed class space
2365 Markus Grönlund Oracle JDK-8081789 JVM crashes in JNI if toString is declared as an interface method
2365 Markus Grönlund Oracle JDK-8081296 HotSpot fails to wrap Exceptions from invokedynamic in a BootstrapMethodError
2365 Aleksej Efimov Oracle JDK-8081839 ArrayIndexOutOfBoundsException throws in UTF8Reader of SAXParser
2365 Jan Lahoda Oracle JDK-8085883 Java compiler performance degradation jdk1.7 vs. jdk1.6 should be amended
2366 Sundararajan Athijegannathan Oracle JDK-8086051 Add compiler error tests when syntax extensions are used with --no-syntax-extensions option
2366 Hannes Wallnoefer Oracle JDK-8086050 add $EXECV command to Nashorn scripting mode
2366 Hannes Wallnoefer Oracle JDK-8086049 address Javadoc warnings in Nashorn source code
2367 Sean Coffey Oracle JDK-8085935 OpenJDK7 returns incorrect TrueType font metrics
2367 Sundararajan Athijegannathan Oracle JDK-8085971 add autoimports sample script to easily explore Java classes in interactive mode
2367 Sean Coffey Oracle JDK-8077734 StackOverflowError during PolicyFile lookup
2367 Sundararajan Athijegannathan Oracle JDK-8085969 Nashorn -nse option causes parse error on anonymous function definition
2367 Andrew Brygin Azul JDK-8085956 OGL text renderer: gamma lut cleanup
2370 Philip Race Oracle JDK-8085925 [macosx] Native font lookup uses family+style, not full name/postscript name
2370 Alejandro Murillo Independent JDK-8085869 new hotspot build - hs25.60-b20
2370 Alexandr Scherbatiy BellSoft JDK-8085922 Dragged events for extra mouse buttons (4,5,6) are not generated on JSplitPane
2370 Konstantin Shefov Azul JDK-8085920 BaseRowSet returns the wrong default value for escape processing
2370 Konstantin Shefov Azul JDK-8085918 RowSetWarning does not correctly chain warnings
2370 Konstantin Shefov Azul JDK-8085916 Add RowSetMetaDataImpl Tests and add column range validation to isdefinitlyWritable
2370 Yuri Nesterenko Azul JDK-8077866 [TESTBUG] Some of java.lang tests cannot be run on compact profiles 1, 2
2370 Sundararajan Athijegannathan Oracle JDK-8085915 Return value of Objects.requireNonNull call can be used
2370 Konstantin Shefov Azul JDK-8085902 LFGarbageCollectedTest.java fails with OOME: "GC overhead limit exceeded"
2370 Sundararajan Athijegannathan Oracle JDK-8085896 Nashorn $ENV.PWD is originally undefined
2370 Jan Lahoda Oracle JDK-8081451 Using Lambda Expression with name clash results in ClassFormatError
2370 Sundararajan Athijegannathan Oracle JDK-8085888 Missing final modifier in method parameters (nashorn code convention)
2371 Sergey Bylokhov Amazon JDK-8085862 [macosx] The text of the TextArea is not wrapped at word boundaries
2371 Sergey Bylokhov Amazon JDK-8085861 Tremendous memory usage by JTextArea
2371 Sergey Bylokhov Amazon JDK-8085860 [OGL] "java.lang.InternalError: not implemented yet" during the blit of VI to VI in xor mode
2371 Sergey Bylokhov Amazon JDK-8085859 [macosx] Unused code in LWCToolkit.m
2371 Sergey Bylokhov Amazon JDK-8085857 OutOfMemoryError: RepaintManager doesn't clean up cache of volatile images
2371 Sergey Bylokhov Amazon JDK-8085856 JavaDoc for JSpinner contains errors
2371 Sergey Bylokhov Amazon JDK-8085855 Reg test: java/awt/Component/isLightweightCrash/StubPeerCrash.java fails
2371 Sergey Bylokhov Amazon JDK-8085854 Typo in JInternalFrame setDefaultCloseOperation() doc (WindowClosing --> internalFrameClosing)
2371 Sergey Bylokhov Amazon JDK-8073871 GUI perfomance are very slow compared java 1.6.0_45
2371 Anton Nashatyrev Oracle JDK-8085812 Deadlock in awt clipboard
2371 Roland Westrelin Red Hat JDK-8085808 Unsafe load can loose control dependency and cause crash
2371 Roland Westrelin Red Hat JDK-8085807 volatile double accesses are not explicitly atomic in C2
2372 Hannes Wallnoefer Oracle JDK-8081838 Fuzzing bug: Parser error on optimistic recompilation
2372 Mikhail Cherkasov Oracle JDK-8081826 Drawing deviates when validate() is invoked on java.awt.ScrollPane
2372 Attila Szegedi Independent JDK-8081825 JSONListAdapter should delegate its [[DefaultValue]] to wrapped object
2372 Attila Szegedi Independent JDK-8081808 JSON-friendly wrapper for objects
2372 Hannes Wallnoefer Oracle JDK-8066220 Fuzzing bug: MethodHandle bug (Object,Object) != (boolean)Object
2372 David Holmes Oracle JDK-8081781 SystemTap does not work when JDK is compiled with GCC 5
2373 Attila Szegedi Independent JDK-8081711 reduce dependency of Nashorn tests on external components
2373 Attila Szegedi Independent JDK-8081710 transparently download testng.jar for Nashorn testing
2373 Attila Szegedi Independent JDK-8081709 fix Nashorn ant externals command
2373 Jan Lahoda Oracle JDK-8080624 Deeply chained expressions + several overloads + unnecessary inference result in excessive compile times.
2373 Andrew Brygin Azul JDK-8050962 [macosx] LCD Rendering hints seems not working without FRACTIONALMETRICS=ON
2373 Sundararajan Athijegannathan Oracle JDK-8081685 rename ScriptingFunctions.tokenizeCommandLine
2373 Sundararajan Athijegannathan Oracle JDK-8081684 erroneous dot file generated from Nashorn --print-code
2373 Attila Szegedi Independent JDK-8081679 Fuzzing bug: And jdk.nashorn.internal.runtime.Source#byteToCharArray: Detection for UTF-32LE does not work because it has the same prefix as UTF-16LE.
2373 Sundararajan Athijegannathan Oracle JDK-8081673 engine.eval call from a java method which was called from a previous engine.eval results in wrong ScriptContext being used.
2374 Vicente Arturo Romero Zaldivar Oracle JDK-8073436 Redundant CONSTANT_Class entry not generated for inlined constant
2374 Attila Szegedi Independent JDK-8081606 ListAdapter throws NPE when adding/removing elements outside of JS context
2374 Tobias Hartmann Oracle JDK-8081502 8068945 changes break building the zero JVM variant
2374 Tobias Hartmann Oracle JDK-8075823 Allow ADLC register class to depend on runtime conditions also for cisc-spillable classes
2374 Tobias Hartmann Oracle JDK-8072465 Use RBP register as proper frame pointer in JIT compiled code on x86
2375 Aleksej Efimov Oracle JDK-8081561 getNodeValue should return 'null' value for Element nodes
2376 Ivan Gerasimov Google JDK-8081553 ./jndi/ldap/Connection.java needs to avoid spurious wakeup
2377 Alejandro Murillo Independent JDK-8081436 new hotspot build - hs25.60-b19
2377 Konstantin Shefov Azul JDK-8081479 Backport JDBC tests from JDK 9 from test/java/sql and test/javax/sql to JDK 8u.
2378 Roger Riggs Oracle JDK-8081432 java/time/test/java/time/format/TestZoneTextPrinterParser.java fails by timeout on slow device
2378 Roger Riggs Oracle JDK-8081419 langtools/test/Makefile should not use OS-specific jtreg binary
2378 Anton Nashatyrev Oracle JDK-8081418 JButtons stay pressed after they have lost focus if you use the mouse wheel
2378 Alexey Ivanov Oracle JDK-8080764 No mnemonics on Open and Save buttons in JFileChooser
2378 Roland Westrelin Red Hat JDK-8081054 Integer.toString(int value) sometimes throws NPE
2378 Roland Westrelin Red Hat JDK-8080660 C2: CmpU nodes can end up with wrong type information
2378 Sundararajan Athijegannathan Oracle JDK-8081355 Test missed for the fix of JDK-8007456 backport to jdk8u-dev
2379 Sundararajan Athijegannathan Oracle JDK-8081333 jjs "nashorn.args" system property is not effective when script arguments are passed
2379 Attila Szegedi Independent JDK-8081303 ListAdapter should take advantage of JSObject
2379 Vadim Pakhnushev Independent JDK-8081302 Could not enable D3D pipeline
2379 Sundararajan Athijegannathan Oracle JDK-8081299 Nashorn test framework @argument does not handle quoted strings
2380 Pete Brunet Oracle JDK-8079828 Java version applet hangs with Voice over turned on
2380 Attila Szegedi Independent JDK-8081075 Allow conversion of native arrays to Queue and Collection
2380 Maurizio Cimadamore Oracle JDK-8081020 Inference failure with nested invocation
2381 David Holmes Oracle JDK-8077620 [TESTBUG] Some of the hotspot tests require at least compact profile 3
2381 Vincent Ryan Oracle JDK-8062552 Support keystore type detection for JKS and PKCS12 keystores
2384 Poonam Bajaj Parhar Oracle JDK-8080412 Excessive checked JNI warnings from Java startup
2384 Stefan Johansson Oracle JDK-8080784 G1: jmap -heap reports the wrong number of regions
2384 Alejandro Murillo Independent JDK-8080804 new hotspot build - hs25.60-b18
2385 Mandy Chung Oracle JDK-8080891 jdeps shows "not found" if target class has no reference other than its own package
2385 Mandy Chung Oracle JDK-8080815 Update 8u jdeps list of internal APIs
2385 Sundararajan Athijegannathan Oracle JDK-8080887 jdk.nashorn.internal.runtime.arrays.IntArrayData.convert assertion
2385 Sundararajan Athijegannathan Oracle JDK-8080874 delete of bound Java method property results in crash
2385 Robert Mckenna Oracle JDK-8080872 LoginContext Subject ignored by jdk8 sun.net.www.protocol.http.HttpURLConnection
2385 Robert Mckenna Oracle JDK-8080871 javac does not recognize '*.java' as file if '-J' option is specified
2385 Sundararajan Athijegannathan Oracle JDK-8080851 Javadoc warnings in Global.java after lazy initialization
2385 Sundararajan Athijegannathan Oracle JDK-8080850 ant javadoc target is broken
2385 Ivan Gerasimov Google JDK-8080637 dns_lookup_realm should be false by default
2386 Philip Race Oracle JDK-8080810 Path2D storage growth algorithms should be less linear
2386 Philip Race Oracle JDK-8080794 Path2D copy constructors and clone method propagate size of arrays from source path
2386 Mikhail Cherkasov Oracle JDK-8066985 Java Webstart downloading packed files can result in Timezone set to UTC
2386 Paul Sandoz Oracle JDK-8080623 CPU overhead in FJ due to spinning in awaitWork
2386 Volker Simonis Amazon JDK-8080749 PPC64: Fix wrong rotate instructions in the .ad file
2386 Sundararajan Athijegannathan Oracle JDK-8080748 The spec on javax.script.Compilable contains a typo and confusing inconsistency
2387 Mark Sheppard Oracle JDK-8075763 RMI-IIOP communication fails when ConcurrentHashMap is passed to remote method
2387 Jesper Wilhelmsson Oracle JDK-8076077 gc/g1/TestShrinkAuxiliaryData15.java fails with java.lang.RuntimeException: heap decommit failed - after > before
2388 Ivan Gerasimov Google JDK-8080513 Missing space on a boundary of concatenated strings
2388 Vladimir Ivanov Oracle JDK-8078523 LambdaForm.prepare() does unnecessary work for cached LambdaForms
2388 Vladimir Ivanov Oracle JDK-8078291 Customize adapted MethodHandle in MH.invoke() case
2388 Sundararajan Athijegannathan Oracle JDK-8080606 SimpleScriptContext used by NashornScriptEngine doesn't completely complies to the spec regarding exception throwing
2388 Thomas Schatzl Oracle JDK-8078854 verify_no_cset_oops found reclaimed humongous object in SATB buffer
2388 Thomas Schatzl Oracle JDK-8078853 SATB apply_closure_to_completed_buffer should have closure argument
2388 Thomas Schatzl Oracle JDK-8078852 SATB queue pre-filter verify found reclaimed humongous object
2388 Thomas Schatzl Oracle JDK-8078850 Eagerly reclaimed humongous objects left on mark stack
2388 Thomas Schatzl Oracle JDK-8078849 Simplify deal_with_reference
2388 Thomas Schatzl Oracle JDK-8078848 Early reclaim of large objects that are referenced by a few objects
2388 Thomas Schatzl Oracle JDK-8075215 SATB buffer processing found reclaimed humongous object
2391 Hannes Wallnoefer Oracle JDK-8080509 jjs scripting: need way to quote $EXEC command arguments to protect spaces
2391 Hannes Wallnoefer Oracle JDK-8080508 Javascript for-in loop returned extra keys
2391 Hannes Wallnoefer Oracle JDK-8080507 Instance properties with getters returning wrong values
2391 Anton Litvinov Oracle JDK-8078391 mouse wheel scroll closes combobox popup
2391 Attila Szegedi Independent JDK-8080497 Don't create impossible converters for ScriptObjectMirror
2391 Attila Szegedi Independent JDK-8080496 Code generator emits an extra POP for discarded boolean logical operation
2391 Attila Szegedi Independent JDK-8080495 Need to adjust test output for 8067931
2391 Attila Szegedi Independent JDK-8080494 Improve error message when with statement is passed a POJO
2391 Alexander Zvegintsev Oracle JDK-8075675 Cannot input Japanese in JTextField on RedHat Linux
2391 Hannes Wallnoefer Oracle JDK-8080471 fix usage of replace and file separator in Nashorn tests
2391 Alejandro Murillo Independent JDK-8080458 new hotspot build - hs25.60-b17
2391 Attila Szegedi Independent JDK-8080473 Enforce best practices for Node token API usage
2391 Yumin Qi Oracle JDK-8080468 Bogus -Xcheck:jni warning for SIG_INT action for SIGINT in JVM started from non-interactive shell
2392 Hannes Wallnoefer Oracle JDK-8080414 Very long function names break codegen
2392 Hannes Wallnoefer Oracle JDK-8080391 Fuzzing bug: Object.prototype.toLocaleString(0)
2392 Hannes Wallnoefer Oracle JDK-8080390 Fuzzing bug: length valueOf bug
2392 Hannes Wallnoefer Oracle JDK-8080389 Fuzzing bug: parameter counts differ in TypeConverterFactory
2392 Tobias Hartmann Oracle JDK-8080383 assert(((ABS(iv_adjustment_in_bytes) % elt_size) == 0)) fails in superword.cpp
2392 Tobias Hartmann Oracle JDK-8080143 Crash in PhaseIdealLoop with "assert(!had_error) failed: bad dominance"
2392 Tobias Hartmann Oracle JDK-8079126 C2's superword optimization causes unaligned memory accesses
2393 Vladimir Kozlov Oracle JDK-8080314 8011102 changes may cause incorrect results.
2393 Hannes Wallnoefer Oracle JDK-8080303 use path separator setting consistently in Nashorn project properties
2393 Sundararajan Athijegannathan Oracle JDK-8080292 BrowserJSObjectLinker should give priority to beans linker for property get/set
2393 Sundararajan Athijegannathan Oracle JDK-8080291 Wrong 'this' bound to eval call within a function when caller's 'this' is a Java object
2393 Sundararajan Athijegannathan Oracle JDK-8080271 too strong assertion on function expression names
2393 Sundararajan Athijegannathan Oracle JDK-8080262 Array.prototype.sort throws IAE on inconsistent comparison
2394 Abhijit Saha Independent JDK-8076149 java.lang.IllegalArgumentException: aContainer is not a focus cycle root of aComponent
2394 Jaroslav Bachorík DataDog JDK-8080222 nsk/jdi/ExceptionEvent/_itself_/exevent006 and exevent008 tests fail with InvocationTargetException
2394 Konstantin Shefov Azul JDK-8078339 [TEST_BUG] java/awt/SplashScreen/MultiResolutionSplash/MultiResolutionSplashTest.java fails
2394 Masayoshi Okutsu Independent JDK-8055359 Optimization for locale resources loading isn't working
2394 Sundararajan Athijegannathan Oracle JDK-8080139 -d option should dump script source as well
2395 Philip Race Oracle JDK-8078338 Upgrade JDK to use LittleCMS 2.7
2395 Aleksej Efimov Oracle JDK-8079777 AIOBE occurs when accessing to document function in extended function in JAXP
2398 Alejandro Murillo Independent JDK-8079686 new hotspot build - hs25.60-b16
2398 Sundararajan Athijegannathan Oracle JDK-8079826 Misleading error message when explicit signature constructor is called with wrong arguments
2399 Paul Sandoz Oracle JDK-8079701 Missed submissions in ForkJoinPool
2399 Aleksej Efimov Oracle JDK-8079669 (tz) Support tzdata2015d
2399 Sean Coffey Oracle JDK-8079653 Incorrect property name documented in CORBA InputStream API
2400 Alexandr Scherbatiy BellSoft JDK-8079509 Incorrect paint of JProgressBar in Nimbus LF
2400 Alexandr Scherbatiy BellSoft JDK-8074863 System tray icon title freezes java
2400 Attila Szegedi Independent JDK-8079508 Eliminate dead code around Nashorn code generator
2400 Attila Szegedi Independent JDK-8079472 Optimistic rewrite in object literal causes ArrayIndexOutOfBoundsException
2400 Attila Szegedi Independent JDK-8079471 Add tests for the basic failure of try/finally compilation
2400 Hannes Wallnoefer Oracle JDK-8079469 Persistent code cache should support more configurations
2400 Hannes Wallnoefer Oracle JDK-8079468 Nashorn crashes when attempting to start TypeScript compiler
2401 Vincent Ryan Oracle JDK-8079387 NullPointerException in PKCS#12 Keystore in PKCS12KeyStore.java
2401 Ivan Gerasimov Google JDK-8079346 SPNEGO auth fails if client proposes MS krb5 OID
2401 Sean Coffey Oracle JDK-8079243 The crash reporting URL listed by javac needs to be updated
2401 Erik Joelsson Oracle JDK-8079352 Add support for Cygwin 2.0
2401 David Holmes Oracle JDK-8079324 BSD build failures due to undefined macros
2402 Coleen Phillimore Oracle JDK-8079297 AllocateHeap() and ReallocateHeap() should be inlined.
2404 Coleen Phillimore Oracle JDK-8079237 [TESTBUG] test/runtime/lambda-features/InvokespecialInterface.java test has unrecognized option
2405 Serguei Spitsyn Oracle JDK-8078728 Popping a stack frame after exception breakpoint sets last method param to exception
2405 Maurizio Cimadamore Oracle JDK-8078258 Javac erroneously uses instantiated signatures when merging abstract most-specific methods
2405 Alejandro Murillo Independent JDK-8079189 new hotspot build - hs25.60-b15
2406 Vladimir Kozlov Oracle JDK-8079064 Extend WhiteBox API with methods that check monitor state and force safepoint
2406 Vladimir Kozlov Oracle JDK-8065977 compiler/rtm/ tests fail due to monitor deflation at safepoint synchronization
2406 Vladimir Kozlov Oracle JDK-8065976 c.o.j.t.Platform::isX86 and isX64 may simultaneously return true
2406 Philip Race Oracle JDK-8079190 CloseTTFontFileFunc callback should be removed
2406 Alexander Zvegintsev Oracle JDK-8077983 GIFLIB upgrade
2406 Andrew Brygin Azul JDK-8079144 Java's system LnF on OS X: editable JComboBoxes are being rendered incorrectly
2406 Serguei Spitsyn Oracle JDK-8079137 more performance issues in class redefinition
2406 Alexandr Scherbatiy BellSoft JDK-8062920 The output's 'Page-n' footer does not show completely.
2406 Alexandr Scherbatiy BellSoft JDK-8079132 [macosx] Drag image of TransferHandler does not honor MultiResolutionImage
2406 Goetz Lindenmaier SAP JDK-8079119 ppc: pass thread to throw_AbstractMethodError
2407 David Holmes Oracle JDK-8079114 [Linux] Replace syscall use in os::fork_and_exec with glibc fork() and execve()
2407 Philip Race Oracle JDK-8078129 [embedded] java.awt.GraphicsDevice.get/setDisplayMode behavior is incorrect when no display is present
2407 Vladimir Ivanov Oracle JDK-8074549 Never-taken branches cause repeated deopts in MHs.GWT case
2407 Vladimir Ivanov Oracle JDK-8068934 C2: uncommon trap w/ Reason_speculate_class_check causes performance regression due to continuous deoptimizations
2407 Vladimir Ivanov Oracle JDK-8065967 C2: inlining failure due to access checks being too strict
2407 Vladimir Ivanov Oracle JDK-8077720 DMH LFs should be customizeable
2407 Vladimir Ivanov Oracle JDK-8071925 CountingWrapper.asType() is broken
2407 Vladimir Ivanov Oracle JDK-8071764 Customize LambdaForms which are invoked using MH.invoke/invokeExact
2407 Vladimir Ivanov Oracle JDK-8064326 Never taken branches should be pruned when GWT LambdaForms are shared
2407 Alexander Zvegintsev Oracle JDK-8078620 Fullscreen mode is not working properly on Xorg
2408 David Buck Oracle JDK-8078746 Replace fatal() with vm_exit_during_initialization() when an incorrect class is found on the bootclasspath
2409 Aleksej Efimov Oracle JDK-8078284 Performance degradation observed with TimeZone Benchmark
2409 Robert Mckenna Oracle JDK-8078702 IPv6 Nameservers in resolv.conf throws NumberFormatException
2409 Igor Ignatyev Oracle JDK-8078698 [TESTBUG] remove explicit set build flavor from hotspot/test/compiler/* tests
2409 Hannes Wallnoefer Oracle JDK-8078697 Eager code generation fails for earley boyer with split threshold set to 1000
2409 Hannes Wallnoefer Oracle JDK-8078696 Function with same body not reparsed after SyntaxError
2409 Sergey Bylokhov Amazon JDK-8078695 JMenuBar looks bad under retina
2409 Sergey Bylokhov Amazon JDK-8078694 [macosx] Initialization of Cocoa hangs if CoreAudio was initialized before
2409 Sergey Bylokhov Amazon JDK-8078693 Dead/outdated links in Javadoc of package java.beans
2409 Sergey Bylokhov Amazon JDK-8078692 BufferedImage::getPropertyNames() always returns null
2409 Sergey Bylokhov Amazon JDK-8078691 [macosx] Label shortening via " ... " broken when String contains combining diaeresis
2409 Sergey Bylokhov Amazon JDK-8078690 Pending String deadlocks UIDefaults
2409 Sergey Bylokhov Amazon JDK-8078688 Animated icon is not visible by click on menu
2409 Sergey Bylokhov Amazon JDK-8078687 example in JFormattedTextField API docs instantiates abstract class
2409 Sergey Bylokhov Amazon JDK-8078686 Attempting to remove help menu from java.awt.MenuBar throws NullPointerException
2409 Sergey Bylokhov Amazon JDK-8078685 Swing's Threading Policy example does not compile
2409 Sergey Bylokhov Amazon JDK-8078684 Some Swing classes violate encapsulation by returning internal Insets
2409 Sergey Bylokhov Amazon JDK-8078683 JDesktopPane,JFileChooser violate encapsulation by returning internal Dimensions
2409 Sergey Bylokhov Amazon JDK-8078682 link back to self in javadoc JTextArea.replaceRange()
2409 Sergey Bylokhov Amazon JDK-8078681 JPGWriter does not throw UnsupportedException when canWriteSequence retuns false
2409 Sergey Bylokhov Amazon JDK-8078680 abort flag is not cleared for every write operation for JPEG ImageWriter
2409 Sergey Bylokhov Amazon JDK-8075620 java.awt.Checkbox.setState() call causes ItemEvent to be filed
2409 Sergey Bylokhov Amazon JDK-8046415 NullPointerException and no event received when clipboard data flavor changes
2409 Jaroslav Bachorík DataDog JDK-8077953 [TEST_BUG] com/sun/management/OperatingSystemMXBean/TestTotalSwap.java Compilation failed after JDK-8077387
2412 Andrew Brygin Azul JDK-8078677 IME Composition Window is displayed on incorrect position
2412 Thomas Schatzl Oracle JDK-8078375 [TESTBUG] gc/g1/TestLargePageUseForAuxMemory.java specifies wrong library path
2412 Staffan Larsen Oracle JDK-8078591 jdb eval java.util.Arrays.asList(array) shows inconsistent behaviour
2412 David Holmes Oracle JDK-8078581 Support running regression tests using jtreg_tests+TESTDIRS from top level
2413 Aleksej Efimov Oracle JDK-8076591 schema1.xsd has wrong content. Sequence of the enum values has been changed
2413 Jesper Wilhelmsson Oracle JDK-8076102 [TESTBUG] Conflicting GC combinations in hotspot tests
2413 Anton Nashatyrev Oracle JDK-8078522 [macosx] NPE when attempting to get image from toolkit
2413 Jan Lahoda Oracle JDK-8077258 Wrong LineNumberTable for default constructors
2414 Ivan Gerasimov Google JDK-8078446 [TEST_BUG] sun/security/pkcs11/sslecc/ClientJSSEServerJSSE.java fails with BindException
2414 Sundararajan Athijegannathan Oracle JDK-8078384 Test execution blocker: Nashorn testsuite failing due to compile error in jdk/nashorn/api/scripting/test/ScriptEngineTest.java
2414 Alejandro Murillo Independent JDK-8078270 new hotspot build - hs25.60-b14
2414 Robert Mckenna Oracle JDK-8078390 Support ISO 4217 "Current funds codes" table (A.2)
2415 Thomas Schatzl Oracle JDK-8078251 TracePageSizes output reports wrong page size on Windows with G1
2415 Thomas Schatzl Oracle JDK-8078250 SPECjvm2008-Derby -2.7% performance regression on Solaris-X64 starting with 9-b29
2416 Andrew Brygin Azul JDK-8077606 ArrayIndexOutOfBoundsException in javax.swing.text.html.parser.ContentModel.first()
2416 Thomas Schatzl Oracle JDK-8078170 VirtualSpace does not use large pages
2416 Thomas Schatzl Oracle JDK-8078169 Add method to WhiteBox to get vm pagesize.
2416 Thomas Schatzl Oracle JDK-8078168 TestParallelHeapSizeFlags fails with unexpected heap size
2416 Thomas Schatzl Oracle JDK-8078167 G1 ignores AlwaysPreTouch
2416 Thomas Schatzl Oracle JDK-8078166 os::commit_memory on Solaris uses aligment_hint as page size
2416 Masayoshi Okutsu Independent JDK-8077922 (tz) TimeZone.getDefault() call returns incorrect value in Windows terminal session
2417 Ivan Gerasimov Google JDK-8077344 CipherInputStream throws BadPaddingException if stream is not fully read
2419 Dan Smith Oracle JDK-8077914 Check varargs access against inferred signature
2419 Dan Smith Oracle JDK-8077913 Varargs access check mishandles capture variables
2419 Alejandro Murillo Independent JDK-8078043 new hotspot build - hs25.60-b13
2420 Hannes Wallnoefer Oracle JDK-8078012 Undeclared globals in eval code should not be handled as fast scope
2420 Hannes Wallnoefer Oracle JDK-8067215 Disable dual fields when not using optimistic types
2420 Harold Seigel Oracle JDK-8047382 hotspot build failed with gcc version Red Hat 4.4.6-4
2421 Xue-Lei Fan Oracle JDK-8077220 Disable RC4 cipher suites
2421 Bengt Rutisson Oracle JDK-8062517 ParNew promotion failed is serialized on a lock
2422 Abhijit Saha Independent JDK-8077758 Increment the build value to b02 for hs25.45 in 8u45-b08
2422 Abhijit Saha Independent JDK-8077754 Increment minor version of HSx for 8u45 and initialize the build number
2422 Igor Veresov Oracle JDK-8077752 SPARC PICL causes significantly longer startup times
2422 Dmitry Markov Oracle JDK-8076996 Focus doesn't move when pressing Shift + Tab keys
2422 Shanliang Jiang Oracle JDK-8077684 [TEST_BUG] javax/management/remote/mandatory/notif/NotSerializableNotifTest.java fails due to Port already in use: 2468
2423 Ivan Gerasimov Google JDK-8074036 KeychainStore requires non-null password to be supplied when retrieving a private key
2423 Stefan Karlsson Oracle JDK-8076297 Wrong volatile qualifier for field ClassLoaderDataGraphKlassIteratorAtomic::_next_klass
2423 Mikhail Cherkasov Oracle JDK-8077625 Frame is not created on the specified GraphicsDevice with two monitors
2426 Alejandro Murillo Independent JDK-8077424 new hotspot build - hs25.60-b12
2426 Dmitriy Samersoff Independent JDK-8077507 serviceability/sa/jmap-hashcode/Test8028623.java fails with AssertionFailure: can not get class data for java/lang/UNIXProcess$Platform$$Lambda
2426 Roland Westrelin Red Hat JDK-8076152 Compilation of constant array containing different sub classes crashes the JVM
2426 Jaroslav Bachorík DataDog JDK-8077388 Race condition in java/lang/management/ThreadMXBean/AllThreadIds.java
2426 Jaroslav Bachorík DataDog JDK-8077387 [TEST_BUG] com/sun/management/OperatingSystemMXBean/TestTotalSwap.sh fails on OS X with exit code 2
2426 Jaroslav Bachorík DataDog JDK-8077386 [TEST_BUG] java/lang/management/ThreadMXBean/SynchronizationStatistics.java intermittently failed with NPE
2426 Jaroslav Bachorík DataDog JDK-8077385 Timeout in LowMemoryTest.java
2427 Aleksej Efimov Oracle JDK-8077366 JCK test api/xsl/conf/string/string17 starts failing after JDK-8074297
2427 Aleksej Efimov Oracle JDK-8076589 substring in XSLT returns wrong character if string contains supplementary chars
2427 Roland Westrelin Red Hat JDK-8069278 assert(fm == NULL || fm->method_holder() == _participants[n]) failed: sanity
2427 Markus Grönlund Oracle JDK-8077343 Event based tracing locks to rank as leafs where possible
2427 Markus Grönlund Oracle JDK-8077256 Refactor VM GC operations caused by allocation failure
2427 Markus Grönlund Oracle JDK-8077249 Clean up around VM_GC_Operations
2427 Markus Grönlund Oracle JDK-8065331 Add trace events for failed allocations
2427 Aleksej Efimov Oracle JDK-8076586 Bad error message on parsing illegal character in XML attribute
2428 Serguei Spitsyn Oracle JDK-8076435 "java.lang.NullPointerException: Method name is null" from StackTraceElement.
2428 Aleksej Efimov Oracle JDK-8077299 (tz) Support tzdata2015b
2428 Stefan Karlsson Oracle JDK-8077278 Verification in ClassLoaderData::is_alive is too slow
2429 Xueming Shen Independent JDK-8077093 getNextEntry throws ArrayIndexOutOfBoundsException when unzipping file
2429 Sundararajan Athijegannathan Oracle JDK-8077115 Several nashorn tests failing
2430 Sundararajan Athijegannathan Oracle JDK-8077005 nashorn tests should avoid using package names used by nashorn sources
2433 Alejandro Murillo Independent JDK-8076760 new hotspot build - hs25.60-b11
2433 Sean Coffey Oracle JDK-8076756 deadlock in java/io/PrintStream when verbose java.security.debug flags are set
2434 Jan Lahoda Oracle JDK-8076595 Debugger has no access to outer variables inside Lambda
2434 Jan Lahoda Oracle JDK-8076594 javac -parameters does not emit parameter names for lambda expressions
2434 Jan Lahoda Oracle JDK-8076058 Debugger doesn't show variables *outside* lambda
2435 Vladimir Kozlov Oracle JDK-8076512 ZERO variant build is broken
2435 Volker Simonis Amazon JDK-8076481 GraphicsEnvironment.getHeadlessProperty() does not work for AIX
2436 Thomas Schatzl Oracle JDK-8076354 assert(is_available(index)) failed in G1 cset
2436 Alexandr Scherbatiy BellSoft JDK-8076183 Open Source Java Access Bridge - Create Patch for JEP C127 8055831
2437 Anton Nashatyrev Oracle JDK-8076250 [macosx] Clipboard does not work with 3rd parties Clipboard Managers
2437 Anton Nashatyrev Oracle JDK-8076244 [macosx] Menu items are appearing on top of other windows
2437 Alexandr Scherbatiy BellSoft JDK-8076242 No Horizontal Mouse Wheel Support In BasicScrollPaneUI
2437 Alexandr Scherbatiy BellSoft JDK-8075268 [macosx] The fix for JDK-8043869 should be reworked
2437 Alexandr Scherbatiy BellSoft JDK-8076232 -spash: can't be combined with -xStartOnFirstThread since JDK 7
2437 Masayoshi Okutsu Independent JDK-8076219 SimpleDateFormat formatting of "LLLL" in English is incorrect; should be identical to "MMMM"
2440 Alejandro Murillo Independent JDK-8076191 new hotspot build - hs25.60-b10
2440 Hannes Wallnoefer Oracle JDK-8075366 Slow scope access to global let/const does not work
2440 Hannes Wallnoefer Oracle JDK-8075231 Typed array setters are very slow when index exceeds capacity
2440 Alexander Zvegintsev Oracle JDK-8074974 [PIT] NPE in DnD tests apparently because of the fix to JDK-8061636
2440 Alexander Zvegintsev Oracle JDK-8069163 Fix for JDK-7079254 changes behavior of MouseListener, MouseMotionListener
2440 Alexander Zvegintsev Oracle JDK-8076174 OS X build broken by reference to XToolkit
2440 Alexander Zvegintsev Oracle JDK-8074109 Switching to GTK L&F on-the-fly leads to X Window System error RenderBadPicture
2440 Serguei Spitsyn Oracle JDK-8076150 JSR 292: assert(type() == T_OBJECT) failed: type check
2440 David Holmes Oracle JDK-8076144 move closed jvm.cfg files out of open repo
2440 Harold Seigel Oracle JDK-8075949 Class verifier accepts an invalid class file
2441 Hannes Wallnoefer Oracle JDK-8076101 Regex matching causes java.lang.ArrayIndexOutOfBoundsException: 64
2441 Hannes Wallnoefer Oracle JDK-8076100 toNumber(String) accepts illegal characters
2441 Hannes Wallnoefer Oracle JDK-8076099 Threads spinning infinitely in WeakHashMap.get running test262parallel
2441 Bengt Rutisson Oracle JDK-8076085 Refactor strong root processing in order to allow G1 to evolve separately from GenCollectedHeap
2441 Bengt Rutisson Oracle JDK-8076084 Refactor the G1GCPhaseTime logging to make it easier to add new phases
2441 Bengt Rutisson Oracle JDK-8076083 G1 iterates over JNIHandles two times
2441 Bengt Rutisson Oracle JDK-8076082 Remove temporary G1UseParallelRSetUpdating and G1UseParallelRSetScanning flags
2441 Bengt Rutisson Oracle JDK-8072805 Per-phase timing measurements for strong roots processing
2441 Thomas Schatzl Oracle JDK-8076067 Clean up G1 remembered set oop iteration
2441 Thomas Schatzl Oracle JDK-8076066 When iterating over a card, G1 often iterates over much more references than are contained in the card
2441 Thomas Schatzl Oracle JDK-8076065 Decrease Hot Card Cache Lock contention
2441 Thomas Schatzl Oracle JDK-8076064 Hot card cache flush chunk size too coarse grained
2441 Thomas Schatzl Oracle JDK-8076063 Object copy time regressions after JDK-8031323 and JDK-8057536
2441 Masayoshi Okutsu Independent JDK-8076036 DateFormat in german locale returns wrong value for month march
2442 Vladimir Kozlov Oracle JDK-8076030 AIX: clean-up HotSpot make files
2442 Vladimir Kozlov Oracle JDK-8076029 AIX: link libjvm.so with -bernotok to detect missing symbols at build time and suppress warning 1540-1639
2442 Thomas Schatzl Oracle JDK-8075952 Refactor G1s usage of save_marks and reduce related races
2442 Sundararajan Athijegannathan Oracle JDK-8075941 Global scope should be initialized lazily
2443 Thomas Schatzl Oracle JDK-8075812 Improved handling of age during object copy in G1
2443 Thomas Schatzl Oracle JDK-8075811 G1TraceReclaimDeadHumongousObjectsAtYoungGC only prints humongous object liveness output when there is at least one candidate humongous object
2443 Sundararajan Athijegannathan Oracle JDK-8075801 Startup time: Port shell.js to Java
2443 Harold Seigel Oracle JDK-8075265 JVM stuck in infinite loop during verification
2444 Robert Mckenna Oracle JDK-8074944 Only the first DNSName entry is checked for endpoint identification
2444 Andrew Brygin Azul JDK-8075693 ImageInputStreamImpl.readShort/readInt do not behave correctly at EOF
2447 Alejandro Murillo Independent JDK-8075615 new hotspot build - hs25.60-b09
2447 Sean Coffey Oracle JDK-8075626 keystore and truststore debug output could be much better
2447 Sean Coffey Oracle JDK-8074418 Improve tracing for java.security.debug=certpath
2447 Robert Mckenna Oracle JDK-8075627 (sctp) com/sun/nio/sctp/SctpMultiChannel/SendFailed.java fails on Solaris only
2447 Vicente Arturo Romero Zaldivar Oracle JDK-8069546 javac, shouldn't check nested stuck lambdas during overload resolution
2447 Sean Coffey Oracle JDK-8061483 Memory leak in ProtectionDomain cache
2447 Sundararajan Athijegannathan Oracle JDK-8075614 jjs exits even when non-daemon threads are still active
2447 Roland Westrelin Red Hat JDK-8074986 C2 code generator can replace -0.0f with +0.0f on Linux
2448 Ivan Gerasimov Google JDK-8075325 To interpret case-insensitive string locale independently
2448 Erik Joelsson Oracle JDK-8075501 Update jtreg bin location in configure
2448 Andrew Brygin Azul JDK-8074303 Gtk: call to UIManager.getSystemLookAndFeelClassName() leads to crash
2448 David Dehaven Oracle JDK-8075400 Cannot build hotspot in jdk8u on OSX 10.10 (Yosemite)
2449 Ivan Gerasimov Google JDK-8075444 jdk/test/Makefile references (to be removed) win32 directory in jtreg
2449 Volker Simonis Amazon JDK-8071687 AIX port of "8039173: Propagate errors from Diagnostic Commands as exceptions in the attach framework"
2450 Serguei Spitsyn Oracle JDK-8075406 the constantPoolCacheOopDesc::adjust_method_entries() used in RedefineClasses does not scale
2450 Serguei Spitsyn Oracle JDK-8075405 jvmtiRedefineClasses.cpp: guarantee(false) failed: OLD and/or OBSOLETE method(s) found
2450 Marcus Lagergren Independent JDK-8075316 Fuzzing bug: new ArrayBuffer() throws exception
2450 David Holmes Oracle JDK-8073511 File leak in MemNotifyThread::start() in hotspot.src.os.linux.vm.os_linux.cpp
2450 David Holmes Oracle JDK-8027914 Client JVM silently exit with fail exit code when running in compact(1,2) with options -Dcom.sun.management and -XX:+ManagementServer
2451 Anton Nashatyrev Oracle JDK-8075258 press-and-hold input method for accented characters works incorrectly on OS X
2454 Alejandro Murillo Independent JDK-8075144 new hotspot build - hs25.60-b08
2454 Alejandro Murillo Independent JDK-8075158 Make jdk8u60 the default release on jdk8u repos
2454 Ivan Gerasimov Google JDK-8075124 Table's field width in "Use" page generated by javadoc with '-s' is unbalanced
2455 Dean Long Oracle JDK-8075096 AARCH64: better handling of aarch64- triples
2455 Sergey Bylokhov Amazon JDK-8075028 [macosx] Mac 10.10: Application run with splash screen has focus issues
2455 Hannes Wallnoefer Oracle JDK-8075079 Add tests for JSON parsing of numeric keys
2456 Poonam Bajaj Parhar Oracle JDK-8072804 -Xcheck:jni improvements to exception checking and excessive local refs
2456 Dean Long Oracle JDK-8075016 Regression in configure due to JDK-8069057
2456 Dean Long Oracle JDK-8075015 Make sure configure is run by bash
2456 Dean Long Oracle JDK-8075014 AARCH64: Top-level JDK changes
2456 Attila Szegedi Independent JDK-8075005 More aggressive value discarding
2456 Attila Szegedi Independent JDK-8075004 Static analysis of IfNode should consider terminating branches
2456 Attila Szegedi Independent JDK-8075003 Canonicalize "is a JS string" tests
2456 Attila Szegedi Independent JDK-8075002 Can't compare Java enums to strings
2456 Attila Szegedi Independent JDK-8035712 Investigate if RuntimeCallSite linkage can be removed
2456 Masayoshi Okutsu Independent JDK-8074951 Long-form date format incorrect month string for Finnish locale
2457 David Holmes Oracle JDK-8074814 Fix for 8030115 breaks build on Windows and Solaris
2457 Tobias Hartmann Oracle JDK-8073966 hotspot, "impossible" assertion failure
2458 Anton Nashatyrev Oracle JDK-8074759 [macosx] Mouse events are captured by the wrong menu in OS X
2458 Kevin Walls Oracle JDK-8074692 Infinite loop reading types during jmap attach.
2458 Staffan Larsen Oracle JDK-8072617 Hide lambda proxy frames in stacktraces
2458 Magnus Ihse Bursie Oracle JDK-8074685 Create custom hook for running after AC_OUTPUT
2460 Daniel Daugherty Oracle JDK-8074597 perfMemory_solaris.cpp failing to compile with "Error: dd_fd is not a member of DIR."
2461 Alejandro Murillo Independent JDK-8074550 new hotspot build - hs25.60-b07
2462 Attila Szegedi Independent JDK-8074525 Nashorn bug retrieving array property after key string concatenation
2462 Kevin Walls Oracle JDK-8074489 Test fails with java.security.AccessControlException: access denied ("java.security.SecurityPermission" "getDomainCombiner")
2462 Kevin Walls Oracle JDK-8074488 JavaSecurityAccess.doIntersectionPrivilege() drops the information about the domain combiner of the stack ACC
2463 Dean Long Oracle JDK-8074010 followup to 8072383
2463 Nils Eliasson Oracle JDK-8064796 'Full GC' events miss date stamp information occasionally
2463 Alexandr Scherbatiy BellSoft JDK-8068240 [macosx] Combo box consuming ENTER key events
2464 Kumar Srinivasan VMWare JDK-8073972 Deprecate Multi-Version Java Launcher (mJRE) for JDK8
2464 Daniel Fuchs Oracle JDK-8074125 Add SerializedLogRecord test to jdk8u
2464 Erik Joelsson Oracle JDK-8074300 ZERO_ARCHDEF incorrectly defined for PPC/PPC64 architectures
2465 Brian Burkhalter Oracle JDK-8074143 (so) Socket adapter sendUrgentData throws IllegalBlockingMode when channel configured non-blocking
2465 Stefan Johansson Oracle JDK-8074094 Simplify ArgumentsExt and remove unneeded functionallity
2465 Masayoshi Okutsu Independent JDK-8073448 Unpredictable timezone on Windows when OS's timezone is not found in tzmappings
2465 Hannes Wallnoefer Oracle JDK-8074086 const re-assignment should not reported as a "early error"
2468 Alejandro Murillo Independent JDK-8074038 new hotspot build - hs25.60-b06
2468 Ivan Gerasimov Google JDK-8074044 [TEST_BUG] TimSortStackSize2.java: test cleanup: make test run with single argument
2468 Mario Torre Red Hat JDK-8074017 Java application menu misbehaves when running multiple screen stacked vertically
2468 Sundararajan Athijegannathan Oracle JDK-8074030 Indirect eval fails when used as an element of an array or as a property of an object
2468 Dmitry Cherepanov Azul JDK-8071564 Focus lost in applet when browser window is minimized and restored
2469 Sean Coffey Oracle JDK-8073980 l10n resource file update for JDK-8068491
2469 Sean Coffey Oracle JDK-8073949 IBM1166 Locale Request for Kazakh characters
2469 Christian Tornqvist Oracle JDK-8071657 JDI ObjectReferenceImpl.invokeMethod() validation fails for virtual invocations of method with declaring type being an interface
2470 Sean Coffey Oracle JDK-8073873 Socket impls should ignore unsupported proxy types rather than throwing
2470 David Holmes Oracle JDK-8073841 Zero: Atomic::xchg and Atomic::xchg_ptr need full memory barrier
2470 David Holmes Oracle JDK-8073840 Zero builds fails after JDK-6898462
2470 David Holmes Oracle JDK-8073839 Zero+PPC64: Stack overflow when running Maven
2471 Dean Long Oracle JDK-8073816 resolve conflicts between open and closed ports
2472 Sean Coffey Oracle JDK-8073576 ZipEntry/JarEntry.setCreation/LastAccessTime(null) don't throw NPE as specified
2472 David Chase Oracle JDK-8073610 Locks need better debug-printing support
2475 Alejandro Murillo Independent JDK-8073514 new hotspot build - hs25.60-b05
2476 Igor Veresov Oracle JDK-8072915 Nondeterministic wrong answer on arithmetic
2477 Poonam Bajaj Parhar Oracle JDK-8073410 jstack not working on core files
2477 Poonam Bajaj Parhar Oracle JDK-8065302 SA update
2477 Ivan Gerasimov Google JDK-8071454 (process) Child is terminated when parent's console is closed [win]
2478 Anton Nashatyrev Oracle JDK-8073348 Toolkit.getScreenInsets() doesn't update if insets change
2478 Robert Mckenna Oracle JDK-8073345 (sctp) InternalError when receiving SendFailedNotification
2478 Ivan Gerasimov Google JDK-8073324 Tune test and document TimSort runs stack size increase
2478 Ivan Gerasimov Google JDK-8073323 TimSort fails with ArrayIndexOutOfBoundsException on worst case long arrays
2478 Stefan Johansson Oracle JDK-8073316 JVM crashes during GC on various asserts which checks that HeapWord ptr is an oop
2479 Anthony Scarpino Oracle JDK-8073153 Improve GHASH performance
2479 Anton Nashatyrev Oracle JDK-8073233 [macosx] Jtree icon painted over label when scrollbars present in window
2482 Anthony Scarpino Oracle JDK-8073112 sun/security/pkcs11/rsa/TestKeyPairGenerator.java failed in aurora
2482 Brian Burkhalter Oracle JDK-8073151 java.math.BigDecimal.divide(BigDecimal, RoundingMode) produces incorrect result
2482 Jan Lahoda Oracle JDK-8069190 Compiler may generate wrong InnerClasses attribute for static enum reference
2483 Abhijit Saha Independent JDK-8069268 JComponent.AccessibleJComponent.addPropertyListeners adds exponential listeners
2483 Sean Coffey Oracle JDK-8069187 [TEST_BUG] Test sun/security/tools/keytool/ListKeychainStore.sh fails on Mac
2483 Stefan Johansson Oracle JDK-8073075 jmap reports unexpected used/free size of concurrent mark-sweep generation
2483 Attila Szegedi Independent JDK-8073071 Arrays.asList results in ClassCastException with a JS array
2483 Attila Szegedi Independent JDK-8073070 New compiler warning after JDK-8067139
2484 Dean Long Oracle JDK-8072985 support new PTRACE_GETREGSET
2484 Robert Mckenna Oracle JDK-8072948 Failed Java web start via IPv6 (Java7u71 or later)
2486 Sundararajan Athijegannathan Oracle JDK-8072756 Add regression tests for 8071678 and 8071594
2488 Dean Long Oracle JDK-8072739 C1: Incorrect argument type used for SharedRuntime::OSR_migration_end in LIRGenerator::do_Goto
2489 Alejandro Murillo Independent JDK-8072697 new hotspot build - hs25.60-b04
2489 Aleksej Efimov Oracle JDK-8072696 (tz) Support tzdata2015a
2489 Sundararajan Athijegannathan Oracle JDK-8072695 NashornScriptEngine returns javax.script.ScriptContext instance with insonsistent get/remove methods behavior for undefined attributes
2489 Sundararajan Athijegannathan Oracle JDK-8072672 nashorn should not use obj.getClass() for null checks
2490 Serguei Spitsyn Oracle JDK-8072661 jvmtiStringPrimitiveCallback should not be invoked when string value is null
2490 Hannes Wallnoefer Oracle JDK-8072636 Test for JDK-8068872 fails in tip
2490 Hannes Wallnoefer Oracle JDK-8072635 Various performance issues parsing JSON
2490 Hannes Wallnoefer Oracle JDK-8068872 Nashorn JSON.parse drops numeric keys
2491 Roger Riggs Oracle JDK-8072419 java/lang/ProcessBuilder/Basic.java: waitFor didn't take long enough
2491 Roger Riggs Oracle JDK-8067376 Object.wait(ms, ns) timeout returns early
2491 Paul Sandoz Oracle JDK-8072469 Race condition in ThenComposeExceptionTest.java
2491 David Holmes Oracle JDK-8072057 Minimal VM is broken for ARM fastdebug
2492 Vladimir Kozlov Oracle JDK-8072446 assert(!failing()) failed: Must not have pending failure. Reason is: out of memory
2492 Vladimir Kozlov Oracle JDK-8072437 [TESTBUG] Aix support in hotspot jtreg tests
2492 Dmitry Markov Oracle JDK-8072386 Incorrect Exception message from java.awt.Desktop.open()
2492 Dean Long Oracle JDK-8072389 build_vm_def.sh not working correctly for new build cross compile
2496 Attila Szegedi Independent JDK-8071991 Build errors in 8u-dev after backporting JDK-8067139 and JDK-8066232
2496 Attila Szegedi Independent JDK-8071988 Finally blocks inlined incorrectly
2496 Attila Szegedi Independent JDK-8071987 Fuzzing bug: AssertionError when defining local variable in Block
2497 Philip Race Oracle JDK-8071937 [solaris] libfontmanager should be linked against headless awt library
2497 Robert Mckenna Oracle JDK-8071920 (sctp) Possible race initializing native IDs
2497 Sean Coffey Oracle JDK-8071917 HTTP Tunnel connection to NTLM proxy reauthenticates instead of using keep-alive
2498 Kevin Walls Oracle JDK-8071849 Memory leak in JvmtiEnv::GetConstantPool
2499 Igor Veresov Oracle JDK-8071708 assert(!_reg_node[reg_lo] || edge_from_to(_reg_node[reg_lo],def)) failed: after block local scheduling
2499 Volker Simonis Amazon JDK-8071697 AIX port of "8050807: Better performing performance data handling"
2500 Aleksej Efimov Oracle JDK-8071608 XSL: wrong answer from substring() function
2500 Aleksej Efimov Oracle JDK-8071607 XSL: Run-time internal error in 'substring()'
2500 Aleksej Efimov Oracle JDK-8071606 JDK 8 schemagen tool does not generate xsd files for enum types
2500 Konstantin Shefov Azul JDK-8071587 Adjust java/lang/invoke/LFCaching/LFGarbageCollectedTest.java for recent changes in java.lang.invoke
2500 Sean Coffey Oracle JDK-8071586 Use private static final char[0] for empty Strings
2500 Ivan Gerasimov Google JDK-8071332 StringIndexOutOfBoundsException while reading krb5.conf
2502 Alejandro Murillo Independent JDK-8071500 new hotspot build - hs25.60-b03
2503 Kevin Walls Oracle JDK-8071508 Agent NullPointerException when rmi.port in use
2503 Dmitry Cherepanov Azul JDK-8068456 Revert project file accidentally pushed
2503 Dmitry Cherepanov Azul JDK-8068187 Fix Xcode project
2503 Dmitry Cherepanov Azul JDK-8067456 Xcode javaws Project to Debug Native Code
2504 Mikhail Cherkasov Oracle JDK-8071380 Deadlock in awt/logging apparently introduced by 8019623
2504 Paul Sandoz Oracle JDK-8069302 Deprecate Unsafe monitor methods in JDK 8u release
2505 Sean Coffey Oracle JDK-8071270 javac, follow-up of fix for JDK-8049305
2505 Sean Coffey Oracle JDK-8071258 (tz) Support tzdata2014j
2505 Sean Coffey Oracle JDK-8071255 Sorting columns in JFileChooser fails with AppContext NPE
2505 Sean Coffey Oracle JDK-8071254 Currency update needed for ISO 4217 Amendment #159
2505 Sean Coffey Oracle JDK-8071253 [headless] JPopupMenu creation in headless mode with JDK9b23 causes NPE
2505 Sean Coffey Oracle JDK-8071252 ByteArrayOutputStream capacity should be maximal array size permitted by VM
2505 Sean Coffey Oracle JDK-8071250 (tz) Support tzdata2014i
2505 Sean Coffey Oracle JDK-8071242 [macosx] Endless loop in EDT on Mac
2505 Sean Coffey Oracle JDK-8071240 Several test failing after update to tzdata2014g
2505 Sean Coffey Oracle JDK-8071239 (tz) Support tzdata2014g
2505 Sean Coffey Oracle JDK-8071233 [macosx] Large JTable cell results in a OutOfMemoryException
2505 Sean Coffey Oracle JDK-8071231 [macosx] Language specific keys does not work in applets when opened outside the browser
2505 Sean Coffey Oracle JDK-8071225 JAX-WS handles wrongly xsd:any arguments for Web services
2505 Sean Coffey Oracle JDK-8071224 JAXB not preserving formatting for xsd:any Mixed content
2505 Sean Coffey Oracle JDK-8071223 XML parser returns corrupt attribute value
2505 Sean Coffey Oracle JDK-8071222 NPE seen in XMLDocumentFragmentScannerImpl.setProperty since 7u40b33
2505 Sean Coffey Oracle JDK-8071197 new hotspot build - hs25.40-b25
2505 Sean Coffey Oracle JDK-8071195 Increment the build value to b07 for hs25.31 in 8u31-b11
2505 Sean Coffey Oracle JDK-8071193 Increment the build value to b06 for hs25.31 in 8u31-b10
2505 Sean Coffey Oracle JDK-8071192 Update the Crash Reporting URL in the Java crash log
2505 Sean Coffey Oracle JDK-8071191 Increment the build value to b05 for hs25.31 in 8u31-b08
2505 Sean Coffey Oracle JDK-8071190 stability issues when being launched as an embedded JVM via JNI
2505 Sean Coffey Oracle JDK-8071189 Increment hsx 25.31 build to b04 for 8u31-b08
2505 Sean Coffey Oracle JDK-8071187 Increment hsx 25.31 build to b03 for 8u31-b06
2505 Sean Coffey Oracle JDK-8071186 CMS: JVM intermittently crashes with "FreeList of size 258 violates Conservation Principle" assert
2505 Sean Coffey Oracle JDK-8071184 Increment hsx 25.31 build to b02 for 8u31-b05
2505 Sean Coffey Oracle JDK-8071181 Regression in verifier for method call from inside of a branch
2505 Sean Coffey Oracle JDK-8071180 JVM crash with JDK8 (build 1.8.0-b132) with G1 GC
2505 Sean Coffey Oracle JDK-8071179 Segmentation error while running program
2505 Sean Coffey Oracle JDK-8071174 Increment minor version of HSx for 8u31 and initialize the build number
2505 Sean Coffey Oracle JDK-8071173 new hotspot build - hs25.40-b24
2505 Sean Coffey Oracle JDK-8071127 Add --with-copyright-year option to configure
2505 Paul Sandoz Oracle JDK-8069578 Inconsistent exception handling in CompletableFuture.thenCompose
2505 Ivan Gerasimov Google JDK-8067234 java.security.ProviderException: Error parsing configuration with space
2505 Maurizio Cimadamore Oracle JDK-8069181 java.lang.AssertionError when compiling JDK 1.4 code in JDK 8
2505 Igor Veresov Oracle JDK-8069564 SIGBUS in C2 compiled method weblogic.wsee.jaxws.framework.jaxrpc.EnvironmentFactory$SimulatedWsdlDefinitions.
2506 David Dehaven Oracle JDK-8069550 [macosx] Fix hard-wired paths to JavaVM.framework
2506 Vladimir Kozlov Oracle JDK-8069543 SIGSEGV in c2 compiled code with OptimizeStringConcat
2506 Vicente Arturo Romero Zaldivar Oracle JDK-8068546 javac generates LVT entry with length 0 for local variable
2506 Sean Coffey Oracle JDK-8069410 HttpServer missing tailing space for some response codes
2506 Anton Nashatyrev Oracle JDK-8069364 Mac OS Incompatibility between JDK 6 and 8 regarding input method handling
2506 Attila Szegedi Independent JDK-8069347 NashornScriptEngine.put/get() impls don't conform to NPE, IAE spec assertions
2506 Attila Szegedi Independent JDK-8069346 Dead typed push methods in ArrayData
2507 Mario Torre Red Hat JDK-8069305 Printing to Postscript doesn't support dieresis
2510 Attila Szegedi Independent JDK-8069185 Forgot to add a test model to JDK-8068573
2510 Attila Szegedi Independent JDK-8069184 POJO setter using [] syntax throws an exception
2511 Sergey Bylokhov Amazon JDK-8069104 [macosx] jdk8, jdk7u60 Regression in Graphics2D drawing of derived Fonts
2511 Attila Szegedi Independent JDK-8069042 REGRESSION: test/script/external/test262/test/suite/ch11/11.2/11.2.3/S11.2.3_A3_T5.js fails with tip
2512 Sean Coffey Oracle JDK-8068991 Update the protocol for references of docs.oracle.com to HTTPS in langtools.
2512 Sean Coffey Oracle JDK-8068990 Update the protocol for references of docs.oracle.com to HTTPS.
2512 Sean Coffey Oracle JDK-8068989 Update references of download.oracle.com to docs.oracle.com in javadoc makefile
2512 Stefan Johansson Oracle JDK-8068988 Usage of UseHugeTLBFS, UseLargePagesInMetaspace and huge SurvivorAlignmentInBytes cause crashes in CMBitMapClosure::do_bit
2513 Attila Szegedi Independent JDK-8068921 Calling a @FunctionalInterface from JS leaks internal objects
2513 Shanliang Jiang Oracle JDK-8068917 Used for the fix push for JDK-8038322: CounterMonitorDeadlockTest.java fails intermittently, presumed deadlock
2514 Attila Szegedi Independent JDK-8068800 Halve the function object creation code size
2514 Attila Szegedi Independent JDK-8068785 JavaAdapterFactory.isAutoConvertibleFromFunction should be more robust
2517 Joe Darcy Oracle JDK-8068654 Make certain annotation classfile warnings opt-in
2518 Alejandro Murillo Independent JDK-8068678 new hotspot build - hs25.60-b02
2518 Sean Coffey Oracle JDK-8068669 (fc) Rename the new jdk.net.enableFastFileTransfer system property to jdk.nio.enableFastFileTransfer
2518 Sundararajan Athijegannathan Oracle JDK-8068650 $jdk/api/javac/tree contains docs for nashorn
2519 Sundararajan Athijegannathan Oracle JDK-8068575 NashornScriptEngineFactory.getParameter() throws IAE for an unknown key, doesn't conform to the general spec
2520 Valerie Peng Oracle JDK-8068559 SHA1WithDSA with key > 1024 bits not working
2520 Mandy Chung Oracle JDK-8068548 jdeps needs a different mechanism to recognize javax.jnlp as supported API
2520 Sundararajan Athijegannathan Oracle JDK-8068521 javax.script.ScriptEngineFactory.getParameter spec is not completely consistent with the rest of the API
2521 Sundararajan Athijegannathan Oracle JDK-8068455 (typo in the spec) javax.script.ScriptEngineFactory.getLanguageName
2521 Sundararajan Athijegannathan Oracle JDK-8068447 @since and @jdk.Exported are missing in jdk.nashorn.api.scripting classes and package-info.java files
2521 Tobias Hartmann Oracle JDK-8068336 Refactor native stack printing from vmError.cpp to debug.cpp to make it available in gdb as well
2526 Jaroslav Bachorík DataDog JDK-8068406 TEST_BUG: java/lang/Thread/ThreadStateTest.java can't compile with change for 8058506
2527 Ivan Gerasimov Google JDK-8068388 Better message about incompatible zlib in Deflater.init
2528 Aleksej Efimov Oracle JDK-8068345 Africa/Casablanca transitions is incorrectly calculated starting from 2027
2528 Jaroslav Bachorík DataDog JDK-8068343 ThreadMXBeanStateTest throws exception
2532 Igor Ignatyev Oracle JDK-8068282 [TESTBUG] New tests in gc/survivorAlignment/ fails
2532 Igor Ignatyev Oracle JDK-8068281 Add tests on alignment of objects copied to survivor space
2533 Sergey Bylokhov Amazon JDK-8067791 Deadlock in SystemFlavorMap.getFlavorsForNative and SunToolkit.awtLock
2534 Shanliang Jiang Oracle JDK-8068191 DeadlockTest.java failed with negative timeout value
2534 Jaroslav Bachorík DataDog JDK-8068190 [TEST_BUG] java/lang/management/MemoryMXBean/LowMemoryTest.java fails intermittently
2534 Jaroslav Bachorík DataDog JDK-8068189 [TEST_BUG] java/lang/management/ThreadMXBean/Locks.java fails intermittently, blocked on wrong object
2534 Jaroslav Bachorík DataDog JDK-8068188 javax/management/remote/mandatory/notif/NotificationAccessControllerTest.java fails in JDK8-B22
2534 Jaroslav Bachorík DataDog JDK-8068182 java/lang/management/ThreadMXBean/SynchronizationStatistics.java fails intermittently
2534 Shanliang Jiang Oracle JDK-8068179 [TEST_BUG] javax/management/monitor/CounterMonitorTest.java hangs
2538 Daniel Fuchs Oracle JDK-8067963 Add a test that will call getDeclaredFields() on all classes and try to set them accessible.
2538 Ivan Gerasimov Google JDK-8067888 Lazy-init thread safety problems in core reflection
2538 Alejandro Murillo Independent JDK-8067802 Update the Hotspot version numbers in Hotspot for JDK 8u60
2539 Vladimir Kozlov Oracle JDK-8067906 Fix includes after 8058148: MaxNodeLimit and LiveNodeCountInliningCutoff
2539 Attila Szegedi Independent JDK-8067878 Local variable type calculation mismatch
2539 Kevin Walls Oracle JDK-8067864 [TEST_BUG] serviceability/sa/jmap-hashcode/Test8028623.java has utf8 character corrupted by earlier merge
2539 Kevin Walls Oracle JDK-8067863 Test serviceability/sa/jmap-hashcode/Test8028623.java fails on some Linux/Mac machines.
2539 Sundararajan Athijegannathan Oracle JDK-8067862 bound java static method throws NPE when 'null' is used for this argument
2539 David Holmes Oracle JDK-8067857 Add cross-platform compact profiles support
2539 Kevin Walls Oracle JDK-8067856 CPU detection gives 0 cores per cpu, 2 threads per core in Amazon EC2 environment
2540 Mark Sheppard Oracle JDK-8067151 [TESTBUG] com/sun/corba/5036554/TestCorbaBug.sh
2541 Sean Coffey Oracle JDK-8067721 (fc) FileChannel transferTo should use TransmitFile on Windows
2541 Sean Coffey Oracle JDK-8067720 Support SIO_LOOPBACK_FAST_PATH option on Windows

No changesets log

JDK-8176468 Release Note: IBM1166 character set now available
JDK-8176113 Release Note: Nondeterministic wrong answer on arithmetic corrected
JDK-8176108 Release Note: Allow use of TransmitFile on Microsoft Windows
JDK-8176008 Release Note: Allow use of SIO_LOOPBACK_FAST_PATH on Microsoft Windows
JDK-8166785 Release Note: G1 now collects unreachable Humongous objects during young collections
JDK-8160960 [TEST BUG] Hanged test blocks port and breaks following tests.
JDK-8140623 Wrong Syntax for DRS 1.2 DTD
JDK-8136644 Applet2Manager.getMainDeploymentRuleSet ignores jar version.
JDK-8136641 jps running as root fails after the fix of JDK-8050807
JDK-8136638 HTTPS hostname invalid issue with InetAddress
JDK-8136636 Let OracleUcrypto accept RSAPrivateKey
JDK-8133477 Check for CRL results in IllegalArgumentException "white space not allowed"
JDK-8132407 8u60 Windows 64-bit packager - install succeeds but application fails to start
JDK-8131257 Launching of jnlp app fails with JNLPException
JDK-8131253 Applet throws java.security AccessControlException in java console when playing it
JDK-8131244 javaws fails to launch app with empty href in jnlp file if Application-Library-Allowable-Codebase is used
JDK-8131243 The warning message displays the app name and publisher as "UNKNOWN" if cache is disabled
JDK-8131163 Test task: create plugin tests on MV jar files
JDK-8131162 Test task: Create java web start and fx deployment tests on MV jar files
JDK-8130545 Seek fails for media streams after several tries
JDK-8130122 Horizontal ListView incorrectly displays long data
JDK-8130012 Windows Hi-DPI scaling leads to blurry text at 125% (120 dpi)
JDK-8130011 Windows scaling override also disables font scaling on HiDPI displays
JDK-8130010 [TEST] TextNodeTest unit test fails becase FX runtime isn't initialized
JDK-8130004 [Mac] Intermittent crash after starting Multitouch support
JDK-8129987 Some text files included in jfxrt.jar have GPL copyright
JDK-8129921 Dotted Border clipped to the outside
JDK-8129901 Windows native binaries have inconsistent "Product version"
JDK-8129591 [Mac] intermittent crash on exit in WebView
JDK-8129482 Invisible Indeterminate ProgressBar has memory leak
JDK-8129481 [Drag and Drop Linux] setDragView still doesn't work on linux
JDK-8129479 JavaFX fails to launch on OL 6 after compiler upgrade
JDK-8129476 APP_NAME-post-image.sh crash with MacPkgBundler
JDK-8129475 [Mac] WebView unit tests hang on headless test machines
JDK-8129474 Unit test failures in ShowAndWait test if printer is not available
JDK-8129473 JNI warnings in javafx-iio
JDK-8129471 [Mac,Retina,3D] Lighting is wrong (too dark, incorrect highlight) with pixel scaling
JDK-8129469 [Linux] Stage.setIconified(true) not working with TRANSPARENT or UNDECORATED stage
JDK-8129468 TableMenuButton has erroneous behaviour with assigned data
JDK-8129467 "Too many touch points reported" exception when tapping too fast
JDK-8129466 [packager] Bit Architecture check fails on windows with system JRE and 64bit JVM
JDK-8129463 TreeTableView ImageViews vanish and aren't redrawn when scrolling
JDK-8129462 [Mac] Swing interop unit tests hangs on headless test machines
JDK-8129461 [TabPane] TableView in TabPane has memory leak
JDK-8129460 TableView selected items listener reports wrong changes
JDK-8129455 Dialog on iOS is not implemented
JDK-8129454 Update the JDK version used to build FX to JDK 8u40
JDK-8129453 Add .nb-gradle directory to .hgignore
JDK-8129452 Support the Windows 8 APIs that indicate proper scaling for HiDPI screens
JDK-8129451 [packager] Mac code is noisy on non-mac platforms
JDK-8129450 [IOS, Android] Changes to fix WebView
JDK-8129448 Add 64-bit IOS build support
JDK-8129305 FX fails to load msvcr120.dll on Windows7 due to bad file permission
JDK-8122951 [ANDROID] build file update
JDK-8122938 [ARM] missing i.MX sources for soft float build
JDK-8098575 [WebView] NPE when running WebEngine without WebView
JDK-8098276 Allow building with gradle 2.X
JDK-8098257 MenuButton, SplitMenuButton, ChoiceBox needs onShow* and onHid* events
JDK-8098242 Remove itemsProperty invalidation workaround in ListView and TableView
JDK-8098235 TableView refreshing
JDK-8098233 Enable building SceneBuilder without needing to build the JavaFX SDK
JDK-8098153 javafxpackager and launcher should have a way for a private but shared JRE to used by multiple apps from the same vendor
JDK-8098134 Add new javafx.runtime.build property to javafx.properties file
JDK-8098123 TableView: support update of items that are equal, part 2
JDK-8098105 Add GL_FRAGMENT_PRECISION_HIGH check to existing 2D shaders before setting precision to highp
JDK-8098090 [WebView] Add ability to track JS console messages.
JDK-8098085 Ability to force a ListView or TableView refresh
JDK-8098084 Print stack trace in Quantum unit tests if exception occurs
JDK-8098061 ChoiceBox missing "onAction" method
JDK-8098053 Move JNLP generation logic into a Packager Bundler
JDK-8098027 Refactor charts tests
JDK-8098021 HelloSanity should close the screen grab window when you leave the section.
JDK-8098008 TimelineClipCore exceptions handling improvent
JDK-8097969 [Android] Changes needed in Dalvik launch code
JDK-8097962 Enable Packager Launchers for VS2012 and VS2013
JDK-8097931 [Mac] Enable parallel execution of FX thread and Renderer thread for JFXPanel, FXCanvas
JDK-8097927 [Android] Changes needed in Monocle for Dalvik
JDK-8097890 Refactor duplicated editor code in ComboBox and DatePicker skins.
JDK-8097819 Remove obsolete tests
JDK-8097811 Move Mac specific implementation (support CALayer) out of platform independent code path
JDK-8097778 isIdeographic missing on Android < api level 19
JDK-8097774 GIF: loop counter is not implemented.
JDK-8097754 Native installer - allow user to choose installation directory
JDK-8097541 [CSS] NPE in com.sun.javafx.css.StyleManager.findMatchingStyles
JDK-8097538 NPE when chaining Lighting effect with other effects
JDK-8097509 Accidentally adding same TableColumn twice is allowed and causes late and hard to interpret java.lang.UnsupportedOperationException
JDK-8097482 LineChart renders noisy lines when the number of data points is large
JDK-8097469 Better error checking and docs if Printing or Dialogs called from Animation
JDK-8097464 [HelloCheckBox] Sample needs additional controls for Accessibility testing
JDK-8097458 Unit test failure in FXJarTest on Windows
JDK-8097455 BMP image fails to load when a specific size is requested
JDK-8097451 Remove -I -L ARM cross compile flags
JDK-8097423 no egl_wrapped.c in prism/monocle
JDK-8097386 Ensemble8 Gesture and Multi-Touch tabs fumble rotation events
JDK-8097368 NPE in javafx.embed.swing.JFXPanel$HostContainer
JDK-8097360 Bad header format in some source files breaks GPL license swap
JDK-8097356 ListView: selectedIndices/selectedItems fire invalid list change on clearAndSelect
JDK-8097312 KeyBinding.getSpecificity does not handle OptionalBoolean.ANY correctly
JDK-8097286 Area Chart with negative values
JDK-8097283 [Packager] Config exception when runtime is provide via Java API
JDK-8097261 Webkit build failure caused by RT-40000
JDK-8097246 [Quantum] Unit tests hang when running window init/dispose tests
JDK-8097241 [3D] Texture with transparency rendered blocky on the tilted sides of the 3d shape
JDK-8097196 Remove temporary fix from RT-39042
JDK-8097131 Move com.sun.webkit.dom.JSObject to web module to avoid split package
JDK-8097121 Replace sun.misc.BASE64* with java.util.Base64
JDK-8097090 With two or more application modal windows; windows deeper in the stack are receiving requestToFront when not enabled causes an NSBeep.
JDK-8097060 [Modena, TextArea] Vertical scrollbar appears in TextArea and then disappears
JDK-8097047 Apple Store submission fails after using 8u31
JDK-8096994 LineChart.getData.clear() method exception
JDK-8096963 Unit test failure in TreeTableViewTest caused by fix for RT-40110
JDK-8096937 Expand button becomes invisible if there is 'border-radius' defined for
JDK-8096918 Apple Store submission fails after Yosemite Apple Store update
JDK-8096835 TextField and TextArea can throw NPE when text is null
JDK-8096818 [SWT] No possibility to select text in FX content by using mouse dragging
JDK-8096813 [Mac] Glass shouldn't use Prism's context for creating or destroying native rendering resources
JDK-8096787 TableView - multiple selection via shift-click doesn't work with different columns
JDK-8096773 Firing SimpleUpdateChange does not get propagated properly on SortedList
JDK-8096762 [TableView, TreeTableView] in single cell and multiple selection mode, Shift+PageUp/PageDown doesn't scroll the tableview.
JDK-8096755 Regression: Mac (prism-sw) rendering is corrupted
JDK-8096731 Update copyright header for files modified in 2015
JDK-8096725 RT-34620: [ComboBox, DatePicker] Buttons set to default/cancel are not reacting to ComboBox enter/esc keys
JDK-8096707 StackOverflow when changing sort order in the TreeTable
JDK-8096685 Polytonic displays incorrectly when typed in (via TextField)
JDK-8096680 Wrong chart scaling in ScatterChart if TickUnit set below 0.5
JDK-8096664 BaseResourceFactory uses static caches, which can cause a leak
JDK-8096639 NPE in VirtualFlow
JDK-8096625 PrismSettings minTextureSize does not work
JDK-8096618 Nested window open causes repeated shortcut key event after close
JDK-8096613 [3D] PNT mesh only: Internally computed tangent vectors need to recomputed if its assocated texCoords or points have changed
JDK-8096583 ConcurrentModificationException when closing APPLICATION_MODAL dialog
JDK-8096554 [CSS] Setting Font Size for Tooltip is not applicable
JDK-8096545 On Mac, application created by javapackager can not run.
JDK-8096536 [HTMLEditor] Text formatting is confused when selecting text across paragraphs with different styles
JDK-8096494 FXMLLoader documentation mentions a non-existant "template" flag
JDK-8096482 ListView selectionmodel should be updated before fire events
JDK-8096455 ComboBox loses selection after inserting objects
JDK-8096428 Broken dependency with openZip
JDK-8096404 Memory Leak issue with Charts / WeakReferences / Platform.accessibilityActiveProperty()
JDK-8096401 Layout Regression - bad row height
JDK-8096394 Canvas rendering many small shapes has a lot of overhead on some GPUs
JDK-8096340 Remove unused, obsolete designTime module
JDK-8096290 [TableView] Continuous selection using SHIFT-UP/DOWN/LEFT/RIGHT in multi-cell selection mode does not work as expected
JDK-8096272 NullPointerException in empty TableView when querying focused index
JDK-8096257 Right click select on a TableView (and associated type widgets) can not be filtered out
JDK-8096238 Java Packager: add "Codebase" and "Permissions" attribute to MANIFEST.MF
JDK-8096207 [Mac] Fix compiler type cast warnings on GLContext.c
JDK-8096171 Click behavior in TreeTableView changes, when treeColumn is not the first column
JDK-8096129 [CSS] public class CornerRadiiConverter extends from implementation class
JDK-8096128 The columnPopupMenu of the TableHeaderRow is not updated when adding columns to a nested column
JDK-8096033 MultipleSelectionModelBase::clearSelection() is incorrect
JDK-8096008 OpenJFX ARM compile fails with updated crosslibs with __THROWNL
JDK-8095996 Mac system menu bar handles some accelerators incorrectly
JDK-8095992 Build should fail fast on Windows if DirectX SDK or Windows SDK not found
JDK-8095976 [Mac] Packager build fails with gcc
JDK-8095927 StackedAreaChart doesn't fade out removed series
JDK-8095910 Remove deprecated builders from more toys and other apps
JDK-8095890 [ScenePulseListener] NPE in synchronizeSceneProperties
JDK-8095872 [Logging] Cannot turn off javafx.scene Logging
JDK-8095868 CSS for Region border is ignored when if background property is bound
JDK-8095804 [ES2, 3D] Shader fails on embedded devices with no default precision defined
JDK-8095742 Glass-Mac window close deallocation produces a spurious warning
JDK-8095720 [JAVADOC] Miscellaneous typos in Task API
JDK-8095712 ComboBox dropdown width is computed incorrectly
JDK-8095678 DialogPane padding increases when focus is changed
JDK-8095676 [TreeView,TreeTableView] Selection listener is not informed when selected item is removed.
JDK-8095664 Need to document that an owned window cannot be minimized
JDK-8095577 [Mac] NPE in window close unit tests
JDK-8095553 Ensemble8 points to old URL for javadoc
JDK-8095545 [a11y] CCE if focused element is a table cell
JDK-8095524 Disabled Tab in TabPane is traversable with shortcuts Ctrl + Tab, Ctrl + Shift + Tab
JDK-8095514 Re-enable sorting in HelloListView
JDK-8095462 [TabPane] Not all tabs are shown when running Ensemble and viewing source code
JDK-8095404 ComboBox/ChoiceBox: items in popup not updated
JDK-8095400 [Mac] VM Crashes when FX application fails with Exception in start method
JDK-8095361 Rendering broken on iOS
JDK-8095359 [Mac] JavaFX core dumps on Stage#close
JDK-8095352 [ComboBox] ComboBox popup does not adjust its size properly when the items are changed
JDK-8095346 Mac OSX Yosemite StageStyle.UTILITY comes up with wrong window decoration
JDK-8095314 PasswordField bullet is too small and rendered irregularly
JDK-8095299 [TableView] TableView with null items throws NPE on sorting
JDK-8095297 [Windows] Ensemble 8: Spinner example layout is broken
JDK-8095164 Error in Sphere texture mapping
JDK-8095115 [TOYS] HelloSanity should disable buttons for controlling other window when closed
JDK-8095087 Dialog#show and showAndWait should only call sizeToScene if the stage size has not been modified
JDK-8095079 TreeTableView incorrectly follows selection after collapsing the item.
JDK-8095072 com.sun.javafx.geom.Curve.refineTforY : yt0 is dead upon entry
JDK-8095058 [3D] Texture transparency is ignored in 8u40
JDK-8095050 Binding tests fail
JDK-8095040 StageStyle.UNIFIED not working on OSX 10.9.5
JDK-8095017 GIF frames have incorrect background
JDK-8094973 setDisable() inside DatePicker's setDayCellFactory not working if HijrahChronology is set
JDK-8094957 Stop using deprecated builders in samples, toys, and other apps
JDK-8094945 NumberAxis generates incorrect Tick values
JDK-8094848 [Accessibility, DatePicker] Within DatePicker, TAB loops through controls but SHIFT-TAB gets stuck on date.
JDK-8094829 Memory leak in JavaFX ProgressIndicator
JDK-8094805 Updating BarChart data causes memory leak
JDK-8094790 ListView et al: selectedIndices/Items fires incorrect event on selectIndices
JDK-8094778 FilteredList doesn't always handle update Changes from source list
JDK-8094738 [JAVADOC] Typo in Task class description
JDK-8094724 [ListView] ctrl+shift+left/right don't work for horizontal-oriented list-view
JDK-8094700 [DND] Mouse coordinates always zero at onDragDone
JDK-8094688 [Dialogs] Alert with CSS border width is not displayed properly
JDK-8094680 Selection on double click selects too much on Windows
JDK-8094663 IndexOutOfBoundsException with Native Menus in Mac
JDK-8094603 Setting font size to 12 for tooltip is not working properly
JDK-8094601 Mac: Command-period generates spurious KeyEvents on Mac OS
JDK-8094593 AppBundler tests are crashing on MacOS
JDK-8094567 Tooltip: periodically shown/hidden when dynamically setting text in onShowing
JDK-8094542 Slightly confusing behavior of the TextArea regarding Tab key
JDK-8094539 IOOBE in ListView when programmatically select certain row
JDK-8094532 ObservableList.sorted() does nothing
JDK-8094482 ListView incorrectly traverse focus on key presses
JDK-8094468 Glass sometimes prints warning message on exit
JDK-8094451 StackedBarChart/TableCell chart colours alternate unexpectedly
JDK-8094332 GridPane percentage layout bug since JavaFx 8u40
JDK-8094318 FXMLLoader fails to load attribute styleClass on Spinner
JDK-8094283 FXML TriangleMeshBuilder doesn't support vertexFormat property element
JDK-8094272 [Ensemble] DatePicker, "Options for locale->Show week numbers" is inconsistent with setting a locale.
JDK-8094252 Hyperlink not visible inside selected TreeItem
JDK-8094249 [Dialog] Calling setExpanded(boolean) on DialogPane is order dependent
JDK-8094220 javafx.scene.image.Image() constructor may hangs on corrupted image
JDK-8094205 Spinner control auto commit value
JDK-8094203 [Ensemble] content in some pages are not centered
JDK-8094199 TableView leaks memory
JDK-8094142 The last row in tableView is not full visible if the tableview has only the horizontal scrollbar.
JDK-8094081 Packager DebugNative compilation fails on Windows
JDK-8094066 Unable to control full path of self contained bundle from the Ant interface
JDK-8094058 Apostrophe as dead key doesn't work on Windows 8.1 Latvian (Standard) keyboard layout
JDK-8093981 ComboBox drop-down goes out from the edges of the screen
JDK-8093977 Button containing graphic with minimum size cuts off text
JDK-8093969 [3DViewer] FileNotFoundException: Jfx3dViewerApp_session.properties (Read-only file system)
JDK-8093935 [ColorPicker] focused custom color cannot be removed with delete key.
JDK-8093860 ScrollPane introduces distortions when scrolling up & down
JDK-8093711 Mac: Press 'Command + =' on mac os will trigger 4 key events, it should be 2
JDK-8093674 [ListView] ctrl+shift+page down sets anchor incorrectly
JDK-8093671 8.0-graphics-scrum-2018: up to 50% performance regressions in Controls benchmarks
JDK-8093657 Remove use of internal classes methods from samples
JDK-8093631 [CSS] CHART_COLOR_XX not found
JDK-8093620 Tabs are not displayed in the correct order after a remove and an add
JDK-8093583 Regression with @import in CSS
JDK-8093536 [packager] add option to specify keychain in Mac codesign
JDK-8093535 NSInternalInconsistencyException Crash
JDK-8093499 [JFXPanel] back out fix for RT-38922
JDK-8093488 Webview radio button and checkboxes missing
JDK-8093470 VM crash when call a method from within javascript code present in a page loaded in webEngine
JDK-8093469 [WebView] IllegalArgumentException when dragging in google maps
JDK-8093463 Enable new compilers for production builds
JDK-8093444 WebView horizontal scrolling using mouse or touch device causes rendering artifacts
JDK-8093440 [WebView] use OUT_PWD for a current build dir
JDK-8093433 [WebView] "outstanding resource locks detected" when playing youtube
JDK-8093417 [WebView] "outstanding resource locks detected" when using clip in canvas
JDK-8093406 [WebView] implement missing functionality in PasteboardJava.cpp
JDK-8093385 Java crashes when trying to render go.com
JDK-8093384 [GTK] Gdk-ERROR **: g_thread_init() must be called before gdk_threads_init()
JDK-8093380 [WebView] solar system web page is slow, has rendering problems and throws exceptions
JDK-8093378 [WebView] Use application locale setting in WebView language header
JDK-8093336 Update to Newer Version of WebKit
JDK-8093317 Tree selection: selectedIndex not updated when toggling showRoot
JDK-8093290 [TreeTableView, TableView] Shift + Home, Shift + End make focus lost.
JDK-8093261 Update copyright header for files modified in 2015
JDK-8093253 Default button does not get activated on ENTER when included in a TitledPane
JDK-8093228 TreeView: selection moves up after deleting items
JDK-8093204 listview multi selection getSelectedItems/Indices is very slow
JDK-8093172 DatePicker can lose focus when popup is shown
JDK-8093165 Combobox: IOOBE when selecting null item
JDK-8093068 Eliminate split packages across JavaFX modules
JDK-8093052 [TableView] Shift+Left/Right arrow keys deselect the cell near the left/right boundary of the row.
JDK-8093010 [TEST] Robot-based unit tests are unstable on Ubuntu
JDK-8092970 IllegalThreadStateException in WebView when loading flickr.com
JDK-8092853 Implement change in extractFlagsFromVersion
JDK-8092707 TitledPane doesn't crop title text to fit
JDK-8092672 [launcher] Really fix AppCDS
JDK-8092639 Remove invalid builders tests
JDK-8092609 Replace sun.security.util.SecurityConstants with java.lang.RuntimePermission
JDK-8092584 Shift+Tab does not work with an editable Spinner.
JDK-8092576 FXML TriangleMeshBuilder doesn't support normals and VertexFormat
JDK-8092528 TreeView: unexpected behaviour of getRow(TreeItem)
JDK-8092505 ComboBox: incorrect selection update/notification on disjoint list changes
JDK-8092225 javafxpackager -deploy does not accept percentage heights and widths
JDK-8090074 Update copyright header for files modified in 2015
JDK-8090033 FX application hangs on exit when media gets stuck
JDK-8088823 Advanced Media Player tab does not respond to "Time" slider on Windows
JDK-8087398 [WebView] fix the race with generate/copy the InspectorJS* files
JDK-8081544 gcc compiler warnings in closed source code
JDK-8081543 Type1 font not loaded by java.awt.Font.createFont
JDK-8081426 Web Start does not honor height / width % values
JDK-8081424 Improve naming consistency in make/installer/bundles/macosx/Makefile
JDK-8081330 The applet thrown NullPointerException when loading it
JDK-8081326 StringIndexOutOfBoundsException in CertUtils.checkWildcardDomain
JDK-8080955 embedded_jnlp param requires also code or jnlp_href param or applet arg.
JDK-8080893 Remove dead code
JDK-8080889 Remove support for downloaded JavaFX classes
JDK-8080785 remove dead code to donwload JavaFX on demand.
JDK-8080270 Check for missing 8u backports
JDK-8080077 JNLP property apple.laf.useScreenMenuBar no longer treated as secure for Mac OS
JDK-8079677 fix to JDK-8078534 removed part of fix to JDK-8076220
JDK-8079223 unnecessary performance degradation caused by fix to JDK-8052111
JDK-8078893 cert based run rule doesn't work when running offline
JDK-8078872 When applet is relaunched, extra JUT records can be sent
JDK-8078858 Merge problem in 9-client - test build failure
JDK-8078534 DRS 1.2: checksum algorithm needs to be restricted to SHA-256
JDK-8078310 [macosx] StagedXML is missing
JDK-8078152 Slow cache performance since JRE 7u06
JDK-8077958 Create HKLM\SOFTWARE\JavaSoft\Java Runtime Environment\ registry keys with msi.
JDK-8077925 Jnlp fails to load with CouldNotLoadArgumentException after JDK-8075179
JDK-8077789 32-bit JRE silent install fails on WINDOWS 2008 SERVER 64-bit under System account
JDK-8077649 jnlp "codebase" attribute has been made mandatory
JDK-8077588 SwingSet2: Themes are incorrectly enabled when running with Nimbus Look and feel
JDK-8077541 jnlp spec version 8.20 is not supported
JDK-8077540 XMLParserTest unit test failure.
JDK-8077508 DRS certificate based rule does not match with Java WS Application compressed by pack200
JDK-8076169 [macosx] Menu items disappear and redrawn quickly when moving mouse into applet frame
JDK-8075622 Add DRS rules block to Java Usage Tracker records.
JDK-8075530 Java Console GUI is irresponsive in JRE 8u20 on OS X
JDK-8075528 Test jnlp_file/applicationDesc/index.html#args fails with incorrect arg value
JDK-8075431 HtmlUI: "Change destination folder" checkbox in WelcomeDialog is not accessible by mouse
JDK-8075430 HtmlUI: checkbox text labels should be clickable
JDK-8075429 replace wrapper dialogs with HtmlU
JDK-8075409 jre8-40 fails to install on SuSE 11.3
JDK-8074961 Ensure JFR options could be passed to webstart app by specifying VM arguments in the JCP
JDK-8074694 Lazy conversion of ZipEntry time
JDK-8074564 Replace missing APIs from 8u40
JDK-8074473 JavaThread C2 CompilerThread0 crashes on org.eclipse.persistence.internal.sessions.CommitManager::commitChangedObjectsForClassWithChangeSet
JDK-8073981 RSA links broken in the Java Cryptography Architecture Standard Algorithm Name Documentation
JDK-8073766 junit issue after fix to JDK-8073589
JDK-8073123 Delete splash.c from Repository
JDK-8072940 8u60 nightly solaris_sparcv9_5.10-product build fails
JDK-8072868 8u20 and later should not change the MSI UpgradeCode for each JRE version
JDK-8072710 Parsing JNLP file should not cause download of extensions.
JDK-8072668 Internal Error (sharedRuntime.cpp:833)
JDK-8072589 [windows 8] S. Chinese quotation mark needs to be replaced by English quotation mark
JDK-8072453 [de,fr,pt_BR,sv] duplicate mnemonics in JCP security tab.
JDK-8072431 Unit test failures: JNLPClassloaderTest, JNLP2ClassLoaderTest
JDK-8072044 Development work to merge webkit sources into FX
JDK-8072003 NPE (instead of proper error dialog) thrown when some jnlp files have no resources
JDK-8071840 Add files skipped from the fix to JDK-8071490 by mistake
JDK-8071839 JDK9 nightly build from 01/23 failed
JDK-8071205 RegisterDeploy ping not working correctly
JDK-8071169 ClientConfig.refreshIfNeeded() doesn't restore properties with "active." prefix.
JDK-8071166 JRE Install Error in localized Windows 8.1 after join in AD domain
JDK-8071164 Jnlp fails to load with CouldNotLoadArgumentException
JDK-8071163 RFE: Instructions Not Clear For Adding Site To ESL
JDK-8071162 JavaWS fails with proxy autoconfig due to missing "resolve" permission
JDK-8071159 javaws help message in Japanese is corrupted
JDK-8071150 Roaming user profiles by USER_JPI_PROFILE env variables doesn't work anymore
JDK-8071147 Shortcuts are not created for javaws x64 with JRE 7u55 on Windows OS
JDK-8071144 Webstart cache path error for Java >= 7u65
JDK-8071141 SWT cannot load native look&feel
JDK-8071137 Step 6:There are java.io.FileNotFoundException and ava.lang.ClassNotFoundException thrown in java console after clicking "Continue" Button,and there is no security dialog with "Run" Button .
JDK-8069370 [TEST_BUG] closed/javax/management/openmbean/OpenTypeClassNameTest.java failed because it 'Did not resurrect a mutant OpenType'
JDK-8069275 The text location of "More information" overlap with "code" in mixed code dialog
JDK-8069271 Add missing information to AppModel
JDK-8068940 Visual Studio javaws Project to Debug Native Code
JDK-8068916 Netbeans javaws Project to Debug Native Code
JDK-8068897 Applet is not started in IE on dynamic insertion into a web page
JDK-8068750 javaws Dead Native Code Cleanup
JDK-8068690 Remove unusable G1RSLogCheckCardTable command line argument
JDK-8068206 Xcode javaws Project to Debug Native Code
JDK-8067942 7u72 https fails with CertificateException: Java couldn't trust Server
JDK-8067895 DRS with non-force version run rule can block when it should not.
JDK-8067630 [mac os x] Update '3 Billion Devices' Advert on SetupProgress Dialog
JDK-8067427 JavaWS fails with proxy autoconfig due to missing "dnsResolve"
JDK-8066799 hs_err can contain incomplete stack trace
JDK-8064564 Test sun/util/calendar/zi/TestZoneInfo310.java fails with RuntimeException: FAILED: availableIds don't match
JDK-8061642 Plugin missing MIME type registration for application/x-java-applet;version=1.8
JDK-8060092 JEP 242: JVM Trace Events for Failed Allocations
JDK-8059312 External party reports RegExp slowdown with case insensitivity enabled.
JDK-8058929 [de, fr, it, ko, pt_BR, sv] Layout issue (truncation) in AUWelcome dialog
JDK-8056992 [AU]The auto update window does not read the tag of au-descriptor.xml file to set the "More information" link
JDK-8051030 Web Start applet process fails to exit
JDK-8049999 DRS: Want customizable message in case of application blocking if only default rule is specified
JDK-8047698 Clicking cancel on security dialog for preloader clears the DeniedCertStore
JDK-8046790 echo elements in ruleset.xml
JDK-8044852 JEP 239: Update JavaFX/WebView to Newer Version of WebKit
JDK-8042632 Application with Signed JNLP cannot pass accented characters in
JDK-8035582 DeploymentRuleSet on run action
JDK-8026747 JCP -> Advanced Tab -> Selection events are not heard from screen readers
JDK-8024156 DRS: The messaging for invalid rule set jar is not explicit.
JDK-8023324 With expired or selfsigned DeploymentRuleSet, not hint is provied in JCP Rule Set dialog.
JDK-8022268 DRS: Unable to include escaped characters in message
JDK-7198599 Incorrect UninstallString windows register key in JDK 1.6, 1.7 and 8
JDK-7044399 Installer dialogs - Some of the text is not visible in High Contrast Mode
JDK-7017683 java.com link in some of the dialogs are not accessible
JDK-6745371 MSI/MST files should be deleted after install
JDK-6717309 Plugin2: Clean-up for possible multi-thread unsafe codes as per Findbugs result from security audit
JDK-6717304 Plugin2: simple code clean-up as per Findbugs' result from security audit
JDK-6580611 Install dialogs look bad on Windows when display is set to high DPI
JDK-6554593 Java Control Panel accessibility problem with labels and text fields

Committer push log

Aleksej Efimov, Oracle

Bug Summary
JDK-8072696 (tz) Support tzdata2015a
JDK-8077299 (tz) Support tzdata2015b
JDK-8079669 (tz) Support tzdata2015d
JDK-8068345 Africa/Casablanca transitions is incorrectly calculated starting from 2027
JDK-8079777 AIOBE occurs when accessing to document function in extended function in JAXP
JDK-8081839 ArrayIndexOutOfBoundsException throws in UTF8Reader of SAXParser
JDK-8076586 Bad error message on parsing illegal character in XML attribute
JDK-8098782 DateFormat for Singapore/English locale (en_SG) is M/d/yy instead of d/M/yy
JDK-8081561 getNodeValue should return 'null' value for Element nodes
JDK-8077366 JCK test api/xsl/conf/string/string17 starts failing after JDK-8074297
JDK-8071606 JDK 8 schemagen tool does not generate xsd files for enum types
JDK-8078284 Performance degradation observed with TimeZone Benchmark
JDK-8076591 schema1.xsd has wrong content. Sequence of the enum values has been changed
JDK-8076589 substring in XSLT returns wrong character if string contains supplementary chars
JDK-8071607 XSL: Run-time internal error in 'substring()'
JDK-8071608 XSL: wrong answer from substring() function

Alexey Ivanov, Oracle

Bug Summary
JDK-8080764 No mnemonics on Open and Save buttons in JFileChooser

Alexandr Scherbatiy, BellSoft

Bug Summary
JDK-8076232 -spash: can't be combined with -xStartOnFirstThread since JDK 7
JDK-8068240 [macosx] Combo box consuming ENTER key events
JDK-8079132 [macosx] Drag image of TransferHandler does not honor MultiResolutionImage
JDK-8075268 [macosx] The fix for JDK-8043869 should be reworked
JDK-8085922 Dragged events for extra mouse buttons (4,5,6) are not generated on JSplitPane
JDK-8079509 Incorrect paint of JProgressBar in Nimbus LF
JDK-8076242 No Horizontal Mouse Wheel Support In BasicScrollPaneUI
JDK-8076183 Open Source Java Access Bridge - Create Patch for JEP C127 8055831
JDK-8074863 System tray icon title freezes java
JDK-8062920 The output's 'Page-n' footer does not show completely.

Anton Litvinov, Oracle

Bug Summary
JDK-8078391 mouse wheel scroll closes combobox popup

Alejandro Murillo, Independent

Bug Summary
JDK-8130352 JVM times out with vdbench on SPARC M7-16
JDK-8075158 Make jdk8u60 the default release on jdk8u repos
JDK-8068678 new hotspot build - hs25.60-b02
JDK-8071500 new hotspot build - hs25.60-b03
JDK-8072697 new hotspot build - hs25.60-b04
JDK-8073514 new hotspot build - hs25.60-b05
JDK-8074038 new hotspot build - hs25.60-b06
JDK-8074550 new hotspot build - hs25.60-b07
JDK-8075144 new hotspot build - hs25.60-b08
JDK-8075615 new hotspot build - hs25.60-b09
JDK-8076191 new hotspot build - hs25.60-b10
JDK-8076760 new hotspot build - hs25.60-b11
JDK-8077424 new hotspot build - hs25.60-b12
JDK-8078043 new hotspot build - hs25.60-b13
JDK-8078270 new hotspot build - hs25.60-b14
JDK-8079189 new hotspot build - hs25.60-b15
JDK-8079686 new hotspot build - hs25.60-b16
JDK-8080458 new hotspot build - hs25.60-b17
JDK-8080804 new hotspot build - hs25.60-b18
JDK-8081436 new hotspot build - hs25.60-b19
JDK-8085869 new hotspot build - hs25.60-b20
JDK-8087238 new hotspot build - hs25.60-b21
JDK-8129314 new hotspot build - hs25.60-b22
JDK-8129939 new hotspot build - hs25.60-b23
JDK-8129586 nmethod related crash in CMS
JDK-8067802 Update the Hotspot version numbers in Hotspot for JDK 8u60

Anton Nashatyrev, Oracle

Bug Summary
JDK-8076250 [macosx] Clipboard does not work with 3rd parties Clipboard Managers
JDK-8073233 [macosx] Jtree icon painted over label when scrollbars present in window
JDK-8076244 [macosx] Menu items are appearing on top of other windows
JDK-8074759 [macosx] Mouse events are captured by the wrong menu in OS X
JDK-8078522 [macosx] NPE when attempting to get image from toolkit
JDK-8085812 Deadlock in awt clipboard
JDK-8081418 JButtons stay pressed after they have lost focus if you use the mouse wheel
JDK-8069364 Mac OS Incompatibility between JDK 6 and 8 regarding input method handling
JDK-8075258 press-and-hold input method for accented characters works incorrectly on OS X
JDK-8073348 Toolkit.getScreenInsets() doesn't update if insets change

Andrew Hughes, Red Hat

Bug Summary
JDK-8129095 8077982 giflib upgrade breaks system giflib builds with earlier versions

Abhijit Saha, Independent

Bug Summary
JDK-8131239 [TEST_BUG] two lib/testlibrary tests are failing with "Error. failed to clean up files after test" with jtreg 4.1 b12
JDK-8077754 Increment minor version of HSx for 8u45 and initialize the build number
JDK-8131207 Increment minor version of HSx for 8u51 and initialize the build number
JDK-8077758 Increment the build value to b02 for hs25.45 in 8u45-b08
JDK-8131209 Increment the build value to b02 for hs25.51 in 8u51-b10
JDK-8131211 Increment the build value to b03 for hs25.51 in 8u51-b15
JDK-8076149 java.lang.IllegalArgumentException: aContainer is not a focus cycle root of aComponent
JDK-8069268 JComponent.AccessibleJComponent.addPropertyListeners adds exponential listeners

Anthony Scarpino, Oracle

Bug Summary
JDK-8073153 Improve GHASH performance
JDK-8073112 sun/security/pkcs11/rsa/TestKeyPairGenerator.java failed in aurora

Attila Szegedi, Independent

Bug Summary
JDK-8079471 Add tests for the basic failure of try/finally compilation
JDK-8081075 Allow conversion of native arrays to Queue and Collection
JDK-8073071 Arrays.asList results in ClassCastException with a JS array
JDK-8071991 Build errors in 8u-dev after backporting JDK-8067139 and JDK-8066232
JDK-8068921 Calling a @FunctionalInterface from JS leaks internal objects
JDK-8075002 Can't compare Java enums to strings
JDK-8075003 Canonicalize "is a JS string" tests
JDK-8080496 Code generator emits an extra POP for discarded boolean logical operation
JDK-8069346 Dead typed push methods in ArrayData
JDK-8080497 Don't create impossible converters for ScriptObjectMirror
JDK-8079508 Eliminate dead code around Nashorn code generator
JDK-8080473 Enforce best practices for Node token API usage
JDK-8071988 Finally blocks inlined incorrectly
JDK-8081709 fix Nashorn ant externals command
JDK-8069185 Forgot to add a test model to JDK-8068573
JDK-8081679 Fuzzing bug: And jdk.nashorn.internal.runtime.Source#byteToCharArray: Detection for UTF-32LE does not work because it has the same prefix as UTF-16LE.
JDK-8071987 Fuzzing bug: AssertionError when defining local variable in Block
JDK-8068800 Halve the function object creation code size
JDK-8080494 Improve error message when with statement is passed a POJO
JDK-8035712 Investigate if RuntimeCallSite linkage can be removed
JDK-8129856 Java adapters with class-level overrides should preserve variable arity constructors
JDK-8068785 JavaAdapterFactory.isAutoConvertibleFromFunction should be more robust
JDK-8081808 JSON-friendly wrapper for objects
JDK-8081825 JSONListAdapter should delegate its [[DefaultValue]] to wrapped object
JDK-8081303 ListAdapter should take advantage of JSObject
JDK-8081606 ListAdapter throws NPE when adding/removing elements outside of JS context
JDK-8067878 Local variable type calculation mismatch
JDK-8075005 More aggressive value discarding
JDK-8074525 Nashorn bug retrieving array property after key string concatenation
JDK-8069347 NashornScriptEngine.put/get() impls don't conform to NPE, IAE spec assertions
JDK-8080495 Need to adjust test output for 8067931
JDK-8073070 New compiler warning after JDK-8067139
JDK-8079472 Optimistic rewrite in object literal causes ArrayIndexOutOfBoundsException
JDK-8069184 POJO setter using [] syntax throws an exception
JDK-8081711 reduce dependency of Nashorn tests on external components
JDK-8069042 REGRESSION: test/script/external/test262/test/suite/ch11/11.2/11.2.3/S11.2.3_A3_T5.js fails with tip
JDK-8075004 Static analysis of IfNode should consider terminating branches
JDK-8081710 transparently download testng.jar for Nashorn testing

Alexander Zvegintsev, Oracle

Bug Summary
JDK-8074974 [PIT] NPE in DnD tests apparently because of the fix to JDK-8061636
JDK-8129788 [PIT] Test closed/java/awt/FullScreen/DisplayMode/CycleDMImage.java switches Linux to the single device mode
JDK-8075675 Cannot input Japanese in JTextField on RedHat Linux
JDK-8129787 Deadlock with multimonitor fullscreen windows.
JDK-8069163 Fix for JDK-7079254 changes behavior of MouseListener, MouseMotionListener
JDK-8078620 Fullscreen mode is not working properly on Xorg
JDK-8077983 GIFLIB upgrade
JDK-8098563 OperationTimedOut exception inside from XToolkit.syncNativeQueue call on Ubuntu 15.04
JDK-8076174 OS X build broken by reference to XToolkit
JDK-8074109 Switching to GTK L&F on-the-fly leads to X Window System error RenderBadPicture

Andrew Brygin, Azul

Bug Summary
JDK-8050962 [macosx] LCD Rendering hints seems not working without FRACTIONALMETRICS=ON
JDK-8077606 ArrayIndexOutOfBoundsException in javax.swing.text.html.parser.ContentModel.first()
JDK-8074303 Gtk: call to UIManager.getSystemLookAndFeelClassName() leads to crash
JDK-8075693 ImageInputStreamImpl.readShort/readInt do not behave correctly at EOF
JDK-8078677 IME Composition Window is displayed on incorrect position
JDK-8079144 Java's system LnF on OS X: editable JComboBoxes are being rendered incorrectly
JDK-8085956 OGL text renderer: gamma lut cleanup

Brian Burkhalter, Oracle

Bug Summary
JDK-8074143 (so) Socket adapter sendUrgentData throws IllegalBlockingMode when channel configured non-blocking
JDK-8073151 java.math.BigDecimal.divide(BigDecimal, RoundingMode) produces incorrect result

Bengt Rutisson, Oracle

Bug Summary
JDK-8076083 G1 iterates over JNIHandles two times
JDK-8062517 ParNew promotion failed is serialized on a lock
JDK-8072805 Per-phase timing measurements for strong roots processing
JDK-8076085 Refactor strong root processing in order to allow G1 to evolve separately from GenCollectedHeap
JDK-8076084 Refactor the G1GCPhaseTime logging to make it easier to add new phases
JDK-8076082 Remove temporary G1UseParallelRSetUpdating and G1UseParallelRSetScanning flags

Sean Coffey, Oracle

Bug Summary
JDK-8067721 (fc) FileChannel transferTo should use TransmitFile on Windows
JDK-8068669 (fc) Rename the new jdk.net.enableFastFileTransfer system property to jdk.nio.enableFastFileTransfer
JDK-8071239 (tz) Support tzdata2014g
JDK-8071250 (tz) Support tzdata2014i
JDK-8071258 (tz) Support tzdata2014j
JDK-8071253 [headless] JPopupMenu creation in headless mode with JDK9b23 causes NPE
JDK-8071242 [macosx] Endless loop in EDT on Mac
JDK-8071231 [macosx] Language specific keys does not work in applets when opened outside the browser
JDK-8071233 [macosx] Large JTable cell results in a OutOfMemoryException
JDK-8069187 [TEST_BUG] Test sun/security/tools/keytool/ListKeychainStore.sh fails on Mac
JDK-8071127 Add --with-copyright-year option to configure
JDK-8071252 ByteArrayOutputStream capacity should be maximal array size permitted by VM
JDK-8071186 CMS: JVM intermittently crashes with "FreeList of size 258 violates Conservation Principle" assert
JDK-8071254 Currency update needed for ISO 4217 Amendment #159
JDK-8076756 deadlock in java/io/PrintStream when verbose java.security.debug flags are set
JDK-8129583 Empty optional parameters of LDAP query are not interpreted as empty
JDK-8071917 HTTP Tunnel connection to NTLM proxy reauthenticates instead of using keep-alive
JDK-8069410 HttpServer missing tailing space for some response codes
JDK-8073949 IBM1166 Locale Request for Kazakh characters
JDK-8074418 Improve tracing for java.security.debug=certpath
JDK-8079653 Incorrect property name documented in CORBA InputStream API
JDK-8071184 Increment hsx 25.31 build to b02 for 8u31-b05
JDK-8071187 Increment hsx 25.31 build to b03 for 8u31-b06
JDK-8071189 Increment hsx 25.31 build to b04 for 8u31-b08
JDK-8071174 Increment minor version of HSx for 8u31 and initialize the build number
JDK-8071191 Increment the build value to b05 for hs25.31 in 8u31-b08
JDK-8071193 Increment the build value to b06 for hs25.31 in 8u31-b10
JDK-8071195 Increment the build value to b07 for hs25.31 in 8u31-b11
JDK-8087336 Java 8 cannot load its cacerts in FIPS. no such provider: SunEC
JDK-8071270 javac, follow-up of fix for JDK-8049305
JDK-8071225 JAX-WS handles wrongly xsd:any arguments for Web services
JDK-8071224 JAXB not preserving formatting for xsd:any Mixed content
JDK-8071180 JVM crash with JDK8 (build 1.8.0-b132) with G1 GC
JDK-8075626 keystore and truststore debug output could be much better
JDK-8073980 l10n resource file update for JDK-8068491
JDK-8061483 Memory leak in ProtectionDomain cache
JDK-8071173 new hotspot build - hs25.40-b24
JDK-8071197 new hotspot build - hs25.40-b25
JDK-8071222 NPE seen in XMLDocumentFragmentScannerImpl.setProperty since 7u40b33
JDK-8085935 OpenJDK7 returns incorrect TrueType font metrics
JDK-8071181 Regression in verifier for method call from inside of a branch
JDK-8071179 Segmentation error while running program
JDK-8087308 Setting IP_TOS on java.net sockets not working on unix
JDK-8071240 Several test failing after update to tzdata2014g
JDK-8073873 Socket impls should ignore unsupported proxy types rather than throwing
JDK-8071255 Sorting columns in JFileChooser fails with AppContext NPE
JDK-8071190 stability issues when being launched as an embedded JVM via JNI
JDK-8077734 StackOverflowError during PolicyFile lookup
JDK-8067720 Support SIO_LOOPBACK_FAST_PATH option on Windows
JDK-8079243 The crash reporting URL listed by javac needs to be updated
JDK-8068989 Update references of download.oracle.com to docs.oracle.com in javadoc makefile
JDK-8071192 Update the Crash Reporting URL in the Java crash log
JDK-8068991 Update the protocol for references of docs.oracle.com to HTTPS in langtools.
JDK-8068990 Update the protocol for references of docs.oracle.com to HTTPS.
JDK-8071586 Use private static final char[0] for empty Strings
JDK-8071223 XML parser returns corrupt attribute value
JDK-8073576 ZipEntry/JarEntry.setCreation/LastAccessTime(null) don't throw NPE as specified

Coleen Phillimore, Oracle

Bug Summary
JDK-8079237 [TESTBUG] test/runtime/lambda-features/InvokespecialInterface.java test has unrecognized option
JDK-8079297 AllocateHeap() and ReallocateHeap() should be inlined.

Christian Tornqvist, Oracle

Bug Summary
JDK-8071657 JDI ObjectReferenceImpl.invokeMethod() validation fails for virtual invocations of method with declaring type being an interface

Joe Darcy, Oracle

Bug Summary
JDK-8068654 Make certain annotation classfile warnings opt-in

David Buck, Oracle

Bug Summary
JDK-8078746 Replace fatal() with vm_exit_during_initialization() when an incorrect class is found on the bootclasspath

Dmitry Cherepanov, Azul

Bug Summary
JDK-8068187 Fix Xcode project
JDK-8071564 Focus lost in applet when browser window is minimized and restored
JDK-8068456 Revert project file accidentally pushed
JDK-8067456 Xcode javaws Project to Debug Native Code

Daniel Daugherty, Oracle

Bug Summary
JDK-8074597 perfMemory_solaris.cpp failing to compile with "Error: dd_fd is not a member of DIR."

David Dehaven, Oracle

Bug Summary
JDK-8069550 [macosx] Fix hard-wired paths to JavaVM.framework
JDK-8075400 Cannot build hotspot in jdk8u on OSX 10.10 (Yosemite)

Daniel Fuchs, Oracle

Bug Summary
JDK-8067963 Add a test that will call getDeclaredFields() on all classes and try to set them accessible.
JDK-8074125 Add SerializedLogRecord test to jdk8u

David Holmes, Oracle

Bug Summary
JDK-8079114 [Linux] Replace syscall use in os::fork_and_exec with glibc fork() and execve()
JDK-8077620 [TESTBUG] Some of the hotspot tests require at least compact profile 3
JDK-8129570 AARCH64: testlibrary does not support AArch64
JDK-8067857 Add cross-platform compact profiles support
JDK-8079324 BSD build failures due to undefined macros
JDK-8027914 Client JVM silently exit with fail exit code when running in compact(1,2) with options -Dcom.sun.management and -XX:+ManagementServer
JDK-8087178 Enable hotspot builds on 4.x Linux kernels
JDK-8073511 File leak in MemNotifyThread::start() in hotspot.src.os.linux.vm.os_linux.cpp
JDK-8074814 Fix for 8030115 breaks build on Windows and Solaris
JDK-8087177 JVM fastdebug build compiled with GCC 5 asserts with "widen increases"
JDK-8072057 Minimal VM is broken for ARM fastdebug
JDK-8076144 move closed jvm.cfg files out of open repo
JDK-8078581 Support running regression tests using jtreg_tests+TESTDIRS from top level
JDK-8081781 SystemTap does not work when JDK is compiled with GCC 5
JDK-8073840 Zero builds fails after JDK-6898462
JDK-8073839 Zero+PPC64: Stack overflow when running Maven
JDK-8073841 Zero: Atomic::xchg and Atomic::xchg_ptr need full memory barrier

Dean Long, Oracle

Bug Summary
JDK-8075096 AARCH64: better handling of aarch64- triples
JDK-8075014 AARCH64: Top-level JDK changes
JDK-8072389 build_vm_def.sh not working correctly for new build cross compile
JDK-8072739 C1: Incorrect argument type used for SharedRuntime::OSR_migration_end in LIRGenerator::do_Goto
JDK-8074010 followup to 8072383
JDK-8075015 Make sure configure is run by bash
JDK-8075016 Regression in configure due to JDK-8069057
JDK-8073816 resolve conflicts between open and closed ports
JDK-8072985 support new PTRACE_GETREGSET

Dan Smith, Oracle

Bug Summary
JDK-8077914 Check varargs access against inferred signature
JDK-8077913 Varargs access check mishandles capture variables

Dmitry Markov, Oracle

Bug Summary
JDK-8076996 Focus doesn't move when pressing Shift + Tab keys
JDK-8072386 Incorrect Exception message from java.awt.Desktop.open()

David Chase, Oracle

Bug Summary
JDK-8073610 Locks need better debug-printing support

Dmitriy Samersoff, Independent

Bug Summary
JDK-8077507 serviceability/sa/jmap-hashcode/Test8028623.java fails with AssertionFailure: can not get class data for java/lang/UNIXProcess$Platform$$Lambda

Erik Helin, Oracle

Bug Summary
JDK-8087200 Code heap does not use large pages

Erik Joelsson, Oracle

Bug Summary
JDK-8079352 Add support for Cygwin 2.0
JDK-8075501 Update jtreg bin location in configure
JDK-8074300 ZERO_ARCHDEF incorrectly defined for PPC/PPC64 architectures

Goetz Lindenmaier, SAP

Bug Summary
JDK-8079119 ppc: pass thread to throw_AbstractMethodError

Hannes Wallnoefer, Oracle

Bug Summary
JDK-8086050 add $EXECV command to Nashorn scripting mode
JDK-8075079 Add tests for JSON parsing of numeric keys
JDK-8086049 address Javadoc warnings in Nashorn source code
JDK-8074086 const re-assignment should not reported as a "early error"
JDK-8067215 Disable dual fields when not using optimistic types
JDK-8078697 Eager code generation fails for earley boyer with split threshold set to 1000
JDK-8098583 eval within a 'with' leaks definitions into global scope
JDK-8080471 fix usage of replace and file separator in Nashorn tests
JDK-8078696 Function with same body not reparsed after SyntaxError
JDK-8080390 Fuzzing bug: length valueOf bug
JDK-8066220 Fuzzing bug: MethodHandle bug (Object,Object) != (boolean)Object
JDK-8080391 Fuzzing bug: Object.prototype.toLocaleString(0)
JDK-8080389 Fuzzing bug: parameter counts differ in TypeConverterFactory
JDK-8081838 Fuzzing bug: Parser error on optimistic recompilation
JDK-8080507 Instance properties with getters returning wrong values
JDK-8080508 Javascript for-in loop returned extra keys
JDK-8080509 jjs scripting: need way to quote $EXEC command arguments to protect spaces
JDK-8079468 Nashorn crashes when attempting to start TypeScript compiler
JDK-8068872 Nashorn JSON.parse drops numeric keys
JDK-8079469 Persistent code cache should support more configurations
JDK-8076101 Regex matching causes java.lang.ArrayIndexOutOfBoundsException: 64
JDK-8075366 Slow scope access to global let/const does not work
JDK-8098832 Strict eval throws ClassCastException with large scripts
JDK-8072636 Test for JDK-8068872 fails in tip
JDK-8076099 Threads spinning infinitely in WeakHashMap.get running test262parallel
JDK-8076100 toNumber(String) accepts illegal characters
JDK-8075231 Typed array setters are very slow when index exceeds capacity
JDK-8078012 Undeclared globals in eval code should not be handled as fast scope
JDK-8080303 use path separator setting consistently in Nashorn project properties
JDK-8072635 Various performance issues parsing JSON
JDK-8080414 Very long function names break codegen

Harold Seigel, Oracle

Bug Summary
JDK-8075949 Class verifier accepts an invalid class file
JDK-8047382 hotspot build failed with gcc version Red Hat 4.4.6-4
JDK-8075265 JVM stuck in infinite loop during verification

Ivan Gerasimov, Google

Bug Summary
JDK-8071454 (process) Child is terminated when parent's console is closed [win]
JDK-8081553 ./jndi/ldap/Connection.java needs to avoid spurious wakeup
JDK-8078446 [TEST_BUG] sun/security/pkcs11/sslecc/ClientJSSEServerJSSE.java fails with BindException
JDK-8074044 [TEST_BUG] TimSortStackSize2.java: test cleanup: make test run with single argument
JDK-8080524 [TESTBUG] java/lang/Class/getDeclaredField/FieldSetAccessibleTest.java fails on compact profiles due to unsatisfied dependencies in jsse.jar
JDK-8068388 Better message about incompatible zlib in Deflater.init
JDK-8077344 CipherInputStream throws BadPaddingException if stream is not fully read
JDK-8080637 dns_lookup_realm should be false by default
JDK-8067234 java.security.ProviderException: Error parsing configuration with space
JDK-8075444 jdk/test/Makefile references (to be removed) win32 directory in jtreg
JDK-8074036 KeychainStore requires non-null password to be supplied when retrieving a private key
JDK-8067888 Lazy-init thread safety problems in core reflection
JDK-8080513 Missing space on a boundary of concatenated strings
JDK-8079346 SPNEGO auth fails if client proposes MS krb5 OID
JDK-8071332 StringIndexOutOfBoundsException while reading krb5.conf
JDK-8129859 sun/security/mscapi/ShortRSAKey1024.sh fails intermittently
JDK-8075124 Table's field width in "Use" page generated by javadoc with '-s' is unbalanced
JDK-8073323 TimSort fails with ArrayIndexOutOfBoundsException on worst case long arrays
JDK-8075325 To interpret case-insensitive string locale independently
JDK-8073324 Tune test and document TimSort runs stack size increase

Magnus Ihse Bursie, Oracle

Bug Summary
JDK-8074685 Create custom hook for running after AC_OUTPUT

Igor Ignatyev, Oracle

Bug Summary
JDK-8068282 [TESTBUG] New tests in gc/survivorAlignment/ fails
JDK-8078698 [TESTBUG] remove explicit set build flavor from hotspot/test/compiler/* tests
JDK-8068281 Add tests on alignment of objects copied to survivor space
JDK-8066885 make DeoptimizeALot dependent on number of threads

Igor Veresov, Oracle

Bug Summary
JDK-8071708 assert(!_reg_node[reg_lo] || edge_from_to(_reg_node[reg_lo],def)) failed: after block local scheduling
JDK-8072915 Nondeterministic wrong answer on arithmetic
JDK-8069564 SIGBUS in C2 compiled method weblogic.wsee.jaxws.framework.jaxrpc.EnvironmentFactory$SimulatedWsdlDefinitions.
JDK-8077752 SPARC PICL causes significantly longer startup times

Jaroslav Bachorík, DataDog

Bug Summary
JDK-8077953 [TEST_BUG] com/sun/management/OperatingSystemMXBean/TestTotalSwap.java Compilation failed after JDK-8077387
JDK-8077387 [TEST_BUG] com/sun/management/OperatingSystemMXBean/TestTotalSwap.sh fails on OS X with exit code 2
JDK-8068190 [TEST_BUG] java/lang/management/MemoryMXBean/LowMemoryTest.java fails intermittently
JDK-8068189 [TEST_BUG] java/lang/management/ThreadMXBean/Locks.java fails intermittently, blocked on wrong object
JDK-8077386 [TEST_BUG] java/lang/management/ThreadMXBean/SynchronizationStatistics.java intermittently failed with NPE
JDK-8068182 java/lang/management/ThreadMXBean/SynchronizationStatistics.java fails intermittently
JDK-8068188 javax/management/remote/mandatory/notif/NotificationAccessControllerTest.java fails in JDK8-B22
JDK-8080222 nsk/jdi/ExceptionEvent/_itself_/exevent006 and exevent008 tests fail with InvocationTargetException
JDK-8077388 Race condition in java/lang/management/ThreadMXBean/AllThreadIds.java
JDK-8068406 TEST_BUG: java/lang/Thread/ThreadStateTest.java can't compile with change for 8058506
JDK-8068343 ThreadMXBeanStateTest throws exception
JDK-8077385 Timeout in LowMemoryTest.java

Jan Lahoda, Oracle

Bug Summary
JDK-8069190 Compiler may generate wrong InnerClasses attribute for static enum reference
JDK-8076058 Debugger doesn't show variables *outside* lambda
JDK-8076595 Debugger has no access to outer variables inside Lambda
JDK-8080624 Deeply chained expressions + several overloads + unnecessary inference result in excessive compile times.
JDK-8085883 Java compiler performance degradation jdk1.7 vs. jdk1.6 should be amended
JDK-8076594 javac -parameters does not emit parameter names for lambda expressions
JDK-8087116 NullPointerException compiling annotation values that have bodies
JDK-8081451 Using Lambda Expression with name clash results in ClassFormatError
JDK-8077258 Wrong LineNumberTable for default constructors

Jesper Wilhelmsson, Oracle

Bug Summary
JDK-8076102 [TESTBUG] Conflicting GC combinations in hotspot tests
JDK-8086111 BACKOUT - metaspace/shrink_grow/CompressedClassSpaceSize fails with OOM: Compressed class space
JDK-8076077 gc/g1/TestShrinkAuxiliaryData15.java fails with java.lang.RuntimeException: heap decommit failed - after > before

Kevin Walls, Oracle

Bug Summary
JDK-8067864 [TEST_BUG] serviceability/sa/jmap-hashcode/Test8028623.java has utf8 character corrupted by earlier merge
JDK-8071508 Agent NullPointerException when rmi.port in use
JDK-8067856 CPU detection gives 0 cores per cpu, 2 threads per core in Amazon EC2 environment
JDK-8074692 Infinite loop reading types during jmap attach.
JDK-8074488 JavaSecurityAccess.doIntersectionPrivilege() drops the information about the domain combiner of the stack ACC
JDK-8071849 Memory leak in JvmtiEnv::GetConstantPool
JDK-8074489 Test fails with java.security.AccessControlException: access denied ("java.security.SecurityPermission" "getDomainCombiner")
JDK-8067863 Test serviceability/sa/jmap-hashcode/Test8028623.java fails on some Linux/Mac machines.

Konstantin Shefov, Azul

Bug Summary
JDK-8078339 [TEST_BUG] java/awt/SplashScreen/MultiResolutionSplash/MultiResolutionSplashTest.java fails
JDK-8129113 [TESTBUG] Timeout java/lang/invoke/MethodHandles/CatchExceptionTest.java
JDK-8085916 Add RowSetMetaDataImpl Tests and add column range validation to isdefinitlyWritable
JDK-8071587 Adjust java/lang/invoke/LFCaching/LFGarbageCollectedTest.java for recent changes in java.lang.invoke
JDK-8081479 Backport JDBC tests from JDK 9 from test/java/sql and test/javax/sql to JDK 8u.
JDK-8085920 BaseRowSet returns the wrong default value for escape processing
JDK-8129118 java/lang/invoke/MethodHandles/CatchExceptionTest.java fails intermittently
JDK-8129784 javax/net/ssl/ciphersuites/DisabledAlgorithms.java fails intermittently
JDK-8085902 LFGarbageCollectedTest.java fails with OOME: "GC overhead limit exceeded"
JDK-8129580 LFMultiThreadCachingTest.java failed with ConcurrentModificationException
JDK-8085918 RowSetWarning does not correctly chain warnings
JDK-8129124 Several java/lang/invoke tests fail due to exhausted code cache
JDK-8129222 TEST_BUG: Tests java/lang/invoke/LFCaching fail when run with -Xcomp option

Kumar Srinivasan, VMWare

Bug Summary
JDK-8073972 Deprecate Multi-Version Java Launcher (mJRE) for JDK8

Vladimir Kozlov, Oracle

Bug Summary
JDK-8080314 8011102 changes may cause incorrect results.
JDK-8072437 [TESTBUG] Aix support in hotspot jtreg tests
JDK-8076030 AIX: clean-up HotSpot make files
JDK-8076029 AIX: link libjvm.so with -bernotok to detect missing symbols at build time and suppress warning 1540-1639
JDK-8072446 assert(!failing()) failed: Must not have pending failure. Reason is: out of memory
JDK-8065976 c.o.j.t.Platform::isX86 and isX64 may simultaneously return true
JDK-8065977 compiler/rtm/ tests fail due to monitor deflation at safepoint synchronization
JDK-8079064 Extend WhiteBox API with methods that check monitor state and force safepoint
JDK-8067906 Fix includes after 8058148: MaxNodeLimit and LiveNodeCountInliningCutoff
JDK-8069543 SIGSEGV in c2 compiled code with OptimizeStringConcat
JDK-8076512 ZERO variant build is broken

Marcus Lagergren, Independent

Bug Summary
JDK-8075316 Fuzzing bug: new ArrayBuffer() throws exception

Svetlana Steuck, Oracle

Bug Summary
JDK-8130217 (tz) Support tzdata2015e
JDK-8130216 [TEST_BUG] test/javax/xml/ws/8046817/GenerateEnumSchema.java creates files in test.src
JDK-8079361 Broken Localization Strings (XMLSchemaMessages_de.properties)
JDK-8068886 IDEA IntelliJ crashes in objc_msgSend when an accessibility tool is enabled

Mikhail Cherkasov, Oracle

Bug Summary
JDK-8071380 Deadlock in awt/logging apparently introduced by 8019623
JDK-8081826 Drawing deviates when validate() is invoked on java.awt.ScrollPane
JDK-8077625 Frame is not created on the specified GraphicsDevice with two monitors
JDK-8066985 Java Webstart downloading packed files can result in Timezone set to UTC

Mandy Chung, Oracle

Bug Summary
JDK-8068548 jdeps needs a different mechanism to recognize javax.jnlp as supported API
JDK-8080891 jdeps shows "not found" if target class has no reference other than its own package
JDK-8080815 Update 8u jdeps list of internal APIs

Maurizio Cimadamore, Oracle

Bug Summary
JDK-8081020 Inference failure with nested invocation
JDK-8069181 java.lang.AssertionError when compiling JDK 1.4 code in JDK 8
JDK-8078258 Javac erroneously uses instantiated signatures when merging abstract most-specific methods

Michael Fang, Oracle

Bug Summary
JDK-8083601 jdk8u60 l10n resource file translation update 2

Markus Grönlund, Oracle

Bug Summary
JDK-8065331 Add trace events for failed allocations
JDK-8077249 Clean up around VM_GC_Operations
JDK-8077343 Event based tracing locks to rank as leafs where possible
JDK-8081296 HotSpot fails to wrap Exceptions from invokedynamic in a BootstrapMethodError
JDK-8081789 JVM crashes in JNI if toString is declared as an interface method
JDK-8077256 Refactor VM GC operations caused by allocation failure

Yumin Qi, Oracle

Bug Summary
JDK-8080468 Bogus -Xcheck:jni warning for SIG_INT action for SIGINT in JVM started from non-interactive shell

Mark Sheppard, Oracle

Bug Summary
JDK-8067151 [TESTBUG] com/sun/corba/5036554/TestCorbaBug.sh
JDK-8075763 RMI-IIOP communication fails when ConcurrentHashMap is passed to remote method

Nils Eliasson, Oracle

Bug Summary
JDK-8064796 'Full GC' events miss date stamp information occasionally

Mario Torre, Red Hat

Bug Summary
JDK-8074017 Java application menu misbehaves when running multiple screen stacked vertically
JDK-8069305 Printing to Postscript doesn't support dieresis

Masayoshi Okutsu, Independent

Bug Summary
JDK-8077922 (tz) TimeZone.getDefault() call returns incorrect value in Windows terminal session
JDK-8076036 DateFormat in german locale returns wrong value for month march
JDK-8074951 Long-form date format incorrect month string for Finnish locale
JDK-8055359 Optimization for locale resources loading isn't working
JDK-8076219 SimpleDateFormat formatting of "LLLL" in English is incorrect; should be identical to "MMMM"
JDK-8073448 Unpredictable timezone on Windows when OS's timezone is not found in tzmappings

Omair Majid, Red Hat

Bug Summary
JDK-8121932 SetupNativeCompilation ignores CFLAGS_release for cpp files

Poonam Bajaj Parhar, Oracle

Bug Summary
JDK-8072804 -Xcheck:jni improvements to exception checking and excessive local refs
JDK-8080412 Excessive checked JNI warnings from Java startup
JDK-8073410 jstack not working on core files
JDK-8065302 SA update
JDK-8087149 VM hangs in C2Compiler

Philip Race, Oracle

Bug Summary
JDK-8078129 [embedded] java.awt.GraphicsDevice.get/setDisplayMode behavior is incorrect when no display is present
JDK-8085925 [macosx] Native font lookup uses family+style, not full name/postscript name
JDK-8071937 [solaris] libfontmanager should be linked against headless awt library
JDK-8079190 CloseTTFontFileFunc callback should be removed
JDK-8080794 Path2D copy constructors and clone method propagate size of arrays from source path
JDK-8080810 Path2D storage growth algorithms should be less linear
JDK-8104577 Remove debugging message from Font2DTest demo
JDK-8078338 Upgrade JDK to use LittleCMS 2.7

Paul Sandoz, Oracle

Bug Summary
JDK-8080623 CPU overhead in FJ due to spinning in awaitWork
JDK-8069302 Deprecate Unsafe monitor methods in JDK 8u release
JDK-8069578 Inconsistent exception handling in CompletableFuture.thenCompose
JDK-8129105 LinkedTransferQueue.spliterator can report LTQ.Node object, not T
JDK-8079701 Missed submissions in ForkJoinPool
JDK-8072469 Race condition in ThenComposeExceptionTest.java
JDK-8129945 Terminal operation properties should not be back-propagated to upstream operations

Pete Brunet, Oracle

Bug Summary
JDK-8079828 Java version applet hangs with Voice over turned on

Robert Mckenna, Oracle

Bug Summary
JDK-8075627 (sctp) com/sun/nio/sctp/SctpMultiChannel/SendFailed.java fails on Solaris only
JDK-8073345 (sctp) InternalError when receiving SendFailedNotification
JDK-8071920 (sctp) Possible race initializing native IDs
JDK-8132931 [macosx] Crash during JMC or JavaFX execution when NSApplication is controlled by SWT or JavaFX libraries
JDK-8080957 Coding regression in HKSCS charsets
JDK-8072948 Failed Java web start via IPv6 (Java7u71 or later)
JDK-8087204 Inet4AddressImpl regression caused by JDK-7180557
JDK-8078702 IPv6 Nameservers in resolv.conf throws NumberFormatException
JDK-8080871 javac does not recognize '*.java' as file if '-J' option is specified
JDK-8080872 LoginContext Subject ignored by jdk8 sun.net.www.protocol.http.HttpURLConnection
JDK-8074944 Only the first DNSName entry is checked for endpoint identification
JDK-8078390 Support ISO 4217 "Current funds codes" table (A.2)
JDK-8081590 The CDS classlist needs to be updated for 8u60
JDK-8130913 Wrong changes were pushed with 8068886

Roland Westrelin, Red Hat

Bug Summary
JDK-8069278 assert(fm == NULL || fm->method_holder() == _participants[n]) failed: sanity
JDK-8074986 C2 code generator can replace -0.0f with +0.0f on Linux
JDK-8080660 C2: CmpU nodes can end up with wrong type information
JDK-8076152 Compilation of constant array containing different sub classes crashes the JVM
JDK-8087148 compiler/eliminateAutobox/6934604/TestIntBoxing.java assert(p_f->Opcode() == Op_IfFalse) failed
JDK-8081054 Integer.toString(int value) sometimes throws NPE
JDK-8085808 Unsafe load can loose control dependency and cause crash
JDK-8085807 volatile double accesses are not explicitly atomic in C2

Roger Riggs, Oracle

Bug Summary
JDK-8062803 'principal' should be 'principle' in java.time package description
JDK-8114855 Fix typos, errors and Javadoc differences in java.time
JDK-8129577 GetVersionEx in java.base/windows/native/libjava/java_props_md.c might not get correct Windows version
JDK-8114856 java.time javadoc error in DateTimeFormatter::parsedLeapSecond
JDK-8114857 java.time package javadoc typos
JDK-8062796 java.time.format.DateTimeFormatter error in API doc example
JDK-8072419 java/lang/ProcessBuilder/Basic.java: waitFor didn't take long enough
JDK-8081432 java/time/test/java/time/format/TestZoneTextPrinterParser.java fails by timeout on slow device
JDK-8081419 langtools/test/Makefile should not use OS-specific jtreg binary
JDK-8067376 Object.wait(ms, ns) timeout returns early

Sergey Bylokhov, Amazon

Bug Summary
JDK-8078694 [macosx] Initialization of Cocoa hangs if CoreAudio was initialized before
JDK-8069104 [macosx] jdk8, jdk7u60 Regression in Graphics2D drawing of derived Fonts
JDK-8078691 [macosx] Label shortening via " ... " broken when String contains combining diaeresis
JDK-8075028 [macosx] Mac 10.10: Application run with splash screen has focus issues
JDK-8085862 [macosx] The text of the TextArea is not wrapped at word boundaries
JDK-8085859 [macosx] Unused code in LWCToolkit.m
JDK-8085860 [OGL] "java.lang.InternalError: not implemented yet" during the blit of VI to VI in xor mode
JDK-8078680 abort flag is not cleared for every write operation for JPEG ImageWriter
JDK-8078688 Animated icon is not visible by click on menu
JDK-8078686 Attempting to remove help menu from java.awt.MenuBar throws NullPointerException
JDK-8078692 BufferedImage::getPropertyNames() always returns null
JDK-8078693 Dead/outdated links in Javadoc of package java.beans
JDK-8067791 Deadlock in SystemFlavorMap.getFlavorsForNative and SunToolkit.awtLock
JDK-8078687 example in JFormattedTextField API docs instantiates abstract class
JDK-8073871 GUI perfomance are very slow compared java 1.6.0_45
JDK-8075620 java.awt.Checkbox.setState() call causes ItemEvent to be filed
JDK-8085856 JavaDoc for JSpinner contains errors
JDK-8078683 JDesktopPane,JFileChooser violate encapsulation by returning internal Dimensions
JDK-8078695 JMenuBar looks bad under retina
JDK-8078681 JPGWriter does not throw UnsupportedException when canWriteSequence retuns false
JDK-8078682 link back to self in javadoc JTextArea.replaceRange()
JDK-8046415 NullPointerException and no event received when clipboard data flavor changes
JDK-8085857 OutOfMemoryError: RepaintManager doesn't clean up cache of volatile images
JDK-8078690 Pending String deadlocks UIDefaults
JDK-8085855 Reg test: java/awt/Component/isLightweightCrash/StubPeerCrash.java fails
JDK-8078684 Some Swing classes violate encapsulation by returning internal Insets
JDK-8078685 Swing's Threading Policy example does not compile
JDK-8085861 Tremendous memory usage by JTextArea
JDK-8085854 Typo in JInternalFrame setDefaultCloseOperation() doc (WindowClosing --> internalFrameClosing)

Xueming Shen, Independent

Bug Summary
JDK-8077093 getNextEntry throws ArrayIndexOutOfBoundsException when unzipping file

Volker Simonis, Amazon

Bug Summary
JDK-8071687 AIX port of "8039173: Propagate errors from Diagnostic Commands as exceptions in the attach framework"
JDK-8071697 AIX port of "8050807: Better performing performance data handling"
JDK-8098572 EmptyStackException at startup if running with extended or unsupported charset
JDK-8076481 GraphicsEnvironment.getHeadlessProperty() does not work for AIX
JDK-8080749 PPC64: Fix wrong rotate instructions in the .ad file

Shanliang Jiang, Oracle

Bug Summary
JDK-8068179 [TEST_BUG] javax/management/monitor/CounterMonitorTest.java hangs
JDK-8077684 [TEST_BUG] javax/management/remote/mandatory/notif/NotSerializableNotifTest.java fails due to Port already in use: 2468
JDK-8068191 DeadlockTest.java failed with negative timeout value
JDK-8068917 Used for the fix push for JDK-8038322: CounterMonitorDeadlockTest.java fails intermittently, presumed deadlock

Stefan Johansson, Oracle

Bug Summary
JDK-8080784 G1: jmap -heap reports the wrong number of regions
JDK-8073075 jmap reports unexpected used/free size of concurrent mark-sweep generation
JDK-8073316 JVM crashes during GC on various asserts which checks that HeapWord ptr is an oop
JDK-8074094 Simplify ArgumentsExt and remove unneeded functionallity
JDK-8068988 Usage of UseHugeTLBFS, UseLargePagesInMetaspace and huge SurvivorAlignmentInBytes cause crashes in CMBitMapClosure::do_bit

Staffan Larsen, Oracle

Bug Summary
JDK-8098544 com/sun/jdi tests are failing with "Error. failed to clean up files after test" with jtreg 4.1 b12
JDK-8072617 Hide lambda proxy frames in stacktraces
JDK-8078591 jdb eval java.util.Arrays.asList(array) shows inconsistent behaviour

Serguei Spitsyn, Oracle

Bug Summary
JDK-8076435 "java.lang.NullPointerException: Method name is null" from StackTraceElement.
JDK-8076150 JSR 292: assert(type() == T_OBJECT) failed: type check
JDK-8075405 jvmtiRedefineClasses.cpp: guarantee(false) failed: OLD and/or OBSOLETE method(s) found
JDK-8072661 jvmtiStringPrimitiveCallback should not be invoked when string value is null
JDK-8079137 more performance issues in class redefinition
JDK-8078728 Popping a stack frame after exception breakpoint sets last method param to exception
JDK-8075406 the constantPoolCacheOopDesc::adjust_method_entries() used in RedefineClasses does not scale

Stefan Karlsson, Oracle

Bug Summary
JDK-8077278 Verification in ClassLoaderData::is_alive is too slow
JDK-8076297 Wrong volatile qualifier for field ClassLoaderDataGraphKlassIteratorAtomic::_next_klass

Sundararajan Athijegannathan, Oracle

Bug Summary
JDK-8068650 $jdk/api/javac/tree contains docs for nashorn
JDK-8068455 (typo in the spec) javax.script.ScriptEngineFactory.getLanguageName
JDK-8080139 -d option should dump script source as well
JDK-8068447 @since and @jdk.Exported are missing in jdk.nashorn.api.scripting classes and package-info.java files
JDK-8085971 add autoimports sample script to easily explore Java classes in interactive mode
JDK-8086051 Add compiler error tests when syntax extensions are used with --no-syntax-extensions option
JDK-8072756 Add regression tests for 8071678 and 8071594
JDK-8080850 ant javadoc target is broken
JDK-8080262 Array.prototype.sort throws IAE on inconsistent comparison
JDK-8067862 bound java static method throws NPE when 'null' is used for this argument
JDK-8080292 BrowserJSObjectLinker should give priority to beans linker for property get/set
JDK-8129326 Convert Scope from interface to class
JDK-8080874 delete of bound Java method property results in crash
JDK-8081673 engine.eval call from a java method which was called from a previous engine.eval results in wrong ScriptContext being used.
JDK-8081684 erroneous dot file generated from Nashorn --print-code
JDK-8098846 Global scope is not accessible with indirect load call
JDK-8075941 Global scope should be initialized lazily
JDK-8074030 Indirect eval fails when used as an element of an array or as a property of an object
JDK-8087332 Indirect evals should be strict with -strict option
JDK-8080851 Javadoc warnings in Global.java after lazy initialization
JDK-8068521 javax.script.ScriptEngineFactory.getParameter spec is not completely consistent with the rest of the API
JDK-8080887 jdk.nashorn.internal.runtime.arrays.IntArrayData.convert assertion
JDK-8081333 jjs "nashorn.args" system property is not effective when script arguments are passed
JDK-8075614 jjs exits even when non-daemon threads are still active
JDK-8079826 Misleading error message when explicit signature constructor is called with wrong arguments
JDK-8085888 Missing final modifier in method parameters (nashorn code convention)
JDK-8129327 nasgen prototype, instance member count calculation is wrong
JDK-8085896 Nashorn $ENV.PWD is originally undefined
JDK-8085969 Nashorn -nse option causes parse error on anonymous function definition
JDK-8072672 nashorn should not use obj.getClass() for null checks
JDK-8081299 Nashorn test framework @argument does not handle quoted strings
JDK-8077005 nashorn tests should avoid using package names used by nashorn sources
JDK-8072695 NashornScriptEngine returns javax.script.ScriptContext instance with insonsistent get/remove methods behavior for undefined attributes
JDK-8068575 NashornScriptEngineFactory.getParameter() throws IAE for an unknown key, doesn't conform to the general spec
JDK-8114845 obj."prop" and obj.'prop' should result in SyntaxError
JDK-8087194 regression: apply on $EXEC fails with ClassCastException
JDK-8081685 rename ScriptingFunctions.tokenizeCommandLine
JDK-8085915 Return value of Objects.requireNonNull call can be used
JDK-8077115 Several nashorn tests failing
JDK-8080606 SimpleScriptContext used by NashornScriptEngine doesn't completely complies to the spec regarding exception throwing
JDK-8075801 Startup time: Port shell.js to Java
JDK-8078384 Test execution blocker: Nashorn testsuite failing due to compile error in jdk/nashorn/api/scripting/test/ScriptEngineTest.java
JDK-8081355 Test missed for the fix of JDK-8007456 backport to jdk8u-dev
JDK-8080748 The spec on javax.script.Compilable contains a typo and confusing inconsistency
JDK-8080271 too strong assertion on function expression names
JDK-8080291 Wrong 'this' bound to eval call within a function when caller's 'this' is a Java object

Tobias Hartmann, Oracle

Bug Summary
JDK-8081502 8068945 changes break building the zero JVM variant
JDK-8075823 Allow ADLC register class to depend on runtime conditions also for cisc-spillable classes
JDK-8080383 assert(((ABS(iv_adjustment_in_bytes) % elt_size) == 0)) fails in superword.cpp
JDK-8079126 C2's superword optimization causes unaligned memory accesses
JDK-8080143 Crash in PhaseIdealLoop with "assert(!had_error) failed: bad dominance"
JDK-8073966 hotspot, "impossible" assertion failure
JDK-8068336 Refactor native stack printing from vmError.cpp to debug.cpp to make it available in gdb as well
JDK-8072465 Use RBP register as proper frame pointer in JIT compiled code on x86

Thomas Schatzl, Oracle

Bug Summary
JDK-8078375 [TESTBUG] gc/g1/TestLargePageUseForAuxMemory.java specifies wrong library path
JDK-8078169 Add method to WhiteBox to get vm pagesize.
JDK-8076354 assert(is_available(index)) failed in G1 cset
JDK-8076067 Clean up G1 remembered set oop iteration
JDK-8076065 Decrease Hot Card Cache Lock contention
JDK-8078850 Eagerly reclaimed humongous objects left on mark stack
JDK-8078848 Early reclaim of large objects that are referenced by a few objects
JDK-8078167 G1 ignores AlwaysPreTouch
JDK-8075811 G1TraceReclaimDeadHumongousObjectsAtYoungGC only prints humongous object liveness output when there is at least one candidate humongous object
JDK-8076064 Hot card cache flush chunk size too coarse grained
JDK-8075812 Improved handling of age during object copy in G1
JDK-8076063 Object copy time regressions after JDK-8031323 and JDK-8057536
JDK-8078166 os::commit_memory on Solaris uses aligment_hint as page size
JDK-8075952 Refactor G1s usage of save_marks and reduce related races
JDK-8078853 SATB apply_closure_to_completed_buffer should have closure argument
JDK-8075215 SATB buffer processing found reclaimed humongous object
JDK-8078852 SATB queue pre-filter verify found reclaimed humongous object
JDK-8078849 Simplify deal_with_reference
JDK-8078250 SPECjvm2008-Derby -2.7% performance regression on Solaris-X64 starting with 9-b29
JDK-8078168 TestParallelHeapSizeFlags fails with unexpected heap size
JDK-8078251 TracePageSizes output reports wrong page size on Windows with G1
JDK-8078854 verify_no_cset_oops found reclaimed humongous object in SATB buffer
JDK-8078170 VirtualSpace does not use large pages
JDK-8076066 When iterating over a card, G1 often iterates over much more references than are contained in the card

Vadim Pakhnushev, Independent

Bug Summary
JDK-8081302 Could not enable D3D pipeline

Valerie Peng, Oracle

Bug Summary
JDK-8068559 SHA1WithDSA with key > 1024 bits not working

Vincent Ryan, Oracle

Bug Summary
JDK-8079387 NullPointerException in PKCS#12 Keystore in PKCS12KeyStore.java
JDK-8062552 Support keystore type detection for JKS and PKCS12 keystores

Vladimir Ivanov, Oracle

Bug Summary
JDK-8065967 C2: inlining failure due to access checks being too strict
JDK-8068934 C2: uncommon trap w/ Reason_speculate_class_check causes performance regression due to continuous deoptimizations
JDK-8071925 CountingWrapper.asType() is broken
JDK-8078291 Customize adapted MethodHandle in MH.invoke() case
JDK-8071764 Customize LambdaForms which are invoked using MH.invoke/invokeExact
JDK-8077720 DMH LFs should be customizeable
JDK-8085964 GWT can be marked non-compilable due to deopt count pollution
JDK-8078523 LambdaForm.prepare() does unnecessary work for cached LambdaForms
JDK-8064326 Never taken branches should be pruned when GWT LambdaForms are shared
JDK-8074549 Never-taken branches cause repeated deopts in MHs.GWT case

Vicente Arturo Romero Zaldivar, Oracle

Bug Summary
JDK-8068546 javac generates LVT entry with length 0 for local variable
JDK-8069546 javac, shouldn't check nested stuck lambdas during overload resolution
JDK-8073436 Redundant CONSTANT_Class entry not generated for inlined constant
JDK-8068547 remove unnecessary complexity in Flow and Bits, after JDK-8064857

Xue-Lei Fan, Oracle

Bug Summary
JDK-8077220 Disable RC4 cipher suites

Yuri Nesterenko, Azul

Bug Summary
JDK-8077866 [TESTBUG] Some of java.lang tests cannot be run on compact profiles 1, 2