PUSHES REPORT: 8u65

This report shows who pushed the backports to the given release. This usually shows who did the backporting, testing, and review work.

Report generated: Wed Dec 01 02:27:17 CET 2021

Distribution by priority

Count Priority

Distribution by components

Count Component
0 100% Total

Distribution by affiliation

Count Committer
0 100% Total

Chronological push log:

Days Ago Committer Affiliation Bug Summary

No changesets log

JDK-8144283 [ARM] missing i.MX sources for armv5, armv7 soft float build
JDK-8138844 Clean up nio genConstants
JDK-8137286 [de] Missing the link of license agreement
JDK-8135194 HTTPS hostname invalid issue with InetAddress
JDK-8134536 (tz) Support tzdata2015f
JDK-8133941 REGRESSION: Hidden applet does not load in 8u60 and 8u65
JDK-8133862 Incorrect copyright year associated with the key 'NSHumanReadableCopyright' for JRE8u66
JDK-8133745 [TEST_BUG]: java/util/regex/RegExTest.java fails intermittently
JDK-8133743 [TESTBUG] Test javax/swing/JFileChooser/8002077/bug8002077.java fails
JDK-8133735 IPS bundle build failed on S11.1
JDK-8133089 [macosx] Crash during JMC or JavaFX execution when NSApplication is controlled by SWT or JavaFX libraries
JDK-8132930 [TEST_BUG]: java/rmi/transport/pinClientSocketFactory/PinClientSocketFactory.java fails intermittently
JDK-8132262 The CDS classlist needs to be updated for 8u60
JDK-8132261 Wrong changes were pushed with 8068886
JDK-8131657 new hotspot build - hs25.60-b23
JDK-8131656 JVM times out with vdbench on SPARC M7-16
JDK-8131655 nmethod related crash in CMS
JDK-8131009 Java adapters with class-level overrides should preserve variable arity constructors
JDK-8131008 nasgen prototype, instance member count calculation is wrong
JDK-8131007 Convert Scope from interface to class
JDK-8131006 obj."prop" and obj.'prop' should result in SyntaxError
JDK-8131005 Global scope is not accessible with indirect load call
JDK-8131004 Strict eval throws ClassCastException with large scripts
JDK-8131003 eval within a 'with' leaks definitions into global scope
JDK-8131002 remove unnecessary complexity in Flow and Bits, after JDK-8064857
JDK-8130996 (tz) Support tzdata2015e
JDK-8130995 [TEST_BUG] test/javax/xml/ws/8046817/GenerateEnumSchema.java creates files in test.src
JDK-8130993 Terminal operation properties should not be back-propagated to upstream operations
JDK-8130991 sun/security/mscapi/ShortRSAKey1024.sh fails intermittently
JDK-8130990 Java 8 cannot load its cacerts in FIPS. no such provider: SunEC
JDK-8130989 [TESTBUG] java/lang/Class/getDeclaredField/FieldSetAccessibleTest.java fails on compact profiles due to unsatisfied dependencies in jsse.jar
JDK-8130988 [PIT] Test closed/java/awt/FullScreen/DisplayMode/CycleDMImage.java switches Linux to the single device mode
JDK-8130987 Deadlock with multimonitor fullscreen windows.
JDK-8130986 javax/net/ssl/ciphersuites/DisabledAlgorithms.java fails intermittently
JDK-8130985 Empty optional parameters of LDAP query are not interpreted as empty
JDK-8130984 LFMultiThreadCachingTest.java failed with ConcurrentModificationException
JDK-8130983 GetVersionEx in java.base/windows/native/libjava/java_props_md.c might not get correct Windows version
JDK-8130982 TEST_BUG: Tests java/lang/invoke/LFCaching fail when run with -Xcomp option
JDK-8130981 Several java/lang/invoke tests fail due to exhausted code cache
JDK-8130980 java/lang/invoke/MethodHandles/CatchExceptionTest.java fails intermittently
JDK-8130979 [TESTBUG] Timeout java/lang/invoke/MethodHandles/CatchExceptionTest.java
JDK-8130978 LinkedTransferQueue.spliterator can report LTQ.Node object, not T
JDK-8130977 8077982 giflib upgrade breaks system giflib builds with earlier versions
JDK-8130976 java.time package javadoc typos
JDK-8130975 java.time javadoc error in DateTimeFormatter::parsedLeapSecond
JDK-8130974 java.time.format.DateTimeFormatter error in API doc example
JDK-8130973 'principal' should be 'principle' in java.time package description
JDK-8130972 Fix typos, errors and Javadoc differences in java.time
JDK-8130971 Remove debugging message from Font2DTest demo
JDK-8130969 DateFormat for Singapore/English locale (en_SG) is M/d/yy instead of d/M/yy
JDK-8130968 EmptyStackException at startup if running with extended or unsupported charset
JDK-8130967 OperationTimedOut exception inside from XToolkit.syncNativeQueue call on Ubuntu 15.04
JDK-8130966 com/sun/jdi tests are failing with "Error. failed to clean up files after test" with jtreg 4.1 b12
JDK-8130965 Broken Localization Strings (XMLSchemaMessages_de.properties)
JDK-8130955 GWT can be marked non-compilable due to deopt count pollution
JDK-8130954 AARCH64: testlibrary does not support AArch64
JDK-8130953 new hotspot build - hs25.60-b22
JDK-8130947 SetupNativeCompilation ignores CFLAGS_release for cpp files
JDK-8129878 [mac os x] Update '3 Billion Devices' Advert on SetupProgress Dialog
JDK-8129875 [windows 8] S. Chinese quotation mark needs to be replaced by English quotation mark
JDK-8129869 VM hangs in C2Compiler
JDK-8129868 Code heap does not use large pages
JDK-8129867 new hotspot build - hs25.60-b21
JDK-8129863 The applet thrown NullPointerException when loading it
JDK-8129212 Indirect evals should be strict with -strict option
JDK-8129211 regression: apply on $EXEC fails with ClassCastException
JDK-8129210 Add compiler error tests when syntax extensions are used with --no-syntax-extensions option
JDK-8129209 add $EXECV command to Nashorn scripting mode
JDK-8129208 address Javadoc warnings in Nashorn source code
JDK-8129207 add autoimports sample script to easily explore Java classes in interactive mode
JDK-8129206 Nashorn -nse option causes parse error on anonymous function definition
JDK-8129205 Return value of Objects.requireNonNull call can be used
JDK-8129204 Nashorn $ENV.PWD is originally undefined
JDK-8129203 Missing final modifier in method parameters (nashorn code convention)
JDK-8129202 Fuzzing bug: Parser error on optimistic recompilation
JDK-8129201 JSONListAdapter should delegate its [[DefaultValue]] to wrapped object
JDK-8129200 JSON-friendly wrapper for objects
JDK-8129199 Fuzzing bug: MethodHandle bug (Object,Object) != (boolean)Object
JDK-8129198 reduce dependency of Nashorn tests on external components
JDK-8129197 transparently download testng.jar for Nashorn testing
JDK-8129196 fix Nashorn ant externals command
JDK-8129195 rename ScriptingFunctions.tokenizeCommandLine
JDK-8129194 erroneous dot file generated from Nashorn --print-code
JDK-8129193 Fuzzing bug: And jdk.nashorn.internal.runtime.Source#byteToCharArray: Detection for UTF-32LE does not work because it has the same prefix as UTF-16LE.
JDK-8129192 engine.eval call from a java method which was called from a previous engine.eval results in wrong ScriptContext being used.
JDK-8129191 ListAdapter throws NPE when adding/removing elements outside of JS context
JDK-8129190 NullPointerException compiling annotation values that have bodies
JDK-8129189 Java compiler performance degradation jdk1.7 vs. jdk1.6 should be amended
JDK-8129188 Using Lambda Expression with name clash results in ClassFormatError
JDK-8129187 Deeply chained expressions + several overloads + unnecessary inference result in excessive compile times.
JDK-8129186 Redundant CONSTANT_Class entry not generated for inlined constant
JDK-8129179 gcc compiler warnings in closed source code
JDK-8129178 Type1 font not loaded by java.awt.Font.createFont
JDK-8129175 Setting IP_TOS on java.net sockets not working on unix
JDK-8129173 Coding regression in HKSCS charsets
JDK-8129172 Inet4AddressImpl regression caused by JDK-7180557
JDK-8129171 OpenJDK7 returns incorrect TrueType font metrics
JDK-8129170 StackOverflowError during PolicyFile lookup
JDK-8129169 OGL text renderer: gamma lut cleanup
JDK-8129167 [macosx] Native font lookup uses family+style, not full name/postscript name
JDK-8129166 Dragged events for extra mouse buttons (4,5,6) are not generated on JSplitPane
JDK-8129165 BaseRowSet returns the wrong default value for escape processing
JDK-8129164 RowSetWarning does not correctly chain warnings
JDK-8129163 Add RowSetMetaDataImpl Tests and add column range validation to isdefinitlyWritable
JDK-8129162 [TESTBUG] Some of java.lang tests cannot be run on compact profiles 1, 2
JDK-8129161 LFGarbageCollectedTest.java fails with OOME: "GC overhead limit exceeded"
JDK-8129159 [macosx] The text of the TextArea is not wrapped at word boundaries
JDK-8129158 Tremendous memory usage by JTextArea
JDK-8129157 GUI perfomance are very slow compared java 1.6.0_45
JDK-8129156 [OGL] "java.lang.InternalError: not implemented yet" during the blit of VI to VI in xor mode
JDK-8129155 [macosx] Unused code in LWCToolkit.m
JDK-8129154 OutOfMemoryError: RepaintManager doesn't clean up cache of volatile images
JDK-8129153 JavaDoc for JSpinner contains errors
JDK-8129152 Reg test: java/awt/Component/isLightweightCrash/StubPeerCrash.java fails
JDK-8129151 Typo in JInternalFrame setDefaultCloseOperation() doc (WindowClosing --> internalFrameClosing)
JDK-8129150 IDEA IntelliJ crashes in objc_msgSend when an accessibility tool is enabled
JDK-8129149 Deadlock in awt clipboard
JDK-8129148 Drawing deviates when validate() is invoked on java.awt.ScrollPane
JDK-8129146 [macosx] LCD Rendering hints seems not working without FRACTIONALMETRICS=ON
JDK-8129145 ./jndi/ldap/Connection.java needs to avoid spurious wakeup
JDK-8129144 Backport JDBC tests from JDK 9 from test/java/sql and test/javax/sql to JDK 8u.
JDK-8129143 ArrayIndexOutOfBoundsException throws in UTF8Reader of SAXParser
JDK-8129142 getNodeValue should return 'null' value for Element nodes
JDK-8129140 make DeoptimizeALot dependent on number of threads
JDK-8129139 Enable hotspot builds on 4.x Linux kernels
JDK-8129138 JVM fastdebug build compiled with GCC 5 asserts with "widen increases"
JDK-8129136 compiler/eliminateAutobox/6934604/TestIntBoxing.java assert(p_f->Opcode() == Op_IfFalse) failed
JDK-8129135 BACKOUT - metaspace/shrink_grow/CompressedClassSpaceSize fails with OOM: Compressed class space
JDK-8129134 JVM crashes in JNI if toString is declared as an interface method
JDK-8129133 HotSpot fails to wrap Exceptions from invokedynamic in a BootstrapMethodError
JDK-8129132 new hotspot build - hs25.60-b20
JDK-8129131 [de,fr,pt_BR,sv] duplicate mnemonics in JCP security tab.
JDK-8129129 jdk8u60 l10n resource file translation update 2
JDK-8087279 Improve naming consistency in make/installer/bundles/macosx/Makefile
JDK-8087277 jre8-40 fails to install on SuSE 11.3
JDK-8087255 Unsafe load can loose control dependency and cause crash
JDK-8087254 volatile double accesses are not explicitly atomic in C2
JDK-8087252 SystemTap does not work when JDK is compiled with GCC 5
JDK-8087251 8068945 changes break building the zero JVM variant
JDK-8087250 Use RBP register as proper frame pointer in JIT compiled code on x86
JDK-8087249 Allow ADLC register class to depend on runtime conditions also for cisc-spillable classes
JDK-8087248 new hotspot build - hs25.60-b19
JDK-8087247 Java Control Panel accessibility problem with labels and text fields
JDK-8087246 Web Start applet process fails to exit
JDK-8087245 Web Start does not honor height / width % values
JDK-8087244 StringIndexOutOfBoundsException in CertUtils.checkWildcardDomain
JDK-8087095 Test missed for the fix of JDK-8007456 backport to jdk8u-dev
JDK-8087094 jjs "nashorn.args" system property is not effective when script arguments are passed
JDK-8087093 ListAdapter should take advantage of JSObject
JDK-8087092 Nashorn test framework @argument does not handle quoted strings
JDK-8087091 Allow conversion of native arrays to Queue and Collection
JDK-8087090 jdk.nashorn.internal.runtime.arrays.IntArrayData.convert assertion
JDK-8087089 delete of bound Java method property results in crash
JDK-8087088 Javadoc warnings in Global.java after lazy initialization
JDK-8087087 ant javadoc target is broken
JDK-8087086 jjs scripting: need way to quote $EXEC command arguments to protect spaces
JDK-8087085 Javascript for-in loop returned extra keys
JDK-8087084 Instance properties with getters returning wrong values
JDK-8087083 Don't create impossible converters for ScriptObjectMirror
JDK-8087082 Code generator emits an extra POP for discarded boolean logical operation
JDK-8087081 Need to adjust test output for 8067931
JDK-8087080 Improve error message when with statement is passed a POJO
JDK-8087079 fix usage of replace and file separator in Nashorn tests
JDK-8087078 Enforce best practices for Node token API usage
JDK-8087077 Very long function names break codegen
JDK-8087076 Fuzzing bug: Object.prototype.toLocaleString(0)
JDK-8087075 Fuzzing bug: length valueOf bug
JDK-8087074 Fuzzing bug: parameter counts differ in TypeConverterFactory
JDK-8087073 use path separator setting consistently in Nashorn project properties
JDK-8087072 BrowserJSObjectLinker should give priority to beans linker for property get/set
JDK-8087071 Wrong 'this' bound to eval call within a function when caller's 'this' is a Java object
JDK-8087070 too strong assertion on function expression names
JDK-8087069 Array.prototype.sort throws IAE on inconsistent comparison
JDK-8087068 -d option should dump script source as well
JDK-8087067 Misleading error message when explicit signature constructor is called with wrong arguments
JDK-8087066 Eliminate dead code around Nashorn code generator
JDK-8087065 Optimistic rewrite in object literal causes ArrayIndexOutOfBoundsException
JDK-8087064 Add tests for the basic failure of try/finally compilation
JDK-8087063 Persistent code cache should support more configurations
JDK-8087062 Nashorn crashes when attempting to start TypeScript compiler
JDK-8087061 Eager code generation fails for earley boyer with split threshold set to 1000
JDK-8087060 Function with same body not reparsed after SyntaxError
JDK-8087059 Test execution blocker: Nashorn testsuite failing due to compile error in jdk/nashorn/api/scripting/test/ScriptEngineTest.java
JDK-8087058 Disable dual fields when not using optimistic types
JDK-8087057 Undeclared globals in eval code should not be handled as fast scope
JDK-8087056 Several nashorn tests failing
JDK-8087055 nashorn tests should avoid using package names used by nashorn sources
JDK-8087054 Typed array setters are very slow when index exceeds capacity
JDK-8087053 Slow scope access to global let/const does not work
JDK-8087052 Regex matching causes java.lang.ArrayIndexOutOfBoundsException: 64
JDK-8087051 toNumber(String) accepts illegal characters
JDK-8087050 Threads spinning infinitely in WeakHashMap.get running test262parallel
JDK-8087049 Global scope should be initialized lazily
JDK-8087048 Startup time: Port shell.js to Java
JDK-8087047 jjs exits even when non-daemon threads are still active
JDK-8087046 Fuzzing bug: new ArrayBuffer() throws exception
JDK-8087044 Add tests for JSON parsing of numeric keys
JDK-8087043 More aggressive value discarding
JDK-8087042 Static analysis of IfNode should consider terminating branches
JDK-8087041 Investigate if RuntimeCallSite linkage can be removed
JDK-8087040 Canonicalize "is a JS string" tests
JDK-8087039 Can't compare Java enums to strings
JDK-8087037 Undefined object values in object literals with spill properties
JDK-8087036 Nashorn bug retrieving array property after key string concatenation
JDK-8087035 const re-assignment should not reported as a "early error"
JDK-8087034 Indirect eval fails when used as an element of an array or as a property of an object
JDK-8087033 Arrays.asList results in ClassCastException with a JS array
JDK-8087032 New compiler warning after JDK-8067139
JDK-8087031 Add regression tests for 8071678 and 8071594
JDK-8087030 NashornScriptEngine returns javax.script.ScriptContext instance with insonsistent get/remove methods behavior for undefined attributes
JDK-8087029 nashorn should not use obj.getClass() for null checks
JDK-8087028 Test for JDK-8068872 fails in tip
JDK-8087027 Nashorn JSON.parse drops numeric keys
JDK-8087026 Various performance issues parsing JSON
JDK-8087025 Build errors in 8u-dev after backporting JDK-8067139 and JDK-8066232
JDK-8087024 Finally blocks inlined incorrectly
JDK-8087023 Fuzzing bug: AssertionError when defining local variable in Block
JDK-8087022 NashornScriptEngine.put/get() impls don't conform to NPE, IAE spec assertions
JDK-8087021 Dead typed push methods in ArrayData
JDK-8087020 Forgot to add a test model to JDK-8068573
JDK-8087019 POJO setter using [] syntax throws an exception
JDK-8087018 REGRESSION: test/script/external/test262/test/suite/ch11/11.2/11.2.3/S11.2.3_A3_T5.js fails with tip
JDK-8087017 Calling a @FunctionalInterface from JS leaks internal objects
JDK-8087016 Halve the function object creation code size
JDK-8087015 JavaAdapterFactory.isAutoConvertibleFromFunction should be more robust
JDK-8087014 NashornScriptEngineFactory.getParameter() throws IAE for an unknown key, doesn't conform to the general spec
JDK-8087013 @since and @jdk.Exported are missing in jdk.nashorn.api.scripting classes and package-info.java files
JDK-8087012 Local variable type calculation mismatch
JDK-8087011 bound java static method throws NPE when 'null' is used for this argument
JDK-8087010 langtools/test/Makefile should not use OS-specific jtreg binary
JDK-8087009 Inference failure with nested invocation
JDK-8087008 Update 8u jdeps list of internal APIs
JDK-8087007 jdeps shows "not found" if target class has no reference other than its own package
JDK-8087002 The crash reporting URL listed by javac needs to be updated
JDK-8087001 Javac erroneously uses instantiated signatures when merging abstract most-specific methods
JDK-8087000 Wrong LineNumberTable for default constructors
JDK-8086999 Check varargs access against inferred signature
JDK-8086998 Varargs access check mishandles capture variables
JDK-8086997 Debugger has no access to outer variables inside Lambda
JDK-8086996 Debugger doesn't show variables *outside* lambda
JDK-8086995 javac -parameters does not emit parameter names for lambda expressions
JDK-8086994 javac, shouldn't check nested stuck lambdas during overload resolution
JDK-8086993 Table's field width in "Use" page generated by javadoc with '-s' is unbalanced
JDK-8086992 Compiler may generate wrong InnerClasses attribute for static enum reference
JDK-8086991 java.lang.AssertionError when compiling JDK 1.4 code in JDK 8
JDK-8086990 javac generates LVT entry with length 0 for local variable
JDK-8086989 Update the protocol for references of docs.oracle.com to HTTPS in langtools.
JDK-8086988 Make certain annotation classfile warnings opt-in
JDK-8086987 jdeps needs a different mechanism to recognize javax.jnlp as supported API
JDK-8086971 [TEST_BUG] closed/javax/management/openmbean/OpenTypeClassNameTest.java failed because it 'Did not resurrect a mutant OpenType'
JDK-8086961 SwingSet2: Themes are incorrectly enabled when running with Nimbus Look and feel
JDK-8086937 java/time/test/java/time/format/TestZoneTextPrinterParser.java fails by timeout on slow device
JDK-8086936 JButtons stay pressed after they have lost focus if you use the mouse wheel
JDK-8086935 No mnemonics on Open and Save buttons in JFileChooser
JDK-8086934 Could not enable D3D pipeline
JDK-8086933 Java version applet hangs with Voice over turned on
JDK-8086932 Support keystore type detection for JKS and PKCS12 keystores
JDK-8086931 LoginContext Subject ignored by jdk8 sun.net.www.protocol.http.HttpURLConnection
JDK-8086930 javac does not recognize '*.java' as file if '-J' option is specified
JDK-8086929 dns_lookup_realm should be false by default
JDK-8086928 Path2D storage growth algorithms should be less linear
JDK-8086927 Path2D copy constructors and clone method propagate size of arrays from source path
JDK-8086926 Java Webstart downloading packed files can result in Timezone set to UTC
JDK-8086925 CPU overhead in FJ due to spinning in awaitWork
JDK-8086924 The spec on javax.script.Compilable contains a typo and confusing inconsistency
JDK-8086923 Missing space on a boundary of concatenated strings
JDK-8086922 LambdaForm.prepare() does unnecessary work for cached LambdaForms
JDK-8086921 Customize adapted MethodHandle in MH.invoke() case
JDK-8086920 SimpleScriptContext used by NashornScriptEngine doesn't completely complies to the spec regarding exception throwing
JDK-8086917 mouse wheel scroll closes combobox popup
JDK-8086916 Cannot input Japanese in JTextField on RedHat Linux
JDK-8086914 java.lang.IllegalArgumentException: aContainer is not a focus cycle root of aComponent
JDK-8086913 [TEST_BUG] java/awt/SplashScreen/MultiResolutionSplash/MultiResolutionSplashTest.java fails
JDK-8086912 Optimization for locale resources loading isn't working
JDK-8086911 Upgrade JDK to use LittleCMS 2.7
JDK-8086910 Missed submissions in ForkJoinPool
JDK-8086909 (tz) Support tzdata2015d
JDK-8086908 Incorrect paint of JProgressBar in Nimbus LF
JDK-8086907 System tray icon title freezes java
JDK-8086906 NullPointerException in PKCS#12 Keystore in PKCS12KeyStore.java
JDK-8086905 DMH LFs should be customizeable
JDK-8086904 CountingWrapper.asType() is broken
JDK-8086903 Customize LambdaForms which are invoked using MH.invoke/invokeExact
JDK-8086901 CloseTTFontFileFunc callback should be removed
JDK-8086900 GIFLIB upgrade
JDK-8086899 Java's system LnF on OS X: editable JComboBoxes are being rendered incorrectly
JDK-8086898 The output's 'Page-n' footer does not show completely.
JDK-8086897 [macosx] Drag image of TransferHandler does not honor MultiResolutionImage
JDK-8086896 [embedded] java.awt.GraphicsDevice.get/setDisplayMode behavior is incorrect when no display is present
JDK-8086895 Fullscreen mode is not working properly on Xorg
JDK-8086894 Performance degradation observed with TimeZone Benchmark
JDK-8086893 IPv6 Nameservers in resolv.conf throws NumberFormatException
JDK-8086890 java.awt.Checkbox.setState() call causes ItemEvent to be filed
JDK-8086889 JMenuBar looks bad under retina
JDK-8086887 [macosx] Initialization of Cocoa hangs if CoreAudio was initialized before
JDK-8086886 Dead/outdated links in Javadoc of package java.beans
JDK-8086885 BufferedImage::getPropertyNames() always returns null
JDK-8086884 NullPointerException and no event received when clipboard data flavor changes
JDK-8086883 [macosx] Label shortening via " ... " broken when String contains combining diaeresis
JDK-8086882 Pending String deadlocks UIDefaults
JDK-8086880 Animated icon is not visible by click on menu
JDK-8086879 example in JFormattedTextField API docs instantiates abstract class
JDK-8086878 Attempting to remove help menu from java.awt.MenuBar throws NullPointerException
JDK-8086877 Swing's Threading Policy example does not compile
JDK-8086876 Some Swing classes violate encapsulation by returning internal Insets
JDK-8086875 JDesktopPane,JFileChooser violate encapsulation by returning internal Dimensions
JDK-8086874 link back to self in javadoc JTextArea.replaceRange()
JDK-8086873 JPGWriter does not throw UnsupportedException when canWriteSequence retuns false
JDK-8086872 abort flag is not cleared for every write operation for JPEG ImageWriter
JDK-8086871 [TEST_BUG] com/sun/management/OperatingSystemMXBean/TestTotalSwap.java Compilation failed after JDK-8077387
JDK-8086870 IME Composition Window is displayed on incorrect position
JDK-8086869 jdb eval java.util.Arrays.asList(array) shows inconsistent behaviour
JDK-8086868 [macosx] NPE when attempting to get image from toolkit
JDK-8086867 Support ISO 4217 "Current funds codes" table (A.2)
JDK-8086865 ArrayIndexOutOfBoundsException in javax.swing.text.html.parser.ContentModel.first()
JDK-8086864 (tz) TimeZone.getDefault() call returns incorrect value in Windows terminal session
JDK-8086862 CipherInputStream throws BadPaddingException if stream is not fully read
JDK-8086861 Disable RC4 cipher suites
JDK-8086860 Focus doesn't move when pressing Shift + Tab keys
JDK-8086859 [TEST_BUG] javax/management/remote/mandatory/notif/NotSerializableNotifTest.java fails due to Port already in use: 2468
JDK-8086858 KeychainStore requires non-null password to be supplied when retrieving a private key
JDK-8086857 Frame is not created on the specified GraphicsDevice with two monitors
JDK-8086856 Race condition in java/lang/management/ThreadMXBean/AllThreadIds.java
JDK-8086855 [TEST_BUG] com/sun/management/OperatingSystemMXBean/TestTotalSwap.sh fails on OS X with exit code 2
JDK-8086854 [TEST_BUG] java/lang/management/ThreadMXBean/SynchronizationStatistics.java intermittently failed with NPE
JDK-8086853 Timeout in LowMemoryTest.java
JDK-8086852 getNextEntry throws ArrayIndexOutOfBoundsException when unzipping file
JDK-8086851 deadlock in java/io/PrintStream when verbose java.security.debug flags are set
JDK-8086850 GraphicsEnvironment.getHeadlessProperty() does not work for AIX
JDK-8086848 [macosx] Menu items are appearing on top of other windows
JDK-8086847 No Horizontal Mouse Wheel Support In BasicScrollPaneUI
JDK-8086846 [macosx] The fix for JDK-8043869 should be reworked
JDK-8086845 -spash: can't be combined with -xStartOnFirstThread since JDK 7
JDK-8086844 SimpleDateFormat formatting of "LLLL" in English is incorrect; should be identical to "MMMM"
JDK-8086843 [PIT] NPE in DnD tests apparently because of the fix to JDK-8061636
JDK-8086842 Fix for JDK-7079254 changes behavior of MouseListener, MouseMotionListener
JDK-8086841 OS X build broken by reference to XToolkit
JDK-8086840 Switching to GTK L&F on-the-fly leads to X Window System error RenderBadPicture
JDK-8086839 DateFormat in german locale returns wrong value for month march
JDK-8086838 Only the first DNSName entry is checked for endpoint identification
JDK-8086837 ImageInputStreamImpl.readShort/readInt do not behave correctly at EOF
JDK-8086836 keystore and truststore debug output could be much better
JDK-8086835 Improve tracing for java.security.debug=certpath
JDK-8086834 (sctp) com/sun/nio/sctp/SctpMultiChannel/SendFailed.java fails on Solaris only
JDK-8086833 Memory leak in ProtectionDomain cache
JDK-8086832 move closed jvm.cfg files out of open repo
JDK-8086830 To interpret case-insensitive string locale independently
JDK-8086829 Gtk: call to UIManager.getSystemLookAndFeelClassName() leads to crash
JDK-8086828 AIX port of "8039173: Propagate errors from Diagnostic Commands as exceptions in the attach framework"
JDK-8086827 [macosx] Mac 10.10: Application run with splash screen has focus issues
JDK-8086826 JDI ObjectReferenceImpl.invokeMethod() validation fails for virtual invocations of method with declaring type being an interface
JDK-8086825 Long-form date format incorrect month string for Finnish locale
JDK-8086824 Minimize can cause window to disappear on osx
JDK-8086823 Fix for 8030115 breaks build on Windows and Solaris
JDK-8086822 [macosx] Mouse events are captured by the wrong menu in OS X
JDK-8086821 Hide lambda proxy frames in stacktraces
JDK-8086820 RMIConnectionImpl may need to inform a ClientNotifForwarder of the its termination
JDK-8086818 Test fails with java.security.AccessControlException: access denied ("java.security.SecurityPermission" "getDomainCombiner")
JDK-8086817 JavaSecurityAccess.doIntersectionPrivilege() drops the information about the domain combiner of the stack ACC
JDK-8086815 [macosx] Combo box consuming ENTER key events
JDK-8086814 Deprecate Multi-Version Java Launcher (mJRE) for JDK8
JDK-8086813 Add SerializedLogRecord test to jdk8u
JDK-8086812 (so) Socket adapter sendUrgentData throws IllegalBlockingMode when channel configured non-blocking
JDK-8086811 Unpredictable timezone on Windows when OS's timezone is not found in tzmappings
JDK-8086810 [TEST_BUG] TimSortStackSize2.java: test cleanup: make test run with single argument
JDK-8086809 Java application menu misbehaves when running multiple screen stacked vertically
JDK-8086808 IBM1166 Locale Request for Kazakh characters
JDK-8086807 Socket impls should ignore unsupported proxy types rather than throwing
JDK-8086806 ZipEntry/JarEntry.setCreation/LastAccessTime(null) don't throw NPE as specified
JDK-8086805 (process) Child is terminated when parent's console is closed [win]
JDK-8086804 IllegalArgumentException in JTree.AccessibleJTree
JDK-8086803 Toolkit.getScreenInsets() doesn't update if insets change
JDK-8086802 (sctp) InternalError when receiving SendFailedNotification
JDK-8086801 Tune test and document TimSort runs stack size increase
JDK-8086800 TimSort fails with ArrayIndexOutOfBoundsException on worst case long arrays
JDK-8086799 Improve GHASH performance
JDK-8086798 [macosx] Jtree icon painted over label when scrollbars present in window
JDK-8086797 sun/security/pkcs11/rsa/TestKeyPairGenerator.java failed in aurora
JDK-8086796 java.math.BigDecimal.divide(BigDecimal, RoundingMode) produces incorrect result
JDK-8086795 JComponent.AccessibleJComponent.addPropertyListeners adds exponential listeners
JDK-8086794 [TEST_BUG] Test sun/security/tools/keytool/ListKeychainStore.sh fails on Mac
JDK-8086793 Failed Java web start via IPv6 (Java7u71 or later)
JDK-8086791 (tz) Support tzdata2015a
JDK-8086790 java/lang/ProcessBuilder/Basic.java: waitFor didn't take long enough
JDK-8086789 Object.wait(ms, ns) timeout returns early
JDK-8086788 Race condition in ThenComposeExceptionTest.java
JDK-8086786 Incorrect Exception message from java.awt.Desktop.open()
JDK-8086784 [solaris] libfontmanager should be linked against headless awt library
JDK-8086783 (sctp) Possible race initializing native IDs
JDK-8086782 HTTP Tunnel connection to NTLM proxy reauthenticates instead of using keep-alive
JDK-8086780 Adjust java/lang/invoke/LFCaching/LFGarbageCollectedTest.java for recent changes in java.lang.invoke
JDK-8086779 Use private static final char[0] for empty Strings
JDK-8086778 StringIndexOutOfBoundsException while reading krb5.conf
JDK-8086775 Deadlock in awt/logging apparently introduced by 8019623
JDK-8086774 Deprecate Unsafe monitor methods in JDK 8u release
JDK-8086773 Agent NullPointerException when rmi.port in use
JDK-8086772 JNI exception pending in jdk/src/solaris/native/java/net
JDK-8086771 Inconsistent exception handling in CompletableFuture.thenCompose
JDK-8086770 java.security.ProviderException: Error parsing configuration with space
JDK-8086769 HttpServer missing tailing space for some response codes
JDK-8086768 Mac OS Incompatibility between JDK 6 and 8 regarding input method handling
JDK-8086767 Printing to Postscript doesn't support dieresis
JDK-8086766 [macosx] jdk8, jdk7u60 Regression in Graphics2D drawing of derived Fonts
JDK-8086765 Update the protocol for references of docs.oracle.com to HTTPS.
JDK-8086763 Used for the fix push for JDK-8038322: CounterMonitorDeadlockTest.java fails intermittently, presumed deadlock
JDK-8086762 (fc) Rename the new jdk.net.enableFastFileTransfer system property to jdk.nio.enableFastFileTransfer
JDK-8086760 SHA1WithDSA with key > 1024 bits not working
JDK-8086759 javax.script.ScriptEngineFactory.getParameter spec is not completely consistent with the rest of the API
JDK-8086758 (typo in the spec) javax.script.ScriptEngineFactory.getLanguageName
JDK-8086757 TEST_BUG: java/lang/Thread/ThreadStateTest.java can't compile with change for 8058506
JDK-8086756 Better message about incompatible zlib in Deflater.init
JDK-8086755 Africa/Casablanca transitions is incorrectly calculated starting from 2027
JDK-8086754 ThreadMXBeanStateTest throws exception
JDK-8086750 Deadlock in SystemFlavorMap.getFlavorsForNative and SunToolkit.awtLock
JDK-8086749 DeadlockTest.java failed with negative timeout value
JDK-8086748 [TEST_BUG] java/lang/management/MemoryMXBean/LowMemoryTest.java fails intermittently
JDK-8086747 [TEST_BUG] java/lang/management/ThreadMXBean/Locks.java fails intermittently, blocked on wrong object
JDK-8086746 javax/management/remote/mandatory/notif/NotificationAccessControllerTest.java fails in JDK8-B22
JDK-8086745 java/lang/management/ThreadMXBean/SynchronizationStatistics.java fails intermittently
JDK-8086744 [TEST_BUG] javax/management/monitor/CounterMonitorTest.java hangs
JDK-8086743 Add a test that will call getDeclaredFields() on all classes and try to set them accessible.
JDK-8086742 Lazy-init thread safety problems in core reflection
JDK-8086741 [TESTBUG] com/sun/corba/5036554/TestCorbaBug.sh
JDK-8086740 (fc) FileChannel transferTo should use TransmitFile on Windows
JDK-8086739 Support SIO_LOOPBACK_FAST_PATH option on Windows
JDK-8086732 JDK 8 schemagen tool does not generate xsd files for enum types
JDK-8086730 AIOBE occurs when accessing to document function in extended function in JAXP
JDK-8086729 XSL: wrong answer from substring() function
JDK-8086728 XSL: Run-time internal error in 'substring()'
JDK-8086722 MSI/MST files should be deleted after install
JDK-8086718 Incorrect UninstallString windows register key in JDK 1.6, 1.7 and 8
JDK-8086702 [macosx] StagedXML is missing
JDK-8086688 Create HKLM\SOFTWARE\JavaSoft\Java Runtime Environment\ registry keys with msi.
JDK-8086633 [de, fr, it, ko, pt_BR, sv] Layout issue (truncation) in AUWelcome dialog
JDK-8086629 [AU]The auto update window does not read the tag of au-descriptor.xml file to set the "More information" link
JDK-8086627 HtmlUI: "Change destination folder" checkbox in WelcomeDialog is not accessible by mouse
JDK-8086626 HtmlUI: checkbox text labels should be clickable
JDK-8086625 replace wrapper dialogs with HtmlU
JDK-8086606 8u60 nightly solaris_sparcv9_5.10-product build fails
JDK-8086605 8u20 and later should not change the MSI UpgradeCode for each JRE version
JDK-8086599 Add files skipped from the fix to JDK-8071490 by mistake
JDK-8086598 JDK9 nightly build from 01/23 failed
JDK-8086537 Increment the build value to b03 for hs25.51 in 8u51-b15
JDK-8086536 Integer.toString(int value) sometimes throws NPE
JDK-8086535 C2: CmpU nodes can end up with wrong type information
JDK-8086534 [TESTBUG] Some of the hotspot tests require at least compact profile 3
JDK-8086533 Excessive checked JNI warnings from Java startup
JDK-8086532 G1: assert(_hrs.max_length() == _expansion_regions) failed
JDK-8086531 new hotspot build - hs25.60-b18
JDK-8086529 PPC64: Fix wrong rotate instructions in the .ad file
JDK-8086528 gc/g1/TestShrinkAuxiliaryData15.java fails with java.lang.RuntimeException: heap decommit failed - after > before
JDK-8086527 SATB buffer processing found reclaimed humongous object
JDK-8086526 verify_no_cset_oops found reclaimed humongous object in SATB buffer
JDK-8086525 SATB apply_closure_to_completed_buffer should have closure argument
JDK-8086524 SATB queue pre-filter verify found reclaimed humongous object
JDK-8086523 Eagerly reclaimed humongous objects left on mark stack
JDK-8086522 Simplify deal_with_reference
JDK-8086521 Early reclaim of large objects that are referenced by a few objects
JDK-8086520 new hotspot build - hs25.60-b17
JDK-8086519 Bogus -Xcheck:jni warning for SIG_INT action for SIGINT in JVM started from non-interactive shell
JDK-8086518 C2's superword optimization causes unaligned memory accesses
JDK-8086517 Crash in PhaseIdealLoop with "assert(!had_error) failed: bad dominance"
JDK-8086516 assert(((ABS(iv_adjustment_in_bytes) % elt_size) == 0)) fails in superword.cpp
JDK-8086515 8011102 changes may cause incorrect results.
JDK-8086514 new hotspot build - hs25.60-b16
JDK-8086513 nsk/jdi/ExceptionEvent/_itself_/exevent006 and exevent008 tests fail with InvocationTargetException
JDK-8086512 BSD build failures due to undefined macros
JDK-8086511 AllocateHeap() and ReallocateHeap() should be inlined.
JDK-8086510 [TESTBUG] test/runtime/lambda-features/InvokespecialInterface.java test has unrecognized option
JDK-8086509 Popping a stack frame after exception breakpoint sets last method param to exception
JDK-8086508 new hotspot build - hs25.60-b15
JDK-8086507 compiler/rtm/ tests fail due to monitor deflation at safepoint synchronization
JDK-8086505 Extend WhiteBox API with methods that check monitor state and force safepoint
JDK-8086504 c.o.j.t.Platform::isX86 and isX64 may simultaneously return true
JDK-8086503 more performance issues in class redefinition
JDK-8086502 ppc: pass thread to throw_AbstractMethodError
JDK-8086501 [Linux] Replace syscall use in os::fork_and_exec with glibc fork() and execve()
JDK-8086500 C2: inlining failure due to access checks being too strict
JDK-8086499 C2: uncommon trap w/ Reason_speculate_class_check causes performance regression due to continuous deoptimizations
JDK-8086498 Never-taken branches cause repeated deopts in MHs.GWT case
JDK-8086497 Never taken branches should be pruned when GWT LambdaForms are shared
JDK-8086496 Replace fatal() with vm_exit_during_initialization() when an incorrect class is found on the bootclasspath
JDK-8086495 [TESTBUG] remove explicit set build flavor from hotspot/test/compiler/* tests
JDK-8086494 [TESTBUG] gc/g1/TestLargePageUseForAuxMemory.java specifies wrong library path
JDK-8086493 [TESTBUG] Conflicting GC combinations in hotspot tests
JDK-8086492 new hotspot build - hs25.60-b14
JDK-8086491 TracePageSizes output reports wrong page size on Windows with G1
JDK-8086490 SPECjvm2008-Derby -2.7% performance regression on Solaris-X64 starting with 9-b29
JDK-8086489 VirtualSpace does not use large pages
JDK-8086488 Add method to WhiteBox to get vm pagesize.
JDK-8086487 TestParallelHeapSizeFlags fails with unexpected heap size
JDK-8086486 G1 ignores AlwaysPreTouch
JDK-8086485 os::commit_memory on Solaris uses aligment_hint as page size
JDK-8086484 new hotspot build - hs25.60-b13
JDK-8086483 hotspot build failed with gcc version Red Hat 4.4.6-4
JDK-8086482 ParNew promotion failed is serialized on a lock
JDK-8086480 SPARC PICL causes significantly longer startup times
JDK-8086479 Wrong volatile qualifier for field ClassLoaderDataGraphKlassIteratorAtomic::_next_klass
JDK-8086477 new hotspot build - hs25.60-b12
JDK-8086476 serviceability/sa/jmap-hashcode/Test8028623.java fails with AssertionFailure: can not get class data for java/lang/UNIXProcess$Platform$$Lambda
JDK-8086475 Compilation of constant array containing different sub classes crashes the JVM
JDK-8086473 assert(fm == NULL || fm->method_holder() == _participants[n]) failed: sanity
JDK-8086472 Event based tracing locks to rank as leafs where possible
JDK-8086471 Add trace events for failed allocations
JDK-8086470 Refactor VM GC operations caused by allocation failure
JDK-8086469 Clean up around VM_GC_Operations
JDK-8086467 "java.lang.NullPointerException: Method name is null" from StackTraceElement.
JDK-8086466 Verification in ClassLoaderData::is_alive is too slow
JDK-8086464 new hotspot build - hs25.60-b11
JDK-8086462 ZERO variant build is broken
JDK-8086461 assert(is_available(index)) failed in G1 cset
JDK-8086460 new hotspot build - hs25.60-b10
JDK-8086459 JSR 292: assert(type() == T_OBJECT) failed: type check
JDK-8086458 Class verifier accepts an invalid class file
JDK-8086457 Per-phase timing measurements for strong roots processing
JDK-8086456 Refactor strong root processing in order to allow G1 to evolve separately from GenCollectedHeap
JDK-8086455 Refactor the G1GCPhaseTime logging to make it easier to add new phases
JDK-8086454 G1 iterates over JNIHandles two times
JDK-8086453 Remove temporary G1UseParallelRSetUpdating and G1UseParallelRSetScanning flags
JDK-8086452 Clean up G1 remembered set oop iteration
JDK-8086451 When iterating over a card, G1 often iterates over much more references than are contained in the card
JDK-8086450 Decrease Hot Card Cache Lock contention
JDK-8086449 Hot card cache flush chunk size too coarse grained
JDK-8086448 Object copy time regressions after JDK-8031323 and JDK-8057536
JDK-8086447 AIX: clean-up HotSpot make files
JDK-8086446 AIX: link libjvm.so with -bernotok to detect missing symbols at build time and suppress warning 1540-1639
JDK-8086444 Refactor G1s usage of save_marks and reduce related races
JDK-8086443 Improved handling of age during object copy in G1
JDK-8086442 G1TraceReclaimDeadHumongousObjectsAtYoungGC only prints humongous object liveness output when there is at least one candidate humongous object
JDK-8086441 JVM stuck in infinite loop during verification
JDK-8086440 new hotspot build - hs25.60-b09
JDK-8086439 C2 code generator can replace -0.0f with +0.0f on Linux
JDK-8086438 Cannot build hotspot in jdk8u on OSX 10.10 (Yosemite)
JDK-8086437 the constantPoolCacheOopDesc::adjust_method_entries() used in RedefineClasses does not scale
JDK-8086436 jvmtiRedefineClasses.cpp: guarantee(false) failed: OLD and/or OBSOLETE method(s) found
JDK-8086434 Client JVM silently exit with fail exit code when running in compact(1,2) with options -Dcom.sun.management and -XX:+ManagementServer
JDK-8086433 new hotspot build - hs25.60-b08
JDK-8086432 -Xcheck:jni improvements to exception checking and excessive local refs
JDK-8086431 hotspot, "impossible" assertion failure
JDK-8086430 Infinite loop reading types during jmap attach.
JDK-8086429 perfMemory_solaris.cpp failing to compile with "Error: dd_fd is not a member of DIR."
JDK-8086428 new hotspot build - hs25.60-b07
JDK-8086426 followup to 8072383
JDK-8086424 'Full GC' events miss date stamp information occasionally
JDK-8086423 Simplify ArgumentsExt and remove unneeded functionallity
JDK-8086422 new hotspot build - hs25.60-b06
JDK-8086421 Locks need better debug-printing support
JDK-8086420 Zero: Atomic::xchg and Atomic::xchg_ptr need full memory barrier
JDK-8086419 Zero builds fails after JDK-6898462
JDK-8086418 Zero+PPC64: Stack overflow when running Maven
JDK-8086417 resolve conflicts between open and closed ports
JDK-8086416 new hotspot build - hs25.60-b05
JDK-8086414 Nondeterministic wrong answer on arithmetic
JDK-8086413 jstack not working on core files
JDK-8086412 SA update
JDK-8086411 JVM crashes during GC on various asserts which checks that HeapWord ptr is an oop
JDK-8086410 jmap reports unexpected used/free size of concurrent mark-sweep generation
JDK-8086409 support new PTRACE_GETREGSET
JDK-8086408 C1: Incorrect argument type used for SharedRuntime::OSR_migration_end in LIRGenerator::do_Goto
JDK-8086407 new hotspot build - hs25.60-b04
JDK-8086406 AIX port of "8050807: Better performing performance data handling"
JDK-8086405 jvmtiStringPrimitiveCallback should not be invoked when string value is null
JDK-8086403 assert(!failing()) failed: Must not have pending failure. Reason is: out of memory
JDK-8086402 [TESTBUG] Aix support in hotspot jtreg tests
JDK-8086401 build_vm_def.sh not working correctly for new build cross compile
JDK-8086399 assert(!_reg_node[reg_lo] || edge_from_to(_reg_node[reg_lo],def)) failed: after block local scheduling
JDK-8086398 new hotspot build - hs25.60-b03
JDK-8086397 SIGBUS in C2 compiled method weblogic.wsee.jaxws.framework.jaxrpc.EnvironmentFactory$SimulatedWsdlDefinitions.
JDK-8086396 SIGSEGV in c2 compiled code with OptimizeStringConcat
JDK-8086395 Usage of UseHugeTLBFS, UseLargePagesInMetaspace and huge SurvivorAlignmentInBytes cause crashes in CMBitMapClosure::do_bit
JDK-8086393 new hotspot build - hs25.60-b02
JDK-8086392 Refactor native stack printing from vmError.cpp to debug.cpp to make it available in gdb as well
JDK-8086391 [TESTBUG] New tests in gc/survivorAlignment/ fails
JDK-8086390 Add tests on alignment of objects copied to survivor space
JDK-8086389 Update the Hotspot version numbers in Hotspot for JDK 8u60
JDK-8086387 Fix includes after 8058148: MaxNodeLimit and LiveNodeCountInliningCutoff
JDK-8086386 [TEST_BUG] serviceability/sa/jmap-hashcode/Test8028623.java has utf8 character corrupted by earlier merge
JDK-8086385 Test serviceability/sa/jmap-hashcode/Test8028623.java fails on some Linux/Mac machines.
JDK-8086384 CPU detection gives 0 cores per cpu, 2 threads per core in Amazon EC2 environment
JDK-8086383 fix to JDK-8078534 removed part of fix to JDK-8076220
JDK-8086378 DRS 1.2: checksum algorithm needs to be restricted to SHA-256
JDK-8086377 Visual Studio javaws Project to Debug Native Code
JDK-8086375 Merge problem in 9-client - test build failure
JDK-8086372 Jnlp fails to load with CouldNotLoadArgumentException after JDK-8075179
JDK-8086369 jnlp "codebase" attribute has been made mandatory
JDK-8086367 jnlp spec version 8.20 is not supported
JDK-8086366 XMLParserTest unit test failure.
JDK-8086364 Application with Signed JNLP cannot pass accented characters in
JDK-8086363 Java Console GUI is irresponsive in JRE 8u20 on OS X
JDK-8086362 Plugin missing MIME type registration for application/x-java-applet;version=1.8
JDK-8086360 [macosx] Menu items disappear and redrawn quickly when moving mouse into applet frame
JDK-8086359 Add DRS rules block to Java Usage Tracker records.
JDK-8086358 Test jnlp_file/applicationDesc/index.html#args fails with incorrect arg value
JDK-8086357 Ensure JFR options could be passed to webstart app by specifying VM arguments in the JCP
JDK-8086355 Replace missing APIs from 8u40
JDK-8086352 Clicking cancel on security dialog for preloader clears the DeniedCertStore
JDK-8086347 Focus lost in applet when browser window is minimized and restored
JDK-8086346 junit issue after fix to JDK-8073589
JDK-8086345 DeploymentRuleSet on run action
JDK-8086344 DRS: Want customizable message in case of application blocking if only default rule is specified
JDK-8086341 Plugin2: Clean-up for possible multi-thread unsafe codes as per Findbugs result from security audit
JDK-8086340 Plugin2: simple code clean-up as per Findbugs' result from security audit
JDK-8086335 Delete splash.c from Repository
JDK-8086332 The text location of "More information" overlap with "code" in mixed code dialog
JDK-8086331 [parfait] File Handle Leak in configcache_pd.c
JDK-8086330 Parsing JNLP file should not cause download of extensions.
JDK-8086329 Unit test failures: JNLPClassloaderTest, JNLP2ClassLoaderTest
JDK-8086328 JRE 8U25 and 8u31 b32 cannot launch Java Web Start with proxy pac but works fine for 7u67
JDK-8086327 echo elements in ruleset.xml
JDK-8086326 With expired or selfsigned DeploymentRuleSet, not hint is provied in JCP Rule Set dialog.
JDK-8086324 NPE (instead of proper error dialog) thrown when some jnlp files have no resources
JDK-8086319 Applet is not started in IE on dynamic insertion into a web page
JDK-8086317 Add missing information to AppModel
JDK-8086315 Netbeans javaws Project to Debug Native Code
JDK-8086313 DRS: The messaging for invalid rule set jar is not explicit.
JDK-8086312 DRS: Unable to include escaped characters in message
JDK-8086311 javaws Dead Native Code Cleanup
JDK-8086300 DRS with non-force version run rule can block when it should not.
JDK-8086296 JavaWS fails with proxy autoconfig due to missing "dnsResolve"
JDK-8086292 unnecessary performance degradation caused by fix to JDK-8052111
JDK-8086291 remove dead code to donwload JavaFX on demand.
JDK-8086290 embedded_jnlp param requires also code or jnlp_href param or applet arg.
JDK-8086289 Remove dead code
JDK-8086287 Remove support for downloaded JavaFX classes
JDK-8086283 cert based run rule doesn't work when running offline
JDK-8086282 JCP -> Advanced Tab -> Selection events are not heard from screen readers
JDK-8086281 java.com link in some of the dialogs are not accessible
JDK-8086280 JNLP property apple.laf.useScreenMenuBar no longer treated as secure for Mac OS
JDK-8086277 RMI-IIOP communication fails when ConcurrentHashMap is passed to remote method
JDK-8086276 Incorrect property name documented in CORBA InputStream API
JDK-8086274 Add support for Cygwin 2.0
JDK-8086273 Support running regression tests using jtreg_tests+TESTDIRS from top level
JDK-8086271 Open Source Java Access Bridge - Create Patch for JEP C127 8055831
JDK-8086270 Update jtreg bin location in configure
JDK-8086269 AARCH64: better handling of aarch64- triples
JDK-8086268 Regression in configure due to JDK-8069057
JDK-8086267 Make sure configure is run by bash
JDK-8086266 AARCH64: Top-level JDK changes
JDK-8086265 Create custom hook for running after AC_OUTPUT
JDK-8086264 ZERO_ARCHDEF incorrectly defined for PPC/PPC64 architectures
JDK-8086263 [macosx] Fix hard-wired paths to JavaVM.framework
JDK-8086262 Update references of download.oracle.com to docs.oracle.com in javadoc makefile
JDK-8086261 $jdk/api/javac/tree contains docs for nashorn
JDK-8086260 Revert project file accidentally pushed
JDK-8086259 Fix Xcode project
JDK-8086258 Xcode javaws Project to Debug Native Code
JDK-8083166 [TEST_BUG] two lib/testlibrary tests are failing with "Error. failed to clean up files after test" with jtreg 4.1 b12
JDK-8080079 Launching of jnlp app fails with JNLPException
JDK-8079755 press-and-hold input method for accented characters works incorrectly on OS X
JDK-8079754 SPNEGO auth fails if client proposes MS krb5 OID
JDK-8079752 Slow cache performance since JRE 7u06
JDK-8079751 DRS certificate based rule does not match with Java WS Application compressed by pack200
JDK-8079488 schema1.xsd has wrong content. Sequence of the enum values has been changed
JDK-8079487 JCK test api/xsl/conf/string/string17 starts failing after JDK-8074297
JDK-8079486 substring in XSLT returns wrong character if string contains supplementary chars
JDK-8079485 Bad error message on parsing illegal character in XML attribute
JDK-8078708 [TEST_BUG] sun/security/pkcs11/sslecc/ClientJSSEServerJSSE.java fails with BindException
JDK-8078707 [macosx] Clipboard does not work with 3rd parties Clipboard Managers
JDK-8078706 Memory leak in JvmtiEnv::GetConstantPool
JDK-8078705 Increment the build value to b02 for hs25.51 in 8u51-b10
JDK-8077882 (tz) Support tzdata2015b
JDK-8077855 When applet is relaunched, extra JUT records can be sent
JDK-8077254 Applet throws java.security AccessControlException in java console when playing it
JDK-8076505 Increment minor version of HSx for 8u65 and initialize the build number
JDK-8076437 Make jdk8u60 the default release on jdk8u repos

Committer push log