PUSHES REPORT: openjdk7u

This report shows who pushed the backports to the given release. This usually shows who did the backporting, testing, and review work.

Report generated: Tue Nov 01 01:02:30 CET 2022

Distribution by priority

Count Priority
13 P1
127 P2
281 P3
305 P4
11 P5

Distribution by components

Count Component
737 100% Total
248 33.6% security-libs
98 13.3% security-libs/java.security
42 5.7% security-libs/javax.crypto
39 5.3% security-libs/javax.net.ssl
17 2.3% security-libs/org.ietf.jgss:krb5
13 1.8% security-libs/javax.security
10 1.4% security-libs
9 1.2% security-libs/javax.crypto:pkcs11
8 1.1% security-libs/javax.xml.crypto
5 0.7% security-libs/org.ietf.jgss
4 0.5% security-libs/jdk.security
3 0.4% security-libs/javax.smartcardio
171 23.2% core-libs
30 4.1% core-libs/java.time
25 3.4% core-libs/java.util:i18n
22 3.0% core-libs
18 2.4% core-libs/java.net
16 2.2% core-libs/java.nio
9 1.2% core-libs/javax.naming
8 1.1% core-libs/java.util
7 0.9% core-libs/java.rmi
7 0.9% core-libs/java.io
5 0.7% core-libs/java.util.concurrent
5 0.7% core-libs/java.util.jar
4 0.5% core-libs/java.lang
3 0.4% core-libs/java.io:serialization
3 0.4% core-libs/java.util:collections
2 0.3% core-libs/javax.script
2 0.3% core-libs/java.lang:reflect
1 0.1% core-libs/java.nio.charsets
1 0.1% core-libs/java.lang.invoke
1 0.1% core-libs/java.util.logging
1 0.1% core-libs/java.util.regex
1 0.1% core-libs/java.text
122 16.6% client-libs
52 7.1% client-libs/java.awt
32 4.3% client-libs/2d
20 2.7% client-libs/javax.swing
9 1.2% client-libs
2 0.3% client-libs/javax.sound
2 0.3% client-libs/java.awt:i18n
2 0.3% client-libs/javax.imageio
1 0.1% client-libs/demo
1 0.1% client-libs/java.beans
1 0.1% client-libs/javax.accessibility
107 14.5% hotspot
49 6.6% hotspot/compiler
35 4.7% hotspot/runtime
18 2.4% hotspot/gc
4 0.5% hotspot/svc
1 0.1% hotspot/jvmti
34 4.6% infrastructure
30 4.1% infrastructure/build
3 0.4% infrastructure
1 0.1% infrastructure/licensing
20 2.7% core-svc
7 0.9% core-svc/java.lang.management
6 0.8% core-svc/debugger
4 0.5% core-svc/javax.management
2 0.3% core-svc/tools
1 0.1% core-svc/java.lang.instrument
11 1.5% tools
7 0.9% tools/javadoc(tool)
1 0.1% tools/jconsole
1 0.1% tools/jar
1 0.1% tools/launcher
1 0.1% tools
10 1.4% xml
6 0.8% xml/jaxp
3 0.4% xml/jaxb
1 0.1% xml/javax.xml.parsers
9 1.2% other-libs
6 0.8% other-libs/other
3 0.4% other-libs/corba
5 0.7% globalization
5 0.7% globalization/translation

Distribution by affiliation

This Release Pushes

Original Pushes

Count Committer
736 100% Total
706 95.9% Red Hat
699 95.0% Andrew Hughes
6 0.8% Martin Balao
1 0.1% Omair Majid
26 3.5% Azul
14 1.9% Andrew Brygin
12 1.6% Dmitry Cherepanov
4 0.5% SAP
4 0.5% Goetz Lindenmaier
Count Committer
736 100% Total
436 59.2% Oracle
59 8.0% Weijun Wang
26 3.5% Vladimir Kozlov
20 2.7% Sean Mullan
19 2.6% Vincent Ryan
19 2.6% Sean Coffey
15 2.0% Aleksej Efimov
14 1.9% Ramanand Patil
13 1.8% Alan Bateman
13 1.8% Roger Riggs
13 1.8% Philip Race
12 1.6% Robert Mckenna
11 1.5% Valerie Peng
11 1.5% Naoto Sato
10 1.4% Jason Uh
9 1.2% Petr Pchelko
8 1.1% Thomas Schatzl
7 1.0% Semyon Sadetsky
6 0.8% Frank Yuan
6 0.8% Bradford Wetmore
5 0.7% Brian Burkhalter
5 0.7% Adam Petcher
5 0.7% Svetlana Steuck
5 0.7% Anthony Scarpino
5 0.7% Kiran Sidhartha Ravikumar
5 0.7% Paul Sandoz
5 0.7% Jonathan Gibbons
4 0.5% Michael Fang
4 0.5% Alexander Zvegintsev
4 0.5% Mikhail Cherkasov
4 0.5% David Katleman
4 0.5% Coleen Phillimore
4 0.5% Harold Seigel
4 0.5% Dmitry Markov
4 0.5% Joe Darcy
4 0.5% Staffan Larsen
3 0.4% Yoshiki Sato
3 0.4% Kevin Walls
3 0.4% Tobias Hartmann
3 0.4% David Holmes
3 0.4% Igor Veresov
3 0.4% Prasanta Sadhukhan
3 0.4% Mandy Chung
3 0.4% Jesper Wilhelmsson
2 0.3% Alexander Potochkin
2 0.3% Sergey Malenkov
2 0.3% Christine Lu
2 0.3% Pavel Rappo
2 0.3% Christian Tornqvist
2 0.3% Stefan Karlsson
2 0.3% Daniel Daugherty
2 0.3% Erik Helin
2 0.3% Alexey Ivanov
2 0.3% Sundararajan Athijegannathan
2 0.3% Jamil Nimeh
2 0.3% Vladimir Ivanov
1 0.1% Michael McMahon
1 0.1% Joe Wang
1 0.1% Jayathirth D V
1 0.1% Leonid Romanov
1 0.1% Yuka Kamiya
1 0.1% Andreas Eriksson
1 0.1% Ambarish Rapte
1 0.1% Kim Barrett
1 0.1% Prem Balakrishnan
1 0.1% Zoltan Majo
1 0.1% Iris Clark
1 0.1% Anton Nashatyrev
1 0.1% Alexander Zuev
1 0.1% Stuart Marks
1 0.1% Yong Huang
1 0.1% Albert Noll
1 0.1% Nils Eliasson
1 0.1% Shanliang Jiang
1 0.1% Bhavesh Patel
1 0.1% Amy Lu
1 0.1% Anthony Petrov
1 0.1% David Chase
1 0.1% Yekaterina Kantserova
1 0.1% Mikael Vidstedt
1 0.1% Serguei Spitsyn
1 0.1% Mikael Gerdin
99 13.5% Unknown
99 13.5% N/A
57 7.7% Red Hat
41 5.6% Andrew Hughes
5 0.7% Martin Balao
4 0.5% Roland Westrelin
2 0.3% Severin Gehwolf
2 0.3% Mario Torre
1 0.1% Andrew Haley
1 0.1% Omair Majid
1 0.1% Aleksey Shipilev
32 4.3% Independent
12 1.6% Artem Smotrakov
9 1.2% Chris Hegarty
2 0.3% Alejandro Murillo
2 0.3% Zhengyu Gu
2 0.3% Vyom Tewari
1 0.1% Kurchi Subhra Hazra
1 0.1% Masayoshi Okutsu
1 0.1% Peter Levart
1 0.1% Dmitriy Samersoff
1 0.1% Fredrik Öhrström
21 2.9% @global.tencent.com
21 2.9% Xuelei Fan
21 2.9% Amazon
15 2.0% Sergey Bylokhov
6 0.8% Volker Simonis
19 2.6% Azul
12 1.6% Andrew Brygin
4 0.5% Yuri Nesterenko
2 0.3% Konstantin Shefov
1 0.1% Dmitry Cherepanov
14 1.9% Google
11 1.5% Ivan Gerasimov
2 0.3% Martin Buchholz
1 0.1% Arthur Eubanks
11 1.5% BellSoft
10 1.4% Alexandr Scherbatiy
1 0.1% Dmitrij Pochepko
8 1.1% DataDog
8 1.1% Jaroslav Bachorík
8 1.1% SAP
4 0.5% Goetz Lindenmaier
2 0.3% Christoph Langer
2 0.3% Matthias Baesken
4 0.5% Huawei
4 0.5% Hamlin Li
3 0.4% Twitter
2 0.3% Christian Thalinger
1 0.1% John Coomes
2 0.3% Tencent
1 0.1% Xiaofeng Yang
1 0.1% John Jiang
1 0.1% JetBrains
1 0.1% Anton Tarasov

Chronological push log:

Days Ago This Release Push By Original Push By Bug Summary
Name Affiliation Name Affiliation
285 Andrew Brygin Azul Joe Wang Oracle JDK-8280249 AIOB in XMLEntityScanner.scanLiteral upon parsing literals with > 100 LF chars
313 Dmitry Cherepanov Azul Yoshiki Sato Oracle JDK-8279137 Update TimeZoneNames files to follow the changes made by JDK-8275766
313 Dmitry Cherepanov Azul Yoshiki Sato Oracle JDK-8279136 TestZoneInfo310.java fails with tzdata2021e
313 Dmitry Cherepanov Azul Yoshiki Sato Oracle JDK-8279135 (tz) Update Timezone Data to 2021e
314 Dmitry Cherepanov Azul Naoto Sato Oracle JDK-8279056 TimeZoneTest.java fails with tzdata2021b
314 Dmitry Cherepanov Azul Naoto Sato Oracle JDK-8279055 TestZoneInfo310.java fails with tzdata2021b
314 Dmitry Cherepanov Azul Naoto Sato Oracle JDK-8279054 (tz) Update Timezone Data to 2021c
376 Andrew Brygin Azul Xuelei Fan @global.tencent.com JDK-8275635 Update the default enabled cipher suites preference
376 Andrew Brygin Azul Weijun Wang Oracle JDK-8275629 Unable to read certain PKCS12 keystores from SequenceInputStream
376 Andrew Brygin Azul Harold Seigel Oracle JDK-8275612 InnerClasses: VM permits wrong inner_class_info_index value of zero
417 Andrew Brygin Azul Robert Mckenna Oracle JDK-8273536 Strange behavior of URLConnection with proxy
423 Andrew Brygin Azul Michael McMahon Oracle JDK-8273320 com.sun.net.HttpsServer spins on TLS session close
467 Andrew Brygin Azul Pavel Rappo Oracle JDK-8271042 com/sun/jndi/ldap/LdapTimeoutTest.java failed due to timeout on DeadServerNoTimeoutTest is incorrect
467 Andrew Brygin Azul Robert Mckenna Oracle JDK-8271031 Add capability to custom resolve host/domain names within the default JNDI LDAP provider
566 Andrew Brygin Azul Sean Mullan Oracle JDK-8265143 Disable TLS 1.0 and 1.1
572 Andrew Brygin Azul Anthony Scarpino Oracle JDK-8263373 Disable weak named curves by default in TLS, CertPath, and Signed JAR
573 Dmitry Cherepanov Azul Kiran Sidhartha Ravikumar Oracle JDK-8264794 (tz) Upgrade time-zone data to tzdata2021a
573 Andrew Brygin Azul Valerie Peng Oracle JDK-8263371 Remove dependency on EC classes from pkcs11 provider
600 Dmitry Cherepanov Azul Kiran Sidhartha Ravikumar Oracle JDK-8263383 (tz) Upgrade time-zone data to tzdata2020f
684 Dmitry Cherepanov Azul Kiran Sidhartha Ravikumar Oracle JDK-8258476 (tz) Upgrade time-zone data to tzdata2020d
684 Dmitry Cherepanov Azul Kiran Sidhartha Ravikumar Oracle JDK-8258475 (tz) Upgrade time-zone data to tzdata2020c
684 Dmitry Cherepanov Azul Kiran Sidhartha Ravikumar Oracle JDK-8258474 (tz) Upgrade time-zone data to tzdata2020b
720 Andrew Brygin Azul Robert Mckenna Oracle JDK-8256139 Crash in MinINode::Ideal(PhaseGVN*, bool)
733 Andrew Brygin Azul Roland Westrelin Red Hat JDK-8255507 C2: range check elimination may allow illegal out of bound access
733 Andrew Brygin Azul Vladimir Kozlov Oracle JDK-8255506 Undefined behaviour in HotSpot
825 Andrew Hughes Red Hat Sean Coffey Oracle JDK-8250730 (tz) Upgrade time-zone data to tzdata2020a
825 Andrew Hughes Red Hat Arthur Eubanks Google JDK-8250729 java.io.File.isInvalid() is racy
825 Andrew Hughes Red Hat Matthias Baesken SAP JDK-8250728 BufImg_SetupICM add ReleasePrimitiveArrayCritical call in early return
825 Andrew Hughes Red Hat N/A Unknown JDK-8250727 SessionId.hashCode generates too many collisions
825 Andrew Hughes Red Hat Alexander Zvegintsev Oracle JDK-8250726 Update GIFlib library to the latest up-to-date
825 Andrew Hughes Red Hat Andrew Hughes Red Hat JDK-8250725 8077982 giflib upgrade breaks system giflib builds with earlier versions
825 Andrew Hughes Red Hat Alexander Zvegintsev Oracle JDK-8250724 GIFLIB upgrade
825 Andrew Hughes Red Hat Martin Buchholz Google JDK-8250722 Repeated offer and remove on ConcurrentLinkedQueue lead to an OutOfMemoryError
825 Andrew Hughes Red Hat Ambarish Rapte Oracle JDK-8250721 ActionListeners on JRadioButtons don't get notified when selection is changed with arrow keys
825 Andrew Hughes Red Hat Alan Bateman Oracle JDK-8250720 (ch) test java/nio/channels/AsyncCloseAndInterrupt.java failing due to "Connection succeeded"
825 Andrew Hughes Red Hat Philip Race Oracle JDK-8250711 AIOOBE in GIFImageReader.initializeStringTable
825 Andrew Hughes Red Hat Weijun Wang Oracle JDK-8250702 A TSA server returns timestamp with precision higher than milliseconds
825 Andrew Hughes Red Hat Weijun Wang Oracle JDK-8250698 NegativeArraySizeException in sun.security.util.DerInputStream.getUnalignedBitString()
825 Andrew Hughes Red Hat Sean Mullan Oracle JDK-8250697 NullPointerException in DerValue.equals(DerValue)
825 Andrew Hughes Red Hat Severin Gehwolf Red Hat JDK-8250696 JDK 8u: sun.misc.Version.jdkUpdateVersion() returns wrong result
825 Andrew Hughes Red Hat Thomas Schatzl Oracle JDK-8250695 Race when reusing PerRegionTable bitmaps may result in dropped remembered set entries
825 Andrew Hughes Red Hat N/A Unknown JDK-8250692 Upgrade libpng to 1.6.37
825 Andrew Hughes Red Hat Sergey Bylokhov Amazon JDK-8250691 Update GIFlib library to the 5.2.1
825 Andrew Hughes Red Hat Sergey Bylokhov Amazon JDK-8250690 Update GIFlib library to the 5.1.8
929 Andrew Hughes Red Hat Brian Burkhalter Oracle JDK-8242877 (bf) Heap buffer state changes could provoke unexpected exceptions
929 Andrew Hughes Red Hat Jason Uh Oracle JDK-8242873 To interpret case-insensitive string locale independently
969 Dmitry Cherepanov Azul Dmitry Cherepanov Azul JDK-8240621 Build failure on Windows after JDK-8044500
978 Andrew Hughes Red Hat Weijun Wang Oracle JDK-8240063 Typo in java.security: Sasl.createClient and Sasl.createServer
978 Andrew Hughes Red Hat Weijun Wang Oracle JDK-8240062 Allow Sasl mechanisms to be restricted
978 Andrew Hughes Red Hat Ramanand Patil Oracle JDK-8240061 (tz) Upgrade time-zone data to tzdata2019c
978 Andrew Hughes Red Hat Ramanand Patil Oracle JDK-8240060 (tz) Upgrade time-zone data to tzdata2019b
978 Andrew Hughes Red Hat Chris Hegarty Independent JDK-8240059 java.lang.UnsatisfiedLinkError: net.dll: Can't find dependent libraries
978 Andrew Hughes Red Hat Brian Burkhalter Oracle JDK-8240058 (fs) FileStore::isReadOnly is always true on macOS Catalina
978 Andrew Hughes Red Hat Roger Riggs Oracle JDK-8240057 Problem with NullPointerException in RMI TCPEndpoint.read
978 Andrew Hughes Red Hat Severin Gehwolf Red Hat JDK-8240056 (fs) Files.write can leak file descriptor in the exception case
978 Andrew Hughes Red Hat Philip Race Oracle JDK-8240055 Problem list java/awt/FontMetrics/MaxAdvanceIsMax.java
978 Andrew Hughes Red Hat Martin Balao Red Hat JDK-8240054 FontMetrics.getMaxAdvance may be less than the maximum FontMetrics.charWidth
978 Andrew Hughes Red Hat Weijun Wang Oracle JDK-8240053 Do not request for addresses for forwarded TGT
978 Andrew Hughes Red Hat Weijun Wang Oracle JDK-8240052 fix krb5 caddr
978 Andrew Hughes Red Hat Andrew Hughes Red Hat JDK-8240051 File.exists throws AccessControlException for invalid paths when a SecurityManager is installed
978 Andrew Hughes Red Hat Yuri Nesterenko Azul JDK-8240050 Tidy warnings cleanup for packages java.nio/java.io
978 Andrew Hughes Red Hat Joe Darcy Oracle JDK-8240049 Fix doclint issues in java.nio.*
978 Andrew Hughes Red Hat Weijun Wang Oracle JDK-8240046 Kerberos sequence number issues
978 Andrew Hughes Red Hat Weijun Wang Oracle JDK-8240045 Test native KDC, Java krb5 lib, and native krb5 lib in one test
978 Andrew Hughes Red Hat Weijun Wang Oracle JDK-8240044 KDC might issue a renewable ticket even if not requested
978 Andrew Hughes Red Hat Ramanand Patil Oracle JDK-8240043 GSSCredential.getRemainingLifetime() returns negative value for TTL > 24 days.
978 Andrew Hughes Red Hat Bradford Wetmore Oracle JDK-8240042 Manual security tests have @ignore rather than @run main/manual
978 Andrew Hughes Red Hat Sean Coffey Oracle JDK-8240041 Unexpected NPE still possible on some Kerberos ticket calls
978 Andrew Hughes Red Hat Weijun Wang Oracle JDK-8240040 Update KerberosTicket to describe behavior if it has been destroyed and fix NullPointerExceptions
978 Andrew Hughes Red Hat Weijun Wang Oracle JDK-8240039 sun.security.krb5.KdcComm interprets kdc_timeout as msec instead of sec
978 Andrew Hughes Red Hat Weijun Wang Oracle JDK-8240037 ReplayCache tests fail on multiple platforms
978 Andrew Hughes Red Hat Weijun Wang Oracle JDK-8240036 Impact on krb5 test cases in the 8u nightly
978 Andrew Hughes Red Hat Artem Smotrakov Independent JDK-8240035 Additional tests for krb5 settings
978 Andrew Hughes Red Hat Artem Smotrakov Independent JDK-8240034 Tests for RFEs 4515853 and 4745056
978 Andrew Hughes Red Hat Weijun Wang Oracle JDK-8240033 Tests for sun.security.krb5.principal system property
978 Andrew Hughes Red Hat N/A Unknown JDK-8240031 More krb5 tests
978 Andrew Hughes Red Hat N/A Unknown JDK-8240029 reg test for 6879540
978 Andrew Hughes Red Hat N/A Unknown JDK-8240028 KDC tests cleanup
978 Andrew Hughes Red Hat Weijun Wang Oracle JDK-8240027 Kerberos krb5 authentication: AuthList's put method leads to performance issue
978 Andrew Hughes Red Hat Weijun Wang Oracle JDK-8240026 KerberosTicket does not properly handle renewable tickets at the end of their lifetime
978 Andrew Hughes Red Hat Weijun Wang Oracle JDK-8240025 JAAS/Krb5LoginModule using des encytypes failure with NPE after JDK-8012679
978 Andrew Hughes Red Hat Weijun Wang Oracle JDK-8240024 Let allow_weak_crypto default to false
978 Andrew Hughes Red Hat Weijun Wang Oracle JDK-8240023 JAAS Krb5LoginModule has suspect ticket-renewal logic, relies on clockskew grace
978 Andrew Hughes Red Hat Weijun Wang Oracle JDK-8240022 Add kinit options and krb5.conf flags that allow users to obtain renewable tickets and specify ticket lifetimes
978 Andrew Hughes Red Hat N/A Unknown JDK-8240021 klist starttime, renewtill, ticket etype
978 Andrew Hughes Red Hat Weijun Wang Oracle JDK-8240020 Make KerberosTime immutable
978 Andrew Hughes Red Hat Weijun Wang Oracle JDK-8240019 krb5.conf does not accept directive lines before the first section
978 Andrew Hughes Red Hat Weijun Wang Oracle JDK-8240018 Simplify Config.get() of krb5
978 Andrew Hughes Red Hat Weijun Wang Oracle JDK-8240017 Kerberos ignores PA-DATA with a non-null s2kparams
978 Andrew Hughes Red Hat Jason Uh Oracle JDK-8240015 Update RFC references in javadoc to RFC 5280
978 Andrew Hughes Red Hat N/A Unknown JDK-8240014 "\\<>" in attribute value part of X500Principal constructor parameter makes strange effect
978 Andrew Hughes Red Hat Alan Bateman Oracle JDK-8240010 (ch) More channels cleanup
978 Andrew Hughes Red Hat Volker Simonis Amazon JDK-8240009 PPC64: Make the various POLL constants system dependant
978 Andrew Hughes Red Hat Robert Mckenna Oracle JDK-8240008 (sc) Replace use of temporary selectors in socket adapters with poll
978 Andrew Hughes Red Hat Andrew Hughes Red Hat JDK-8240007 Reserved for 2020-01 CPU
978 Andrew Hughes Red Hat Artem Smotrakov Independent JDK-8240005 KeyStore.load() throws an IOException with a wrong cause in case of wrong password
978 Andrew Hughes Red Hat Mandy Chung Oracle JDK-8240004 Some tests depend on internal API sun.misc.IOUtils
978 Andrew Hughes Red Hat Chris Hegarty Independent JDK-8240003 Examine usages of sun.misc.IOUtils
978 Andrew Hughes Red Hat N/A Unknown JDK-8240002 HttpTimestamper should accept https URI
978 Andrew Hughes Red Hat Andrew Hughes Red Hat JDK-8240001 [TESTBUG] Remove pointless catch block in test/jdk/sun/security/util/DerValue/BadValue.java
978 Andrew Hughes Red Hat Sean Mullan Oracle JDK-8240000 Incorrect behavior when reading DER value with Integer.MAX_VALUE length
978 Andrew Hughes Red Hat Brian Burkhalter Oracle JDK-8239999 Add InputStream readNBytes(int len)
978 Andrew Hughes Red Hat Brian Burkhalter Oracle JDK-8239998 Performance of InputStream.readAllBytes() could be improved
978 Andrew Hughes Red Hat Chris Hegarty Independent JDK-8239997 Add blocking bulk read operations to java.io.InputStream
978 Andrew Hughes Red Hat Robert Mckenna Oracle JDK-8239996 freetype seeks to index at the end of the font data
978 Andrew Hughes Red Hat Matthias Baesken SAP JDK-8239994 add result NULL-checking to freetypeScaler.c
978 Andrew Hughes Red Hat Andrew Hughes Red Hat JDK-8237604 [TEST_BUG] sun/security/tools/jarsigner/EntriesOrder.java not adapted for changes in JDK-7194449
978 Andrew Hughes Red Hat Tobias Hartmann Oracle JDK-8239985 Range check dependent CastII/ConvI2L is prematurely eliminated
978 Andrew Hughes Red Hat Vladimir Ivanov Oracle JDK-8239984 CastII/ConvI2L for a range check is prematurely eliminated
978 Andrew Hughes Red Hat Roland Westrelin Red Hat JDK-8239983 range check CastII nodes should not be split through Phi
978 Andrew Hughes Red Hat Tobias Hartmann Oracle JDK-8239982 need comprehensive fix for unconstrained ConvI2L with narrowed type
1096 Martin Balao Red Hat Philip Race Oracle JDK-8233331 OpenJDK7 returns incorrect TrueType font metrics
1099 Andrew Hughes Red Hat Philip Race Oracle JDK-8233088 Cannot use italic font style if the font has embedded bitmap
1099 Andrew Hughes Red Hat Andrew Hughes Red Hat JDK-8232643 Building error in jdk7u241 after 7068616
1110 Andrew Hughes Red Hat Philip Race Oracle JDK-8232503 crash in freetypeScaler.c CopyBW2Grey8
1110 Andrew Hughes Red Hat Sergey Bylokhov Amazon JDK-8232495 [macosx] Performance problems with Retina display on Mac OS X
1110 Andrew Hughes Red Hat Sergey Bylokhov Amazon JDK-8232492 [OGL] Translucent VolatileImages don't paint correctly
1110 Andrew Hughes Red Hat Sergey Bylokhov Amazon JDK-8232491 [OGL] surface->sw blit is extremely slow
1110 Andrew Hughes Red Hat Weijun Wang Oracle JDK-8232489 Better invalid FilePermission
1110 Andrew Hughes Red Hat David Katleman Oracle JDK-8232487 Clean-up JDK Build Warnings in java.util, java.io
1110 Andrew Hughes Red Hat N/A Unknown JDK-8232486 Warnings Cleanup in java.util.*
1110 Andrew Hughes Red Hat N/A Unknown JDK-8232485 Warnings Cleanup: some i18n classes in java.util and sun.util
1110 Andrew Hughes Red Hat N/A Unknown JDK-8232484 Misc warnings in java.util.PropertyPermission
1110 Andrew Hughes Red Hat N/A Unknown JDK-8232483 Reflection classes do not build with javac -Xlint:all -Werror
1110 Andrew Hughes Red Hat N/A Unknown JDK-8232482 Core libraries don't build with javac -Xlint:all -Werror
1110 Andrew Hughes Red Hat N/A Unknown JDK-8232481 NIO libraries do not build with javac -Xlint:all,-deprecation -Werror
1110 Andrew Hughes Red Hat Alan Bateman Oracle JDK-8232480 (fs) Build issue with src/solaris/classes/sun/nio/fs/SolarisUserDefinedFileAttributeView.java
1110 Andrew Hughes Red Hat Alan Bateman Oracle JDK-8232479 (fs) FileSystemProvider fails to initializes if run with file.encoding set to Cp037
1153 Martin Balao Red Hat Martin Balao Red Hat JDK-8226318 Placeholder for Class Loader improvements
1202 Andrew Hughes Red Hat Ramanand Patil Oracle JDK-8227916 tzdata2018i integration causes test failures on jdk-13
1202 Andrew Hughes Red Hat N/A Unknown JDK-8227915 (tz) Upgrade time-zone data to tzdata2018i
1202 Andrew Hughes Red Hat Ramanand Patil Oracle JDK-8227914 (tz) Upgrade time-zone data to tzdata2019a
1202 Andrew Hughes Red Hat Paul Sandoz Oracle JDK-8227911 Move Objects.checkIndex BiFunction accepting methods to an internal package
1202 Andrew Hughes Red Hat Paul Sandoz Oracle JDK-8227910 Improve exception reporting for Objects.checkIndex/checkFromToIndex/checkFromIndexSize
1202 Andrew Hughes Red Hat Paul Sandoz Oracle JDK-8227909 Utility methods to check indexes and ranges doesn't specify behavior when function produces null
1202 Andrew Hughes Red Hat Paul Sandoz Oracle JDK-8227908 Add utility methods to check indexes and ranges
1202 Andrew Hughes Red Hat Valerie Peng Oracle JDK-8227907 Crypto AES/ECB encryption/decryption performance regression (introduced in jdk9b73)
1202 Andrew Hughes Red Hat Vladimir Kozlov Oracle JDK-8227906 Refactor DigestBase.engineUpdate() method for better code generation by JIT compiler
1202 Andrew Hughes Red Hat Vladimir Kozlov Oracle JDK-8227904 Optimize sun.nio.cs.ISO_8859_1$Encode.encodeArrayLoop() (jdk part of 6896617)
1202 Andrew Hughes Red Hat Jayathirth D V Oracle JDK-8227902 JpegImageReader throws IndexOutOfBoundsException when trying to read image data from tables-only image
1202 Andrew Hughes Red Hat N/A Unknown JDK-8227891 Localized names for Japanese Era Reiwa in COMPAT provider
1202 Andrew Hughes Red Hat Frank Yuan Oracle JDK-8227890 localized currency symbol of VES
1202 Andrew Hughes Red Hat Frank Yuan Oracle JDK-8227889 ISO 4217 Amendment #169 Update
1202 Andrew Hughes Red Hat Frank Yuan Oracle JDK-8227888 ISO 4217 Amendment #168 Update
1202 Andrew Hughes Red Hat Frank Yuan Oracle JDK-8227887 ISO 4217 Amendment #167 Update
1202 Andrew Hughes Red Hat Frank Yuan Oracle JDK-8227886 ISO 4217 Amendment #166 Update
1202 Andrew Hughes Red Hat Frank Yuan Oracle JDK-8227885 ISO 4217 Amendment #165 Update
1202 Andrew Hughes Red Hat Adam Petcher Oracle JDK-8227884 Improved ECC Implementation
1202 Andrew Hughes Red Hat Vincent Ryan Oracle JDK-8227882 SunEC throws ProviderException on invalid curves
1202 Andrew Hughes Red Hat Vincent Ryan Oracle JDK-8227881 Various classes of sunec.jar are duplicated in rt.jar
1202 Andrew Hughes Red Hat David Katleman Oracle JDK-8227880 correct the field size check when decoding a point on ECC curve
1202 Andrew Hughes Red Hat N/A Unknown JDK-8227879 TEST_BUG: sun/security/tools/jarsigner/ec.sh occasionally fail due to keytool error on sparc
1202 Andrew Hughes Red Hat Adam Petcher Oracle JDK-8227878 ECC Field Arithmetic Enhancements
1202 Andrew Hughes Red Hat Hamlin Li Huawei JDK-8227877 sun/text/resources/LocaleDataTest.java fails with java.lang.Exception
1202 Andrew Hughes Red Hat Naoto Sato Oracle JDK-8227876 Support ISO 4217 Amendments 163 and 164
1202 Andrew Hughes Red Hat Adam Petcher Oracle JDK-8227875 X25519/X448 code improvements
1202 Andrew Hughes Red Hat Adam Petcher Oracle JDK-8227874 Branch-free output conversion for X25519 and X448
1202 Andrew Hughes Red Hat Adam Petcher Oracle JDK-8227873 Efficient and constant-time modular arithmetic
1263 Martin Balao Red Hat Sergey Bylokhov Amazon JDK-8224153 Exception in thread "AWT-EventQueue-1" java.lang.IllegalArgumentException: null source
1293 Andrew Hughes Red Hat Svetlana Steuck Oracle JDK-8222662 Currency update needed for ISO 4217 Amendment #162.
1293 Andrew Hughes Red Hat Svetlana Steuck Oracle JDK-8222661 Currency update needed for ISO 4217 Amendment #161
1293 Andrew Hughes Red Hat Naoto Sato Oracle JDK-8222660 Support ISO 4217 "Current funds codes" table (A.2)
1293 Andrew Hughes Red Hat Alan Bateman Oracle JDK-8222659 Override mechanism for currency data should not require creating currency.properties in java.home
1293 Andrew Hughes Red Hat Yong Huang Oracle JDK-8222658 ISO 4217 amendment 160
1293 Andrew Hughes Red Hat Sean Mullan Oracle JDK-8222657 Allow later Symantec Policy distrust date for two Apple SubCAs
1293 Andrew Hughes Red Hat Sean Mullan Oracle JDK-8222656 Distrust TLS server certificates anchored by Symantec Root CAs
1293 Andrew Hughes Red Hat Sean Mullan Oracle JDK-8222655 TLS_EMPTY_RENEGOTIATION_INFO_SCSV is disabled after 8211883
1293 Andrew Hughes Red Hat Naoto Sato Oracle JDK-8222654 Replace the placeholder Japanese era name
1293 Andrew Hughes Red Hat Naoto Sato Oracle JDK-8222653 Calendar.getDisplayName() returns empty string for new Japanese Era on some locales
1293 Andrew Hughes Red Hat Xiaofeng Yang Tencent JDK-8222652 Move java/util/Calendar/CalendarTestScripts tests into OpenJDK
1293 Andrew Hughes Red Hat Andrew Hughes Red Hat JDK-8222449 freetypecheck compares versions using lexicographic comparison
1293 Andrew Hughes Red Hat Andrew Hughes Red Hat JDK-8222648 Remove Linux version check from HotSpot builds
1294 Andrew Hughes Red Hat Naoto Sato Oracle JDK-8222541 Add test cases for lenient Japanese era parsing
1294 Andrew Hughes Red Hat Naoto Sato Oracle JDK-8222540 Placeholder for Japanese new era should be two characters
1294 Andrew Hughes Red Hat Naoto Sato Oracle JDK-8222539 Japanese new era implementation
1308 Martin Balao Red Hat Martin Balao Red Hat JDK-8221873 AWT hang occurs when sequenced events arrive out of sequence in multiple AppContexts.
1308 Martin Balao Red Hat Joe Darcy Oracle JDK-8221856 Define "headful" jtreg keyword
1308 Martin Balao Red Hat Sean Coffey Oracle JDK-8221855 Add new jtreg keywords to jdk 8
1327 Andrew Hughes Red Hat Andrew Hughes Red Hat JDK-8219570 JDK-6383200 wrongly extends PBEParameterSpec API
1348 Andrew Hughes Red Hat Martin Balao Red Hat JDK-8219510 Update copyright headers of files in src tree that are missing Classpath exception
1351 Andrew Hughes Red Hat Ramanand Patil Oracle JDK-8219306 (tz) Upgrade time-zone data to tzdata2018g
1351 Andrew Hughes Red Hat Sean Mullan Oracle JDK-8219305 Disable anon and NULL cipher suites
1351 Andrew Hughes Red Hat Xuelei Fan @global.tencent.com JDK-8219303 Introduce system property to control enabled ciphersuites
1351 Andrew Hughes Red Hat Xuelei Fan @global.tencent.com JDK-8219302 Hot lock on BulkCipher.isAvailable
1351 Andrew Hughes Red Hat John Jiang Tencent JDK-8219301 Create test to cover JDK-8205330 InitialDirContext ctor sometimes throws NPE if the server has sent a disconnection
1351 Andrew Hughes Red Hat Sean Coffey Oracle JDK-8219300 CipherCore performance improvement
1351 Andrew Hughes Red Hat Sean Coffey Oracle JDK-8219299 Further improvements to cipher buffer management
1351 Andrew Hughes Red Hat Vincent Ryan Oracle JDK-8219296 PBE: need new algorithm support in password based encryption
1351 Andrew Hughes Red Hat Sean Coffey Oracle JDK-8219295 Better management of CipherCore buffers
1351 Andrew Hughes Red Hat Sean Coffey Oracle JDK-8219294 Better management of internal KeyStore buffers
1351 Andrew Hughes Red Hat Vyom Tewari Independent JDK-8219293 InitialDirContext ctor sometimes throws NPE if the server has sent a disconnection
1351 Andrew Hughes Red Hat Weijun Wang Oracle JDK-8219291 sun/security/tools/jarsigner/warnings/NoTimestampTest.java fails after JDK-8027781
1351 Andrew Hughes Red Hat Weijun Wang Oracle JDK-8219290 New jarsigner timestamp warning is grammatically incorrect
1351 Andrew Hughes Red Hat Weijun Wang Oracle JDK-8219289 jarsigner should print when a timestamp will expire
1351 Andrew Hughes Red Hat Ivan Gerasimov Google JDK-8219287 Native implementation of sunmscapi should use operator new (nothrow) for allocations
1351 Andrew Hughes Red Hat Ivan Gerasimov Google JDK-8219286 MSCAPI provider does not create unique alias names
1351 Andrew Hughes Red Hat Weijun Wang Oracle JDK-8219285 MSCAPI keystore should accept Certificate[] in setEntry()
1351 Andrew Hughes Red Hat Ivan Gerasimov Google JDK-8219284 Do cleanup in a proper order in sunmscapi code
1351 Andrew Hughes Red Hat Albert Noll Oracle JDK-8219267 compile.cpp verify_graph_edges uses "bool" as "int"
1351 Andrew Hughes Red Hat Mikael Vidstedt Oracle JDK-8219265 Unaligned memory access in Bits.c
1351 Andrew Hughes Red Hat Andrew Hughes Red Hat JDK-8218798 slowdebug build broken by JDK-8205714
1446 Andrew Hughes Red Hat Martin Balao Red Hat JDK-8213925 Support TLS v1.2 algorithm in SunPKCS11 provider
1447 Andrew Hughes Red Hat Ramanand Patil Oracle JDK-8213886 LDAPS communication failure with jdk 1.8.0_181
1447 Andrew Hughes Red Hat Philip Race Oracle JDK-8213883 Upgrade JDK to libpng 1.6.35
1447 Andrew Hughes Red Hat Jamil Nimeh Oracle JDK-8213882 Disable all DES cipher suites
1447 Andrew Hughes Red Hat N/A Unknown JDK-8213881 Resources not freed on exception
1447 Andrew Hughes Red Hat Pavel Rappo Oracle JDK-8213880 Pending exceptions in java.base/windows/native/libnet
1447 Andrew Hughes Red Hat Sean Coffey Oracle JDK-8213879 Impact of noncloneable MessageDigest implementation
1447 Andrew Hughes Red Hat Weijun Wang Oracle JDK-8213877 jarsigner treats timestamped signed jar invalid after the signer cert expires
1447 Andrew Hughes Red Hat Weijun Wang Oracle JDK-8213876 Use PKIXValidator in jarsigner
1447 Andrew Hughes Red Hat Weijun Wang Oracle JDK-8213874 test/sun/security/tools/jarsigner/concise_jarsigner.sh failing (cert expired?)
1447 Andrew Hughes Red Hat Weijun Wang Oracle JDK-8213873 jarsigner should emit warning if weak algorithms or keysizes are used
1447 Andrew Hughes Red Hat Weijun Wang Oracle JDK-8213872 Feed some text to STDIN in ProcessTools.executeProcess()
1447 Andrew Hughes Red Hat N/A Unknown JDK-8213871 Handshake messages can be strictly ordered
1447 Andrew Hughes Red Hat Weijun Wang Oracle JDK-8213869 Two security tools tests do not run with only JRE
1447 Andrew Hughes Red Hat Sergey Bylokhov Amazon JDK-8213867 Some of the input validation in the javasound is too strict
1447 Andrew Hughes Red Hat Sergey Bylokhov Amazon JDK-8213866 Unexpected exceptions and timeouts in SF2 parser code
1447 Andrew Hughes Red Hat N/A Unknown JDK-8213854 Miscellaneous warnings sun.misc ( and related classes )
1447 Andrew Hughes Red Hat N/A Unknown JDK-8213853 rawtype warnings in several net, nio and security source files
1447 Andrew Hughes Red Hat N/A Unknown JDK-8213852 test/sun/misc/JarIndex/metaInfFilenames/Basic.java should use supported compiler interface
1447 Andrew Hughes Red Hat N/A Unknown JDK-8213851 clean up warnings in java.util.jar, .logging, .prefs
1447 Andrew Hughes Red Hat Andrew Hughes Red Hat JDK-7142888 sun/security/tools/jarsigner/ec.sh fail on sparc
1447 Andrew Hughes Red Hat Tobias Hartmann Oracle JDK-8213850 Crash with assert(handler_address == SharedRuntime::compute_compiled_exc_handler(..) failed: Must be the same
1538 Andrew Hughes Red Hat Andrew Hughes Red Hat JDK-8207151 JVM 7u181 crash with SIGSEGV when Tomcat 7 starts
1550 Andrew Hughes Red Hat Roger Riggs Oracle JDK-8208742 ObjectInputStream filterCheck method throws NullPointerException
1550 Andrew Hughes Red Hat Ramanand Patil Oracle JDK-8208741 (tz) Upgrade time-zone data to tzdata2018e
1550 Andrew Hughes Red Hat Robert Mckenna Oracle JDK-8208740 Remove debug print statements from RMI fix
1550 Andrew Hughes Red Hat Alexey Ivanov Oracle JDK-8208739 Fix potential crash in BufImg_SetupICM
1550 Andrew Hughes Red Hat Ramanand Patil Oracle JDK-8208738 (tz) Upgrade time-zone data to tzdata2018d
1550 Andrew Hughes Red Hat Christoph Langer SAP JDK-8208737 Unable to use JDWP API in JDK 8 to debug JDK 9 VM
1550 Andrew Hughes Red Hat Sean Coffey Oracle JDK-8208736 TestFlushableGZIPOutputStream failing with IndexOutOfBoundsException
1550 Andrew Hughes Red Hat Dmitry Markov Oracle JDK-8208734 On Windows Swing changes keyboard layout on a window activation
1550 Andrew Hughes Red Hat Artem Smotrakov Independent JDK-8208733 sun/security/mscapi/SignedObjectChain.java fails on Windows
1550 Andrew Hughes Red Hat Jamil Nimeh Oracle JDK-8208732 When determining the ciphersuite lists there is no debug output for disabled suites.
1550 Andrew Hughes Red Hat Artem Smotrakov Independent JDK-8208731 SupportedDSAParamGen.java failed with timeout
1550 Andrew Hughes Red Hat Jason Uh Oracle JDK-8208730 EndEntityChecker should not process custom extensions after PKIX validation
1550 Andrew Hughes Red Hat Vincent Ryan Oracle JDK-8208729 sun/security/pkcs11/ec/ReadCertificates.java fails intermittently
1550 Andrew Hughes Red Hat Philip Race Oracle JDK-8208722 gcc warnings compiling various libraries files
1550 Andrew Hughes Red Hat Alan Bateman Oracle JDK-8208718 JarFacade.c should not include ctype.h
1550 Andrew Hughes Red Hat Alan Bateman Oracle JDK-8208717 gcc warnings compiling src/solaris/native/sun/management
1550 Andrew Hughes Red Hat Alan Bateman Oracle JDK-8208716 gcc warnings compiling src/solaris/native/sun/security/pkcs11
1550 Andrew Hughes Red Hat Andrew Hughes Red Hat JDK-8205587 Implicit function declaration in jni_util.c
1608 Andrew Hughes Red Hat Valerie Peng Oracle JDK-8204484 Release session if initialization of SunPKCS11 Signature fails
1622 Andrew Hughes Red Hat Xuelei Fan @global.tencent.com JDK-8203760 sun/security/ssl/javax/net/ssl/ServerName/IllegalSNIName.java fails
1622 Andrew Hughes Red Hat Xuelei Fan @global.tencent.com JDK-8203759 IDN do not throw IAE when hostname ends with a trailing dot
1622 Andrew Hughes Red Hat Robert Mckenna Oracle JDK-8203754 tomcat gzip-compressed response bodies appear to be broken in update 151
1622 Andrew Hughes Red Hat Semyon Sadetsky Oracle JDK-8203749 [Windows] java.awt.IllegalComponentStateException: component must be showing on the screen to determine its location
1622 Andrew Hughes Red Hat Sean Coffey Oracle JDK-8203747 increase java.util.logging.FileHandler MAX_LOCKS limit
1622 Andrew Hughes Red Hat Sean Coffey Oracle JDK-8203746 Improve javax.crypto.BadPaddingException messages
1622 Andrew Hughes Red Hat Artem Smotrakov Independent JDK-8203745 Class name repeated in output of Type.toString()
1622 Andrew Hughes Red Hat Bradford Wetmore Oracle JDK-8203739 Build the JCE portion of JDK-8000970
1622 Andrew Hughes Red Hat Philip Race Oracle JDK-8203732 JDK should be updated to use LittleCMS 2.8
1622 Andrew Hughes Red Hat Joe Darcy Oracle JDK-8203728 Fix more doclint issues in javax.security
1622 Andrew Hughes Red Hat Roger Riggs Oracle JDK-8203727 javadoc errors in core libs
1622 Andrew Hughes Red Hat N/A Unknown JDK-8203726 Use @code friendly idiom for '\' in javadoc
1622 Andrew Hughes Red Hat Jason Uh Oracle JDK-8203725 Cleanup of the javadoc tag in java.security.*
1622 Andrew Hughes Red Hat Andrew Hughes Red Hat JDK-8200760 java.security-linux was missed in backport of JDK-8160104
1622 Andrew Hughes Red Hat Andrew Hughes Red Hat JDK-8202850 Fix for 8189123 doesn't include precompiled headers
1685 Andrew Hughes Red Hat Andrew Hughes Red Hat JDK-8200056 Bad primeCertainty value setting in DSAParameterGenerator
1685 Andrew Hughes Red Hat Svetlana Steuck Oracle JDK-8200055 (tz) Upgrade time-zone data to tzdata2018c
1685 Andrew Hughes Red Hat Amy Lu Oracle JDK-8200054 tools/pack200/Pack200Test.java fails on Win32: Could not reserve enough space
1685 Andrew Hughes Red Hat Semyon Sadetsky Oracle JDK-8200053 With JDK 1.7 text field does not obtain focus when using mnemonic Alt/Key combin
1685 Andrew Hughes Red Hat Ramanand Patil Oracle JDK-8200051 test tck.java.time.zone.TCKZoneRules is broken by tzdata2017c
1685 Andrew Hughes Red Hat Ramanand Patil Oracle JDK-8200050 (tz) Support tzdata2017c
1685 Andrew Hughes Red Hat Masayoshi Okutsu Independent JDK-8200049 Unexpected timezone returned after parsing a date
1685 Andrew Hughes Red Hat N/A Unknown JDK-8200048 Increase the number of clones in the CloneableDigest
1685 Andrew Hughes Red Hat N/A Unknown JDK-8200045 [TEST_BUG] sun/security/pkcs11/KeyPairGenerator/TestDH2048.java fails on Solaris x64 5.10
1685 Andrew Hughes Red Hat Roger Riggs Oracle JDK-8200042 [testlibrary] TestSocketFactory should allow triggers before match/replace
1685 Andrew Hughes Red Hat Roger Riggs Oracle JDK-8200041 [testlibrary] rmi TestSocketFactory does not flush
1685 Andrew Hughes Red Hat N/A Unknown JDK-8200040 Backport jdk/test/lib/testlibrary/CompilerUtils.java to jdk8u which is helpful in test development
1685 Andrew Hughes Red Hat Prasanta Sadhukhan Oracle JDK-8200039 Text in native popup is not always updated with Sogou IME
1685 Andrew Hughes Red Hat Xuelei Fan @global.tencent.com JDK-8200038 Check the AlgorithmParameters in algorithm constraints
1685 Andrew Hughes Red Hat Valerie Peng Oracle JDK-8200037 [TEST_BUG] Cipher tests fail when running with unlimited policy
1685 Andrew Hughes Red Hat Artem Smotrakov Independent JDK-8200036 TestCipher.java doesn't check one of the decrypted message as expected
1685 Andrew Hughes Red Hat Artem Smotrakov Independent JDK-8200035 Tests for JCE crypto ciphers (part 1)
1685 Andrew Hughes Red Hat Valerie Peng Oracle JDK-8200034 Need to add tests for AES cipher
1685 Andrew Hughes Red Hat Vincent Ryan Oracle JDK-8200033 Need new regressions tests for buffer handling for PBE algorithms
1685 Andrew Hughes Red Hat Xuelei Fan @global.tencent.com JDK-8200032 Need new regression tests for PBE keys
1685 Andrew Hughes Red Hat Bradford Wetmore Oracle JDK-8200031 Enable unlimited cryptographic policy by default in Oracle JDK builds
1685 Andrew Hughes Red Hat Sean Coffey Oracle JDK-8200030 sun/net/www/http/HttpClient/B8025710.java should run in ovm mode
1685 Andrew Hughes Red Hat N/A Unknown JDK-8200029 [TEST_BUG] test sun/net/www/http/HttpClient/B8025710.java failing with cert error in 8u121 b01
1685 Andrew Hughes Red Hat N/A Unknown JDK-8200028 Restrict the use of EXPORT cipher suites
1685 Andrew Hughes Red Hat Artem Smotrakov Independent JDK-8200027 com/sun/crypto/provider/KeyAgreement/SupportedDHParamGens.java failed with timeout
1685 Andrew Hughes Red Hat Xuelei Fan @global.tencent.com JDK-8200026 Use short name of SupportedEllipticCurvesExtension.java
1685 Andrew Hughes Red Hat Hamlin Li Huawei JDK-8200024 sun/security/provider/NSASuiteB/TestDSAGenParameterSpec.java timeouts intermittently
1685 Andrew Hughes Red Hat Valerie Peng Oracle JDK-8200023 Additional tests for signature algorithm OIDs and transformation string
1685 Andrew Hughes Red Hat Xuelei Fan @global.tencent.com JDK-8200021 Support DHE sizes up to 8192-bits and DSA sizes up to 3072-bits
1685 Andrew Hughes Red Hat Vincent Ryan Oracle JDK-8200020 Cipher getParameters() throws RuntimeException: Cannot find SunJCE provider
1685 Andrew Hughes Red Hat Sean Coffey Oracle JDK-8200019 Print size of DH keysize when errors are encountered
1685 Andrew Hughes Red Hat Xuelei Fan @global.tencent.com JDK-8200015 Transport Layer Security (TLS) Session Hash and Extended Master Secret Extension
1685 Andrew Hughes Red Hat Chris Hegarty Independent JDK-8200006 security native code doesn't always use malloc, realloc, and calloc correctly
1685 Andrew Hughes Red Hat Valerie Peng Oracle JDK-8200002 Implement reliability test for DH algorithm
1685 Andrew Hughes Red Hat Alan Bateman Oracle JDK-8199998 DNS provider cleanups
1685 Andrew Hughes Red Hat Andrew Brygin Azul JDK-8199995 Crash on PPC and PPC v2 for Java_awt test suit
1685 Andrew Hughes Red Hat Andrew Brygin Azul JDK-8199994 Fix for 8025429 breaks jdk build on windows
1685 Andrew Hughes Red Hat Andrew Brygin Azul JDK-8199992 Crash during color profile destruction
1685 Andrew Hughes Red Hat Andrew Brygin Azul JDK-8199991 sun/java2d/cmm/ tests failed against RI b141 & b138-nightly
1685 Andrew Hughes Red Hat Andrew Brygin Azul JDK-8199989 [lcms] ColorConvertOp: Alpha channel is not transferred from source to destination.
1685 Andrew Hughes Red Hat Andrew Brygin Azul JDK-8199988 Test test/sun/awt/image/bug8038000.java fails with ClassCastException
1685 Andrew Hughes Red Hat Andrew Brygin Azul JDK-8199987 [lcms] Improve performance of ColorConverOp for default destinations
1685 Andrew Hughes Red Hat Andrew Brygin Azul JDK-8199986 [lcms] ColorConvertOp to color space CS_GRAY apparently converts orange to 244,244,0
1685 Andrew Hughes Red Hat Andrew Brygin Azul JDK-8199985 NullPointerException when running regression tests LoadProfileTest by using openjdk-7-b144
1685 Andrew Hughes Red Hat Andrew Brygin Azul JDK-8199984 Need to provide benchmarks for color management
1685 Andrew Hughes Red Hat Aleksey Shipilev Red Hat JDK-8199973 Missing return statement in __sync_val_compare_and_swap_8
1685 Andrew Hughes Red Hat N/A Unknown JDK-8199972 Zero debug build fails on "assert(labs(istate->_stack_base - istate->_stack_limit) == (istate->_method->max_stack() + extra_stack_entries + 1)) failed: bad stack limit"
1685 Andrew Hughes Red Hat Christian Thalinger Twitter JDK-8199971 Clang: enable return type warnings on BSD
1685 Andrew Hughes Red Hat Coleen Phillimore Oracle JDK-8199970 Zero build requires disabled warnings
1685 Andrew Hughes Red Hat Stefan Karlsson Oracle JDK-8199969 Fix debug build after 8062808: Turn on the -Wreturn-type warning
1685 Andrew Hughes Red Hat Stefan Karlsson Oracle JDK-8199968 Turn on the -Wreturn-type warning
1685 Andrew Hughes Red Hat Christian Thalinger Twitter JDK-8199967 clang: remove -Wno-unused-value
1685 Andrew Hughes Red Hat Coleen Phillimore Oracle JDK-8199966 Change 8037816 breaks HS build on PPC64 and CPP-Interpreter platforms
1685 Andrew Hughes Red Hat David Chase Oracle JDK-8199964 Change 8037816 breaks HS build with older GCC versions which don't support diagnostic pragmas
1685 Andrew Hughes Red Hat N/A Unknown JDK-8199963 fastdebug builds fail due to lack of p2i
1685 Andrew Hughes Red Hat Erik Helin Oracle JDK-8199962 Disable deprecation warning for readdir_r
1685 Andrew Hughes Red Hat Thomas Schatzl Oracle JDK-8199961 Interned string and symbol table leak memory during parallel unlinking
1685 Andrew Hughes Red Hat Kevin Walls Oracle JDK-8199960 JVM crashes sometimes while starting
1685 Andrew Hughes Red Hat Coleen Phillimore Oracle JDK-8199955 linux-zero does not build without precompiled header
1685 Andrew Hughes Red Hat N/A Unknown JDK-8199954 Bad backport of 8024468 breaks Zero build due to lack of 8010862 in OpenJDK 7
1685 Andrew Hughes Red Hat Andrew Hughes Red Hat JDK-8196978 JDK-8187667 fails on GCC 4.4.7 as found on RHEL 6
1685 Andrew Hughes Red Hat Aleksej Efimov Oracle JDK-8199953 XSOM parser incorrectly processes type names with whitespaces
1685 Andrew Hughes Red Hat Aleksej Efimov Oracle JDK-8199949 Suppress not recognized property/feature warning messages from SAXParser
1775 Andrew Hughes Red Hat Petr Pchelko Oracle JDK-8194039 JNU_CHECK_EXCEPTION should support c++ JNI syntax
1775 Andrew Hughes Red Hat Sean Coffey Oracle JDK-8194038 Ship the unlimited policy files in JDK Updates
1775 Andrew Hughes Red Hat Sean Coffey Oracle JDK-8194037 CertificateException missing cause of underlying exception
1775 Andrew Hughes Red Hat Sergey Bylokhov Amazon JDK-8194036 Attempting to remove help menu from java.awt.MenuBar throws NullPointerException
1775 Andrew Hughes Red Hat Sean Mullan Oracle JDK-8194035 NPE hit with java.security.debug=provider
1775 Andrew Hughes Red Hat Dmitry Markov Oracle JDK-8194034 IllegalArgumentException in java.awt.image.ReplicateScaleFilter
1775 Andrew Hughes Red Hat Christoph Langer SAP JDK-8194033 Fix compatibility issue in AlgorithmChecker for 3rd party JCE providers
1775 Andrew Hughes Red Hat Weijun Wang Oracle JDK-8194032 keytool fails to format resource strings for keys for some languages after JDK-8171319
1775 Andrew Hughes Red Hat Weijun Wang Oracle JDK-8194029 sun/security/krb5/auto/MaxRetries.java failed with timeout
1775 Andrew Hughes Red Hat Weijun Wang Oracle JDK-8194028 sun/security/krb5/auto/MaxRetries.java fails with Retry count is -1 less
1775 Andrew Hughes Red Hat N/A Unknown JDK-8194027 Do not call File::deleteOnExit in security tests
1775 Andrew Hughes Red Hat Weijun Wang Oracle JDK-8194026 sun/security/krb5/auto/MaxRetries.java may fail with BindException
1775 Andrew Hughes Red Hat N/A Unknown JDK-8194025 enhance KDC server availability detection
1775 Andrew Hughes Red Hat Peter Levart Independent JDK-8194023 Hashtable deserialization reconstitutes table with wrong capacity
1775 Andrew Hughes Red Hat Ivan Gerasimov Google JDK-8194022 (coll) IdentityHashMap is resized before exceeding the expected maximum size
1775 Andrew Hughes Red Hat Brian Burkhalter Oracle JDK-8194021 More defensive HashSet.readObject
1775 Andrew Hughes Red Hat Valerie Peng Oracle JDK-8194019 PKCS11 provider should support 2048-bit DH
1775 Andrew Hughes Red Hat Konstantin Shefov Azul JDK-8194017 More Signature tests
1775 Andrew Hughes Red Hat Weijun Wang Oracle JDK-8194015 New defaults for DSA keys in jarsigner and keytool
1775 Andrew Hughes Red Hat Iris Clark Oracle JDK-8194006 Loading JKS keystore using non-null InputStream results in closed stream
1775 Andrew Hughes Red Hat Vincent Ryan Oracle JDK-8194005 Support keystore type detection for JKS and PKCS12 keystores
1775 Andrew Hughes Red Hat Vincent Ryan Oracle JDK-8194004 NullPointerException in PKCS#12 Keystore in PKCS12KeyStore.java
1775 Andrew Hughes Red Hat Vincent Ryan Oracle JDK-8194003 attributes are ignored when loading keys from a PKCS12 keystore
1775 Andrew Hughes Red Hat Vincent Ryan Oracle JDK-8194002 Cleanup PKCS12 tests to ensure streams get closed
1775 Andrew Hughes Red Hat Vincent Ryan Oracle JDK-8194001 Avoid storing duplicate PKCS12 attributes
1775 Andrew Hughes Red Hat Vincent Ryan Oracle JDK-8194000 PKCS12 test failure due to incorrect alias name
1775 Andrew Hughes Red Hat Vincent Ryan Oracle JDK-8193999 javadoc cleanup for 8005408
1775 Andrew Hughes Red Hat Weijun Wang Oracle JDK-8193998 keytool should not warn if signature algorithm used in cacerts is weak
1775 Andrew Hughes Red Hat Weijun Wang Oracle JDK-8193997 keytool should print out warnings when reading or generating cert/cert req using weak algorithms
1775 Andrew Hughes Red Hat Weijun Wang Oracle JDK-8193995 Keytool, print key algorithm of certificate or key entry
1775 Andrew Hughes Red Hat Vincent Ryan Oracle JDK-8193994 PKCS12KeyStore cannot extract AES Secret Keys
1775 Andrew Hughes Red Hat Jaroslav Bachorík DataDog JDK-8193993 String "Tabular Navigation" should be rephrased for avoiding mistranslation
1775 Andrew Hughes Red Hat Michael Fang Oracle JDK-8193992 jdk8 l10n resource file translation update 4
1775 Andrew Hughes Red Hat N/A Unknown JDK-8193991 clarification on warning of keytool -printcrl
1775 Andrew Hughes Red Hat Vincent Ryan Oracle JDK-8193990 KeyStore API enhancements
1775 Andrew Hughes Red Hat Vyom Tewari Independent JDK-8193986 SocketInputStream.socketRead0 can hang even with soTimeout set
1775 Andrew Hughes Red Hat Hamlin Li Huawei JDK-8193984 Missing @bug for tests added with JDK-8165367
1775 Andrew Hughes Red Hat Philip Race Oracle JDK-8193979 Upgrade JDK to use LittleCMS 2.7
1775 Andrew Hughes Red Hat Sean Mullan Oracle JDK-8193974 Minor optimizations to ISO10126PADDING
1775 Andrew Hughes Red Hat Valerie Peng Oracle JDK-8193969 CICO ignores AAD in GCM mode
1775 Andrew Hughes Red Hat David Katleman Oracle JDK-8193964 CertPath/CertPathValidatorTest/KeyParamsInheritanceTest fails with NullPointerException
1775 Andrew Hughes Red Hat Sean Mullan Oracle JDK-8193963 OCSP client can't find responder cert if it uses a different subject key id algorithm than responderID
1775 Andrew Hughes Red Hat Vincent Ryan Oracle JDK-8193962 Certificate validation - java.lang.ClassCastException
1775 Andrew Hughes Red Hat Vincent Ryan Oracle JDK-8193961 OCSP validation fails if ocsp.responderCertSubjectName is set
1775 Andrew Hughes Red Hat Sean Mullan Oracle JDK-8193960 NullPointerException in sun.security.provider.certpath.CertId()
1775 Andrew Hughes Red Hat N/A Unknown JDK-8193957 ReverseBuilder.getMatchingCACerts may throws NPE
1775 Andrew Hughes Red Hat N/A Unknown JDK-8193956 Add OCSP support to PKIX CertPathBuilder implementation
1775 Andrew Hughes Red Hat N/A Unknown JDK-8193955 Revocation checking enhancements (JEP-124)
1775 Andrew Hughes Red Hat Anthony Scarpino Oracle JDK-8193954 Improved algorithm constraints checking
1775 Andrew Hughes Red Hat Andrew Hughes Red Hat JDK-8191845 [TEST_BUG] Too many new-lines in backport of WeakAlg test
1775 Andrew Hughes Red Hat Andrew Hughes Red Hat JDK-8191840 Update localizations with positional arguments following JDK-8191137
1775 Andrew Hughes Red Hat Harold Seigel Oracle JDK-8193953 There are issues with shared data on windows
1775 Andrew Hughes Red Hat Igor Veresov Oracle JDK-8193952 SIGBUS in C2 compiled method weblogic.wsee.jaxws.framework.jaxrpc.EnvironmentFactory$SimulatedWsdlDefinitions.
1775 Andrew Hughes Red Hat Vladimir Kozlov Oracle JDK-8193951 PPC64: Adapt to 8002074: Support for AES on SPARC
1775 Andrew Hughes Red Hat Vladimir Kozlov Oracle JDK-8193950 Support for AES on SPARC
1775 Andrew Hughes Red Hat Kim Barrett Oracle JDK-8193948 HotSpot VM fails to start when AggressiveHeap is set
1882 Andrew Hughes Red Hat N/A Unknown JDK-8187216 Jar file verification failing with SecurityException: digest missing xxx
1882 Andrew Hughes Red Hat Paul Sandoz Oracle JDK-8187215 Incorrect return processing for the LF editor of MethodHandles.permuteArguments
1882 Andrew Hughes Red Hat Mikhail Cherkasov Oracle JDK-8187214 Menu is activated after using mnemonic Alt/Key combination
1882 Andrew Hughes Red Hat Ramanand Patil Oracle JDK-8187213 (tz) Support tzdata2017b
1882 Andrew Hughes Red Hat Roger Riggs Oracle JDK-8187212 After updating to Java8u131, the bind to rmiregistry is rejected by registryFilter even though registryFilter is set
1882 Andrew Hughes Red Hat Prem Balakrishnan Oracle JDK-8187211 JFileChooser with Windows look and feel crashes on win 10
1882 Andrew Hughes Red Hat Alexander Zvegintsev Oracle JDK-8187208 [macos] JComboBox doesn't display popup in mixed JavaFX Swing Application on 8u131 and Mac OS 10.12
1882 Andrew Hughes Red Hat Sean Coffey Oracle JDK-8187203 LdapCtx.processReturnCode() throwing Null Pointer Exception
1882 Andrew Hughes Red Hat Valerie Peng Oracle JDK-8187201 Failed to load RSA private key from pkcs12
1882 Andrew Hughes Red Hat Weijun Wang Oracle JDK-8187200 Test PKCS8Test.java fails
1882 Andrew Hughes Red Hat Mandy Chung Oracle JDK-8187195 Race Condition in java.lang.reflect.WeakCache
1882 Andrew Hughes Red Hat N/A Unknown JDK-8187185 fix warnings in java.util.jar, sun.tools.jar, zipfs demo, etc.
1882 Andrew Hughes Red Hat Hamlin Li Huawei JDK-8187181 Additional tests for JEP 288: Disable SHA-1 Certificates
1882 Andrew Hughes Red Hat Volker Simonis Amazon JDK-8187180 java.nio.Bits.unaligned() doesn't return true on ppc
1882 Andrew Hughes Red Hat Stuart Marks Oracle JDK-8187178 suppress deprecation warnings in sun.rmi
1882 Andrew Hughes Red Hat Roger Riggs Oracle JDK-8187176 Macros for checking and returning on exceptions
1882 Andrew Hughes Red Hat Petr Pchelko Oracle JDK-8187175 Windows build failed after JDK-8030787
1882 Andrew Hughes Red Hat Philip Race Oracle JDK-8187173 backport of 8031737 to jdk8u breaks linux buld.
1882 Andrew Hughes Red Hat Roger Riggs Oracle JDK-8187172 CHECK_NULL and CHECK_EXCEPTION macros cleanup
1882 Andrew Hughes Red Hat Jaroslav Bachorík DataDog JDK-8187170 sun.management.LazyCompositeData.isTypeMatched() fails for composite types with items of ArrayType
1882 Andrew Hughes Red Hat N/A Unknown JDK-8187169 Warnings in sun.mangement.* and its subpackages
1882 Andrew Hughes Red Hat N/A Unknown JDK-8187168 Warnings in sun.instrument, tools and other sun.* classes
1882 Andrew Hughes Red Hat Vladimir Kozlov Oracle JDK-8187166 [TESTBUG] 8174164 fix missed the test
1882 Andrew Hughes Red Hat Vladimir Kozlov Oracle JDK-8187165 SafePointNode::_replaced_nodes breaks with irreducible loops
1882 Andrew Hughes Red Hat Vladimir Ivanov Oracle JDK-8187164 ReplacedNodes dumps it's content to tty
1882 Andrew Hughes Red Hat Roland Westrelin Red Hat JDK-8187163 Make replace_in_map() on parent maps generic
1882 Andrew Hughes Red Hat Roland Westrelin Red Hat JDK-8187162 replace_in_map() should operate on parent maps
1882 Andrew Hughes Red Hat Erik Helin Oracle JDK-8187161 Build failure with glibc >= 2.24: error: 'int readdir_r(DIR*, dirent*, dirent**)' is deprecated
1882 Andrew Hughes Red Hat Andrew Hughes Red Hat JDK-8185716 OpenJDK 7 PPC64 port uses a different ins_encode format in ppc.ad
1882 Andrew Hughes Red Hat Andrew Hughes Red Hat JDK-8185502 No overflow operator on OpenJDK 7
1882 Andrew Hughes Red Hat Andrew Hughes Red Hat JDK-8185501 Missing import in JAXP code
1986 Andrew Hughes Red Hat Alexander Potochkin Oracle JDK-8181031 serialVersionUID of java.awt.dnd.InvalidDnDOperationException changed in JDK8-b82
1986 Andrew Hughes Red Hat Ramanand Patil Oracle JDK-8181030 (tz) Support tzdata2017a
1986 Andrew Hughes Red Hat N/A Unknown JDK-8181026 jar usage string mentions unsupported option
1986 Andrew Hughes Red Hat Michael Fang Oracle JDK-8181025 l10n for policytool
1986 Andrew Hughes Red Hat Sean Coffey Oracle JDK-8181024 IllegalArgumentException: jdk.tls.namedGroups
1986 Andrew Hughes Red Hat Ramanand Patil Oracle JDK-8181016 (tz) Support tzdata2016j
1986 Andrew Hughes Red Hat Dmitry Markov Oracle JDK-8181014 [macosx] Activating a JDialog puts to back another dialog
1986 Andrew Hughes Red Hat Robert Mckenna Oracle JDK-8181013 Deadlock in com.sun.jndi.ldap.pool.Connections
1986 Andrew Hughes Red Hat Alexandr Scherbatiy BellSoft JDK-8181011 [macosx] Get MultiResolution image from native system
1986 Andrew Hughes Red Hat Alexandr Scherbatiy BellSoft JDK-8181010 [macosx] Checkmarks of JCheckBoxMenuItems aren't rendered in high resolution on Retina
1986 Andrew Hughes Red Hat Alexandr Scherbatiy BellSoft JDK-8181009 [macosx] AquaIcon HiDPI support
1986 Andrew Hughes Red Hat Sergey Bylokhov Amazon JDK-8181008 JFrame in full screen mode leaves empty workspace after close
1986 Andrew Hughes Red Hat Dmitry Markov Oracle JDK-8181007 [macosx] java 7 and 8 JDialogs on multiscreen jump to parent frame on focus
1986 Andrew Hughes Red Hat N/A Unknown JDK-8181005 [macosx] NullPointerException in getBufferStrategy()
1986 Andrew Hughes Red Hat Sergey Bylokhov Amazon JDK-8181004 White flashing when opening Dialogs and Menus using Nimbus with dark background
1986 Andrew Hughes Red Hat Petr Pchelko Oracle JDK-8181003 [macosx] Popups appear behind taskbar
1986 Andrew Hughes Red Hat Alexandr Scherbatiy BellSoft JDK-8181002 Custom cursor HiDPI support
1986 Andrew Hughes Red Hat N/A Unknown JDK-8181001 [macosx] Netbeans crashes in CImage.nativeCreateNSImageFromArray
1986 Andrew Hughes Red Hat N/A Unknown JDK-8181000 [macosx] setIconImages() not working correctly (distorted icon when minimized)
1986 Andrew Hughes Red Hat Alexandr Scherbatiy BellSoft JDK-8180999 [macosx] Support automatic @2x images loading on Mac OS X
1986 Andrew Hughes Red Hat Petr Pchelko Oracle JDK-8180998 [macosx] getLocationOnScreen returns 0 if parent invisible
1986 Andrew Hughes Red Hat Artem Smotrakov Independent JDK-8180997 [TEST_BUG] sun/security/ssl/SSLSocketImpl/CloseSocket.java failed with "Error while cleaning up threads after test"
1986 Andrew Hughes Red Hat Weijun Wang Oracle JDK-8180994 NTLM authentication fail if user specified a different realm
1986 Andrew Hughes Red Hat Artem Smotrakov Independent JDK-8180993 [TEST_BUG] sun/net/www/protocol/http/HttpInputStream.java fails intermittently
1986 Andrew Hughes Red Hat Roger Riggs Oracle JDK-8180991 GetVersionEx in java.base/windows/native/libjava/java_props_md.c might not get correct Windows version
1986 Andrew Hughes Red Hat Artem Smotrakov Independent JDK-8180990 [TEST_BUG] :jdk/test/sun/misc/URLClassPath/ClassnameCharTest.java test fails with NullPointerException
1986 Andrew Hughes Red Hat Semyon Sadetsky Oracle JDK-8180988 The new menu can't be shown on the menubar after clicking the "Add" button.
1986 Andrew Hughes Red Hat Sergey Bylokhov Amazon JDK-8180987 [macosx] Cursor management unification
1986 Andrew Hughes Red Hat Sergey Bylokhov Amazon JDK-8180986 [macosx] Cleanup warnings in sun.lwawt
1986 Andrew Hughes Red Hat Svetlana Steuck Oracle JDK-8180985 [macosx] pack() does ignore size of a component; doesn't on the other platforms.
1986 Andrew Hughes Red Hat Svetlana Steuck Oracle JDK-8180984 [macosx] TextArea has wrong initial size
1986 Andrew Hughes Red Hat Chris Hegarty Independent JDK-8180983 FtpURLConnection connection leak on FileNotFoundException
1986 Andrew Hughes Red Hat Semyon Sadetsky Oracle JDK-8180982 IME Composition Window is displayed at incorrect location
1986 Andrew Hughes Red Hat Semyon Sadetsky Oracle JDK-8180981 Resizing dialog which is JWindow parent makes JVM crash
1986 Andrew Hughes Red Hat Semyon Sadetsky Oracle JDK-8180980 closed/java/awt/MenuBar/MenuBarStress1/MenuBarStress1.java hangs on win 64 bit with jdk8
1986 Andrew Hughes Red Hat Andrew Brygin Azul JDK-8180978 IME Composition Window is displayed on incorrect position
1986 Andrew Hughes Red Hat N/A Unknown JDK-8180977 setFont() does not update Fonts of Menus already on screen
1986 Andrew Hughes Red Hat Alexander Potochkin Oracle JDK-8180976 Reduce number of warnings in awt classes
1986 Andrew Hughes Red Hat Ivan Gerasimov Google JDK-8180975 (smartcardio) CardTerminal.connect() throws CardException instead of CardNotPresentException
1986 Andrew Hughes Red Hat Thomas Schatzl Oracle JDK-8180974 max_heap_for_compressed_oops() declared with size_t, but defined with uintx
1986 Andrew Hughes Red Hat David Holmes Oracle JDK-8180973 [linux] Experimental support for cgroup memory limits in container (ie Docker) environments
1986 Andrew Hughes Red Hat Harold Seigel Oracle JDK-8180972 RFE: cleanup jlong typedef on __APPLE__ and _LP64 systems
1986 Andrew Hughes Red Hat Jesper Wilhelmsson Oracle JDK-8180971 Tenuring threshold should be unsigned
1986 Andrew Hughes Red Hat Vladimir Kozlov Oracle JDK-8180969 cleanup IA64 specific code in Hotspot
1986 Andrew Hughes Red Hat Thomas Schatzl Oracle JDK-8180968 G1 crashes if active_processor_count changes during startup
1986 Andrew Hughes Red Hat Kevin Walls Oracle JDK-8180967 Change type of the number of GC workers to unsigned int (2)
1986 Andrew Hughes Red Hat Dmitrij Pochepko BellSoft JDK-8180966 Unrecognized VM option 'UseCountedLoopSafepoints'
1986 Andrew Hughes Red Hat Vladimir Kozlov Oracle JDK-8180965 jvm crashes when -XX:+UseCountedLoopSafepoints is enabled
1986 Andrew Hughes Red Hat Andreas Eriksson Oracle JDK-8180964 Add new C2 flag to keep safepoints in counted loops.
1986 Andrew Hughes Red Hat Christian Tornqvist Oracle JDK-8180963 Update OS detection code to recognize Windows Server 2016
1986 Andrew Hughes Red Hat Christian Tornqvist Oracle JDK-8180962 Update use of GetVersionEx to get correct Windows version in hs_err files
1986 Andrew Hughes Red Hat Thomas Schatzl Oracle JDK-8180961 Cache initial active_processor_count
1986 Andrew Hughes Red Hat Thomas Schatzl Oracle JDK-8180960 Native OOME when allocating after changes to maximum heap supporting Coops sizing on sparcv9
1986 Andrew Hughes Red Hat Alejandro Murillo Independent JDK-8180953 Message "Error occurred during initialization of VM" on boxes with lots of RAM
1986 Andrew Hughes Red Hat Thomas Schatzl Oracle JDK-8180959 gc/arguments/TestUseCompressedOopsErgo.java does not compile
1986 Andrew Hughes Red Hat Thomas Schatzl Oracle JDK-8180958 assert: failed: heap size is too big for compressed oops
1986 Andrew Hughes Red Hat Alejandro Murillo Independent JDK-8180957 tests/gc/arguments/Test(Serial|CMS|Parallel|G1)HeapSizeFlags jtreg tests invoke wrong class
1986 Andrew Hughes Red Hat Jesper Wilhelmsson Oracle JDK-8180956 Regression tests for 8006088
1986 Andrew Hughes Red Hat Jesper Wilhelmsson Oracle JDK-8180955 Incompatible heap size flags accepted by VM
1986 Andrew Hughes Red Hat Aleksej Efimov Oracle JDK-8180950 Make XSL generated namespace prefixes local to transformation process
2064 Goetz Lindenmaier SAP Goetz Lindenmaier SAP JDK-8175087 [bsd] Fix build after "8024900: PPC64: Enable new build on AIX (jdk part)"
2064 Goetz Lindenmaier SAP Goetz Lindenmaier SAP JDK-8175163 [bsd] Fix build after "8005629: javac warnings compiling java.awt.EventDispatchThread..."
2076 Goetz Lindenmaier SAP Vladimir Kozlov Oracle JDK-8175530 PPC64 (part 215): opto: Extend ImplicitNullCheck optimization.
2077 Andrew Hughes Red Hat Bradford Wetmore Oracle JDK-8175501 javax/net/ssl/TLS/TLSClientPropertyTest.java needs to be updated for JDK-8061210
2077 Andrew Hughes Red Hat Xuelei Fan @global.tencent.com JDK-8175500 New tests for TLS property jdk.tls.client.protocols
2077 Andrew Hughes Red Hat N/A Unknown JDK-8175499 Eliminate the static dependency to sun.security.ec.ECKeyFactory
2077 Andrew Hughes Red Hat N/A Unknown JDK-8175498 Introduce the jdk.tls.client.protocols system property for JDK 7u
2077 Andrew Hughes Red Hat Xuelei Fan @global.tencent.com JDK-8175497 Enable client-side TLS 1.2 by default
2077 Andrew Hughes Red Hat Xuelei Fan @global.tencent.com JDK-8175496 Regression test DHEKeySizing.java failing intermittently
2077 Andrew Hughes Red Hat Chris Hegarty Independent JDK-8175495 Fix doclint issues in java.util.concurrent
2077 Andrew Hughes Red Hat Aleksej Efimov Oracle JDK-8175492 (tz) Support tzdata2016i
2077 Andrew Hughes Red Hat Anthony Scarpino Oracle JDK-8175486 Add MD5 to signed JAR restrictions
2077 Andrew Hughes Red Hat Xuelei Fan @global.tencent.com JDK-8175485 Chrome interop regression with JDK-8148516
2077 Andrew Hughes Red Hat Bradford Wetmore Oracle JDK-8175484 Add debug output for indicating if a chosen ciphersuite was legacy
2077 Andrew Hughes Red Hat Ivan Gerasimov Google JDK-8175479 (tz) Support tzdata2016g
2077 Andrew Hughes Red Hat Alexandr Scherbatiy BellSoft JDK-8175478 [macos 10.12] Trackpad scrolling of text on macOS 10.12 Sierra is very fast (Trackpad, Retina only)
2077 Andrew Hughes Red Hat Sean Mullan Oracle JDK-8175476 Certificates not being blocked by jdk.tls.disabledAlgorithms property
2077 Andrew Hughes Red Hat Martin Buchholz Google JDK-8175474 Atomic*FieldUpdaters should use Class.isInstance instead of direct class check
2077 Andrew Hughes Red Hat N/A Unknown JDK-8175473 AtomicIntegerFieldUpdater does not work when SecurityManager is installed
2077 Andrew Hughes Red Hat N/A Unknown JDK-8175472 Warnings in java.util.concurrent.atomic package
2077 Andrew Hughes Red Hat N/A Unknown JDK-8175471 Long narrowing conversion should describe the algorithm used and implied "risks"
2077 Andrew Hughes Red Hat Roger Riggs Oracle JDK-8175468 ReflectionFactory support for IIOP and custom serialization
2077 Andrew Hughes Red Hat N/A Unknown JDK-8175465 JNDI name operations should be locale independent
2077 Andrew Hughes Red Hat N/A Unknown JDK-8175463 JNDI libraries do not build with javac -Xlint:all -Werror
2077 Andrew Hughes Red Hat Weijun Wang Oracle JDK-8175462 jarsigner -verbose -verify should print the algorithms used to sign the jar
2077 Andrew Hughes Red Hat Vincent Ryan Oracle JDK-8175458 Verifying ECDSA signatures permits trailing bytes
2077 Andrew Hughes Red Hat Roger Riggs Oracle JDK-8175453 Improve extensibility of ObjectInputFilter information passed to the filter
2077 Andrew Hughes Red Hat Roger Riggs Oracle JDK-8175452 Implement Serialization Filtering
2077 Andrew Hughes Red Hat Xuelei Fan @global.tencent.com JDK-8175450 Increase the minimum strength of EC keys
2077 Andrew Hughes Red Hat Fredrik Öhrström Independent JDK-8175449 Multi-core compilation of the jdk is prevented by auxiliary classes hidden inside java source files.
2077 Andrew Hughes Red Hat N/A Unknown JDK-8175448 Warning cleanup for IMF classes
2077 Andrew Hughes Red Hat Anthony Scarpino Oracle JDK-8175447 Add mechanism to allow non default root CAs to be not subject to algorithm restrictions
2077 Andrew Hughes Red Hat N/A Unknown JDK-8175444 synchronizing handshaking hash.
2077 Andrew Hughes Red Hat Sean Mullan Oracle JDK-8175442 Add security property to configure XML Signature secure validation mode
2077 Andrew Hughes Red Hat Sean Coffey Oracle JDK-8175441 Secure validation of XML based digital signature always enabled when checking wrapping attacks
2077 Andrew Hughes Red Hat Sean Mullan Oracle JDK-8175440 XML Signature performance issue caused by unbuffered signature data
2077 Andrew Hughes Red Hat Sean Mullan Oracle JDK-8175439 Signing XML with DSA throws Exception when key is larger than 1024 bits
2077 Andrew Hughes Red Hat Sean Mullan Oracle JDK-8175438 XMLSignature throws StringIndexOutOfBoundsException if ID attribute value is empty String
2077 Andrew Hughes Red Hat Sean Mullan Oracle JDK-8175437 JCK test api/javax_xml/crypto/dsig/TransformService/index_ParamMethods fails
2077 Andrew Hughes Red Hat Sean Mullan Oracle JDK-8175436 XML DSig API allows wrong tag names and extra elements in SignedInfo
2077 Andrew Hughes Red Hat Yuka Kamiya Oracle JDK-8175435 Clean up doclint warnings and errors in java.text package
2077 Andrew Hughes Red Hat Naoto Sato Oracle JDK-8175434 Clarify the default locale used in each locale sensitive operation
2077 Andrew Hughes Red Hat Mikhail Cherkasov Oracle JDK-8175433 broken links in documentation at http://docs.oracle.com/javase/6/docs/api/index.
2077 Andrew Hughes Red Hat N/A Unknown JDK-8175432 Broken link in "javax.swing.SwingWorker"
2077 Andrew Hughes Red Hat Sergey Malenkov Oracle JDK-8175431 List of spelling errors in API doc
2077 Andrew Hughes Red Hat Yuri Nesterenko Azul JDK-8175430 [javadoc] fix some javadoc errors in javax/swing
2077 Andrew Hughes Red Hat Yuri Nesterenko Azul JDK-8175429 [javadoc] some errors in javax/swing
2077 Andrew Hughes Red Hat Jason Uh Oracle JDK-8175428 Cleanup of the javadoc tag in java.security.spec
2077 Andrew Hughes Red Hat Jason Uh Oracle JDK-8175427 javadoc cleanup in java.net
2077 Andrew Hughes Red Hat Kurchi Subhra Hazra Independent JDK-8175426 Improve javadocs for Socket class by adding references to SocketOptions
2077 Andrew Hughes Red Hat Sundararajan Athijegannathan Oracle JDK-8175425 (typo in the spec) javax.script.ScriptEngineFactory.getLanguageName
2077 Andrew Hughes Red Hat Sundararajan Athijegannathan Oracle JDK-8175424 JavaDoc for ScriptEngineFactory.getProgram() contains an error
2077 Andrew Hughes Red Hat Jason Uh Oracle JDK-8175423 Cleanup of the javadoc tag in java.security.cert
2077 Andrew Hughes Red Hat Alan Bateman Oracle JDK-8175422 More javadoc warnings
2077 Andrew Hughes Red Hat N/A Unknown JDK-8175421 Null-check-in-finally pattern in java/security documentation
2077 Andrew Hughes Red Hat Christine Lu Oracle JDK-8175420 more fix of javadoc errors and warnings reported by doclint, see the description
2077 Andrew Hughes Red Hat Christine Lu Oracle JDK-8175419 Fix javadoc comments errors and warning reported by doclint report
2077 Andrew Hughes Red Hat Philip Race Oracle JDK-8175418 Fix doclint warnings in javax.print
2077 Andrew Hughes Red Hat Yuri Nesterenko Azul JDK-8175417 [javadoc] some errors in java/awt classes.
2077 Andrew Hughes Red Hat Sergey Bylokhov Amazon JDK-8175416 (doc) java/awt/Window.java has several typos in javadoc
2077 Andrew Hughes Red Hat Jason Uh Oracle JDK-8175415 Fix doclint issues in javax.crypto and javax.security subpackages
2077 Andrew Hughes Red Hat Jason Uh Oracle JDK-8175414 javadoc cleanup in javax.security
2077 Andrew Hughes Red Hat Joe Darcy Oracle JDK-8175413 Fix doclint issues in java.beans
2077 Andrew Hughes Red Hat Sean Mullan Oracle JDK-8175412 Update XML Signature implementation to Apache Santuario 1.5.4
2077 Andrew Hughes Red Hat N/A Unknown JDK-8175411 Security libraries don't build with javac -Werror
2077 Andrew Hughes Red Hat Ivan Gerasimov Google JDK-8175409 Modify sun/security/smartcardio manual regression tests so that they do not just fail if no cardreader found
2077 Andrew Hughes Red Hat Ivan Gerasimov Google JDK-8175408 (smartcardio) Invert reset argument in tests in sun/security/smartcardio
2077 Andrew Hughes Red Hat Petr Pchelko Oracle JDK-8175407 [macosx] Remove all references to GC from native OBJ-C code
2077 Andrew Hughes Red Hat Anton Tarasov JetBrains JDK-8175406 [macosx] sun.lwawt.macosx.CAccessible leaks
2077 Andrew Hughes Red Hat Petr Pchelko Oracle JDK-8175405 [macosx] SwingNode crashes on exit
2077 Andrew Hughes Red Hat Andrew Hughes Red Hat JDK-8173854 [TEST] Update DHEKeySizing test case following 8076328 & 8081760
2077 Andrew Hughes Red Hat Andrew Hughes Red Hat JDK-8173849 [TEST] Fix use of java.util.Base64 in test cases
2077 Andrew Hughes Red Hat Andrew Hughes Red Hat JDK-8173622 Backport of 7180907 is incomplete
2077 Andrew Hughes Red Hat Robert Mckenna Oracle JDK-8068928 Update the protocol for references of docs.oracle.com to HTTPS.
2077 Andrew Hughes Red Hat Harold Seigel Oracle JDK-8175403 JVM stuck in infinite loop during verification
2077 Andrew Hughes Red Hat Jonathan Gibbons Oracle JDK-8175397 remove dead code from HtmlWriter and subtypes
2077 Andrew Hughes Red Hat Jonathan Gibbons Oracle JDK-8175396 javadoc should used a standard "generated by javadoc" string
2077 Andrew Hughes Red Hat Alexander Zuev Oracle JDK-8175395 javadoc shows stacktrace after print error resulting from disk full
2077 Andrew Hughes Red Hat Jonathan Gibbons Oracle JDK-8175394 javadoc internal DocletAbortException should set cause when appropriate
2077 Andrew Hughes Red Hat Jonathan Gibbons Oracle JDK-8175393 javadoc should write directly to Writer instead of composing strings
2077 Andrew Hughes Red Hat Jonathan Gibbons Oracle JDK-8175392 javadoc stopped copying doc-files
2119 Andrew Hughes Red Hat Michael Fang Oracle JDK-8172651 jdk8u40 l10n resource file translation update 1
2119 Andrew Hughes Red Hat Sergey Malenkov Oracle JDK-8172650 clean up source files containing carriage return characters
2119 Andrew Hughes Red Hat Alexey Ivanov Oracle JDK-8172649 No mnemonics on Open and Save buttons in JFileChooser
2119 Andrew Hughes Red Hat Alexandr Scherbatiy BellSoft JDK-8172647 NLS: mnemonics missing in SwingSet2/JInternalFrame demo
2119 Andrew Hughes Red Hat Alexandr Scherbatiy BellSoft JDK-8172646 Regression test fails: test/closed/javax/swing/JMenuItem/4654927/bug4654927.java
2119 Andrew Hughes Red Hat Chris Hegarty Independent JDK-8172641 Replace deprecated PlatformLogger isLoggable(int) with isLoggable(Level)
2119 Andrew Hughes Red Hat Anthony Petrov Oracle JDK-8172640 Missing isLoggable() checks in logging code
2119 Andrew Hughes Red Hat Alexandr Scherbatiy BellSoft JDK-8172639 Implement dead key detection for KeyEvent on Linux
2119 Andrew Hughes Red Hat Sergey Bylokhov Amazon JDK-8172638 javac warnings compiling java.awt.EventDispatchThread and sun.awt.X11.XIconWindow
2119 Andrew Hughes Red Hat N/A Unknown JDK-8172637 ContentHandler.getContent API changed in error
2119 Andrew Hughes Red Hat N/A Unknown JDK-8172636 Networking Libraries don't build with javac -Werror
2119 Andrew Hughes Red Hat Volker Simonis Amazon JDK-8172634 Upgrade to LittleCMS 2.6 breaks AIX build
2119 Andrew Hughes Red Hat Philip Race Oracle JDK-8172633 Upgrade JDK to use LittleCMS 2.6
2119 Andrew Hughes Red Hat Robert Mckenna Oracle JDK-8172630 (tz) Support tzdata2016f
2119 Andrew Hughes Red Hat N/A Unknown JDK-8172619 ShortRSAKey1024.sh tests should do cleanup before start test
2119 Andrew Hughes Red Hat Chris Hegarty Independent JDK-8172617 corelibs test scripts should pass TESTVMOPTS
2119 Andrew Hughes Red Hat Weijun Wang Oracle JDK-8172616 PKCS basic tests
2119 Andrew Hughes Red Hat Prasanta Sadhukhan Oracle JDK-8172614 IllegalArgumentException thrown by JCK test api/java_awt/Component/FlipBufferStrategy/indexTGF_General in opengl pipeline
2119 Andrew Hughes Red Hat Prasanta Sadhukhan Oracle JDK-8172613 IllegalArgumentException thrown by api/java_awt/Component/FlipBufferStrategy/indexTGF_General
2119 Andrew Hughes Red Hat Weijun Wang Oracle JDK-8172612 OutputAnalyzer's shouldXXX() calls return this
2119 Andrew Hughes Red Hat Alexander Zvegintsev Oracle JDK-8172611 Creating a VolatileImage with size 0,0 results in no longer working g2d.drawString
2119 Andrew Hughes Red Hat Weijun Wang Oracle JDK-8172609 Additional tests for jarsigner's warnings
2119 Andrew Hughes Red Hat Weijun Wang Oracle JDK-8172608 [TESTBUG] javax/security/auth/Subject/doAs/NestedActions.java fails if extra VM options are given
2119 Andrew Hughes Red Hat Weijun Wang Oracle JDK-8172607 Privilege tests with JAAS Subject.doAs
2119 Andrew Hughes Red Hat Jaroslav Bachorík DataDog JDK-8172606 [TEST_BUG] com/sun/management/OperatingSystemMXBean/TestTotalSwap.java Compilation failed after JDK-8077387
2119 Andrew Hughes Red Hat Mikhail Cherkasov Oracle JDK-8172604 JEditorPane.createEditorKitForContentType throws NPE after 6882559
2119 Andrew Hughes Red Hat Mikhail Cherkasov Oracle JDK-8172603 new JEditorPane("text/plain","") fails for null context class loader
2119 Andrew Hughes Red Hat Mario Torre Red Hat JDK-8172602 [TESTBUG] test for 8067364 depends on hardwired text advance
2119 Andrew Hughes Red Hat Mario Torre Red Hat JDK-8172601 Printing to Postscript doesn't support dieresis
2119 Andrew Hughes Red Hat Philip Race Oracle JDK-8172600 Fatal: Bug in native code: jfieldID class must match object
2119 Andrew Hughes Red Hat Zhengyu Gu Independent JDK-8172592 revise the fix for 8007037
2119 Andrew Hughes Red Hat Zhengyu Gu Independent JDK-8172591 cleanup warnings indicated by the -Wunused-value compiler option on linux
2119 Andrew Hughes Red Hat John Coomes Twitter JDK-8172589 Make test-in-build an option (Queens)
2119 Andrew Hughes Red Hat Michael Fang Oracle JDK-8172585 jdk8u60 l10n resource file translation update 2
2119 Andrew Hughes Red Hat Bhavesh Patel Oracle JDK-8172583 method grouping tabs are not selectable
2198 Andrew Hughes Red Hat Zoltan Majo Oracle JDK-8168605 PPC64: unaligned Unsafe.getInt can lead to the generation of illegal instructions
2198 Andrew Hughes Red Hat Nils Eliasson Oracle JDK-8168603 PPC64LE: argument passing problem when passing 15 floats in native call
2198 Andrew Hughes Red Hat Goetz Lindenmaier SAP JDK-8168602 PPC64LE: MacroAssembler::bxx64_patchable kills register R12
2198 Andrew Hughes Red Hat Vladimir Kozlov Oracle JDK-8168601 AIX: Fix os::naked_short_sleep() in os_aix.cpp after 8028280
2198 Andrew Hughes Red Hat Volker Simonis Amazon JDK-8168600 PPC64: Fix wrong rotate instructions in the .ad file
2198 Andrew Hughes Red Hat Goetz Lindenmaier SAP JDK-8168599 ppc: pass thread to throw_AbstractMethodError
2198 Andrew Hughes Red Hat Volker Simonis Amazon JDK-8168598 AIX port of "8050807: Better performing performance data handling"
2198 Andrew Hughes Red Hat Vladimir Kozlov Oracle JDK-8168597 PPC64: implement template interpreter for ppc64le
2198 Andrew Hughes Red Hat Vladimir Kozlov Oracle JDK-8168596 Concurrency problem in PcDesc cache
2198 Andrew Hughes Red Hat Vladimir Kozlov Oracle JDK-8168595 Some bugfixes for the ppc64 port.
2198 Andrew Hughes Red Hat Vladimir Kozlov Oracle JDK-8168594 PPC64/AIX: Several smaller fixes
2198 Andrew Hughes Red Hat Vladimir Kozlov Oracle JDK-8168593 PPC64: implement the template interpreter
2198 Andrew Hughes Red Hat Vladimir Kozlov Oracle JDK-8168592 Introduce accessor for tmp_oop in frame.
2198 Andrew Hughes Red Hat Vladimir Kozlov Oracle JDK-8168591 PPC64: Support for elf v2 abi.
2198 Andrew Hughes Red Hat Vladimir Kozlov Oracle JDK-8168590 PPC64: gcc 4.8 warning in output_c.cpp
2198 Andrew Hughes Red Hat N/A Unknown JDK-8168589 PPC64 (part 112): C argument in register AND stack slot.
2198 Andrew Hughes Red Hat N/A Unknown JDK-8168588 PPC64 (part 201): cppInterpreter: implement bytecode profiling
2198 Andrew Hughes Red Hat Vladimir Kozlov Oracle JDK-8168587 PPC64 (part 213): cppInterpreter: memory ordering for object initialization
2198 Andrew Hughes Red Hat N/A Unknown JDK-8168582 PPC64 (part 105-2): fix build in cppInterpreter after 8019519
2198 Andrew Hughes Red Hat N/A Unknown JDK-8168586 PPC64 (part 202): cppInterpreter: support for OSR.
2198 Andrew Hughes Red Hat N/A Unknown JDK-8168585 PPC64 (part 7): cppInterpreter: implement support for biased locking
2198 Andrew Hughes Red Hat Vladimir Kozlov Oracle JDK-8168584 PPC64 (part 107): Extend ELF-decoder to support PPC64 function descriptor tables
2198 Andrew Hughes Red Hat N/A Unknown JDK-8168583 PPC64 (part 11): Fix IA64 preprocessor conditionals on AIX.
2198 Andrew Hughes Red Hat N/A Unknown JDK-8168581 PPC64 (part 105): cppInterpreter: implement support for early return
2198 Andrew Hughes Red Hat Vladimir Kozlov Oracle JDK-8168580 PPC64 (part 104) : cppInterpreter: implement support for compressed Oops
2198 Andrew Hughes Red Hat Vladimir Kozlov Oracle JDK-8168579 PPC64 (part 102): cppInterpreter: implement G1 support
2198 Andrew Hughes Red Hat N/A Unknown JDK-8168578 PPC64 (part 4): add relocation for trampoline stubs
2198 Andrew Hughes Red Hat N/A Unknown JDK-8168577 PPC64 (part 6): stack handling improvements
2198 Andrew Hughes Red Hat N/A Unknown JDK-8168576 PPC64 (part 3): basic changes for PPC64
2198 Andrew Hughes Red Hat N/A Unknown JDK-8168575 PPC64 (part 2): Clean up PPC defines.
2198 Andrew Hughes Red Hat Andrew Hughes Red Hat JDK-8167198 AIX: Changes to make AIX compile after latest upstream changes
2198 Andrew Hughes Red Hat Andrew Hughes Red Hat JDK-8167144 AIX: 8022507: SIGSEGV at ParMarkBitMap::verify_clear()
2198 Andrew Hughes Red Hat Andrew Hughes Red Hat JDK-8165807 PPC64: Backport PPC64 port to OpenJDK 7
2198 Andrew Hughes Red Hat Vladimir Kozlov Oracle JDK-8168574 PPC64: Basic changes and files to build the class library on AIX
2198 Andrew Hughes Red Hat Vladimir Kozlov Oracle JDK-8168573 PPC64: Support for little endian execution model
2198 Andrew Hughes Red Hat Andrew Hughes Red Hat JDK-8167335 Fix build on Linux with 64kb default page size
2198 Andrew Hughes Red Hat N/A Unknown JDK-8168572 PPC64: Enable new build on AIX (jdk part)
2280 Andrew Hughes Red Hat Robert Mckenna Oracle JDK-8163074 Add support for 3 digit hotspot minor version numbers
2280 Andrew Hughes Red Hat Robert Mckenna Oracle JDK-8163073 add support for 3 digit update release numbers
2280 Andrew Hughes Red Hat N/A Unknown JDK-8163072 test/sun/security/provider/certpath/X509CertPath/IllegalCertiticates.java failing
2280 Andrew Hughes Red Hat N/A Unknown JDK-8163071 RMIConnector logs attribute names incorrectly
2280 Andrew Hughes Red Hat Weijun Wang Oracle JDK-8163070 sun.security.mscapi.KeyStore might load incomplete data
2280 Andrew Hughes Red Hat Weijun Wang Oracle JDK-8163069 sun/security/mscapi/ShortRSAKey1024.sh fails intermittently
2280 Andrew Hughes Red Hat Xuelei Fan @global.tencent.com JDK-8163067 [TEST BUG] Test SSLSession/SessionCacheSizeTests socket accept timed out
2280 Andrew Hughes Red Hat Sean Coffey Oracle JDK-8163063 (tz) Support tzdata2016d
2280 Andrew Hughes Red Hat Xuelei Fan @global.tencent.com JDK-8163060 Test SessionTimeOutTests fails intermittently
2280 Andrew Hughes Red Hat Alan Bateman Oracle JDK-8163058 (se) Selector.open fails if invoked with thread interrupt status set [win]
2280 Andrew Hughes Red Hat Alan Bateman Oracle JDK-8163057 Potential deadlock in of sun.nio.ch.Util/IOUtil
2280 Andrew Hughes Red Hat Xuelei Fan @global.tencent.com JDK-8163056 Test SessionTimeOutTests can be timeout
2280 Andrew Hughes Red Hat Xuelei Fan @global.tencent.com JDK-8163055 [TEST_BUG] Intermittent test failures in sun/security/ssl/javax/net/ssl/NewAPIs
2280 Andrew Hughes Red Hat Bradford Wetmore Oracle JDK-8163054 Update CookieHttpsClientTest to use the newer framework.
2280 Andrew Hughes Red Hat N/A Unknown JDK-8163053 Add SSLSocket client/SSLEngine server to templates directory
2280 Andrew Hughes Red Hat N/A Unknown JDK-8163052 PKCS7.java is needlessly creating SHA1PRNG SecureRandom instances when timestamping is not done
2280 Andrew Hughes Red Hat Semyon Sadetsky Oracle JDK-8163051 javax.swing.TimerQueue: timer fires late when another timer starts
2280 Andrew Hughes Red Hat Weijun Wang Oracle JDK-8163050 Add support to jarsigner for specifying timestamp hash algorithm
2280 Andrew Hughes Red Hat Weijun Wang Oracle JDK-8163049 JARSigner including TimeStamp PolicyID (TSAPolicyID) as defined in RFC3161
2280 Andrew Hughes Red Hat N/A Unknown JDK-8163048 Restructure timestamp code so that jars and modules can more easily share the same code
2280 Andrew Hughes Red Hat Alan Bateman Oracle JDK-8163047 String resources for Key Tool and Policy Tool should be in their respective packages
2280 Andrew Hughes Red Hat David Katleman Oracle JDK-8163045 autotest.sh fails on ubuntu because libsoftokn.so not found
2280 Andrew Hughes Red Hat N/A Unknown JDK-8163044 PKCS11 tests should use the NSS libraries available in the OS
2280 Andrew Hughes Red Hat N/A Unknown JDK-8163043 Make sure keytool prints both unknown and unparseable extensions
2280 Andrew Hughes Red Hat N/A Unknown JDK-8163042 Move few sun.security.{util, x509, pkcs} classes used by keytool/jarsigner to another package
2280 Andrew Hughes Red Hat N/A Unknown JDK-8163041 Security libraries don't build with javac -Xlint:all,-deprecation -Werror
2280 Andrew Hughes Red Hat N/A Unknown JDK-8163040 Parts of the JDK erroneously rely on generic array initializers with diamond
2280 Andrew Hughes Red Hat N/A Unknown JDK-8163039 Eliminate pack200 build warnings
2280 Andrew Hughes Red Hat Jason Uh Oracle JDK-8163038 Fix lint warnings in sun.security.ec
2280 Andrew Hughes Red Hat Xuelei Fan @global.tencent.com JDK-8163037 [TEST BUG] test SessionCacheSizeTests.java timeout
2280 Andrew Hughes Red Hat Andrew Hughes Red Hat JDK-8162344 The API changes made by CR 7064075 need to be reverted
2280 Andrew Hughes Red Hat Andrew Hughes Red Hat JDK-8163032 Build needs additional flags to compile with GCC 6
2300 Goetz Lindenmaier SAP N/A Unknown JDK-8161370 Fix jdk build with gcc 4.1.2: -fno-strict-overflow not known.
2379 Andrew Hughes Red Hat Aleksej Efimov Oracle JDK-8155152 (tz) Support tzdata2016a
2379 Andrew Hughes Red Hat Ivan Gerasimov Google JDK-8155151 [TEST_BUG] javax/security/auth/SubjectDomainCombiner/Optimize.java should use 4-args ProtectionDomain constructor
2379 Andrew Hughes Red Hat N/A Unknown JDK-8155148 [TEST_BUG] ClientJSSEServerJSSE.java failing again
2379 Andrew Hughes Red Hat Andrew Hughes Red Hat JDK-8155145 [Parfait] JNI exception pending in fontpath.c:1300
2379 Andrew Hughes Red Hat Dmitriy Samersoff Independent JDK-8155139 [TEST_BUG] jdb has succeded to read an unreadable file
2379 Andrew Hughes Red Hat Yekaterina Kantserova Oracle JDK-8155138 [TEST_BUG]: com/sun/jdi/JdbReadTwiceTest.sh fails when run under root
2379 Andrew Hughes Red Hat N/A Unknown JDK-8155136 (launcher) convert the launcher regression tests to java
2379 Andrew Hughes Red Hat Staffan Larsen Oracle JDK-8155135 test/sun/tools/jinfo/Basic.sh fails on when runSA is set to true
2379 Andrew Hughes Red Hat Volker Simonis Amazon JDK-8155134 PPC64: Updated the JDK regression tests to run on AIX
2379 Andrew Hughes Red Hat Staffan Larsen Oracle JDK-8155133 com/sun/jdi/JdbMethodExitTest.sh fails when a background thread is generating events.
2379 Andrew Hughes Red Hat Staffan Larsen Oracle JDK-8155132 [TEST_BUG] Tab characters in test/com/sun/jdi files
2379 Andrew Hughes Red Hat Coleen Phillimore Oracle JDK-8155130 Zero: Better byte behaviour
2379 Andrew Hughes Red Hat Igor Veresov Oracle JDK-8155123 [TEST_BUG] compiler/loopopts/CountedLoopProblem.java got OOME
2379 Andrew Hughes Red Hat Igor Veresov Oracle JDK-8155122 Nondeterministic wrong answer on arithmetic
2379 Andrew Hughes Red Hat Konstantin Shefov Azul JDK-8155121 [TEST_BUG] Test SoftReference and OOM behavior
2390 Andrew Hughes Red Hat David Holmes Oracle JDK-8154358 SystemTap does not work when JDK is compiled with GCC 5
2391 Andrew Hughes Red Hat Andrew Haley Red Hat JDK-8154288 [GCC5] java.lang.StackOverflowError on Zero JVM initialization on non x86 platforms
2391 Andrew Hughes Red Hat Xuelei Fan @global.tencent.com JDK-8154217 make ephemeral DH key match the length of the certificate key
2391 Andrew Hughes Red Hat Valerie Peng Oracle JDK-8154211 SHA1WithDSA with key > 1024 bits not working
2392 Andrew Hughes Red Hat N/A Unknown JDK-8154205 Need to support NSA Suite B Cryptography algorithms
2392 Andrew Hughes Red Hat N/A Unknown JDK-8154195 Implement SHA-224
2392 Andrew Hughes Red Hat N/A Unknown JDK-8154175 P11Digest should support cloning
2394 Andrew Hughes Red Hat Daniel Daugherty Oracle JDK-8153981 [BACKOUT] JDWP: Memory Leak: GlobalRefs never deleted when processing invokeMethod command
2399 Andrew Hughes Red Hat Serguei Spitsyn Oracle JDK-8153561 JDWP: Memory Leak: GlobalRefs never deleted when processing invokeMethod command
2442 Andrew Hughes Red Hat Jaroslav Bachorík DataDog JDK-8150478 JMXInterfaceBindingTest is failing intermittently for IPv6 addresses
2442 Andrew Hughes Red Hat Jaroslav Bachorík DataDog JDK-8150477 JMXInterfaceBindingTest is failing intermittently
2442 Andrew Hughes Red Hat Jaroslav Bachorík DataDog JDK-8150476 Allow specifying an address to bind JMX remote connector
2454 Omair Majid Red Hat Omair Majid Red Hat JDK-8149703 setWMClass fails to null-terminate WM_CLASS string
2467 Andrew Hughes Red Hat N/A Unknown JDK-8148597 PKIX CertPathBuilder in reverse mode doesn't work if more than one trust anchor is specified
2467 Andrew Hughes Red Hat Aleksej Efimov Oracle JDK-8148591 (tz) Support tzdata2015g
2467 Andrew Hughes Red Hat Ivan Gerasimov Google JDK-8148586 Let OracleUcrypto accept RSAPrivateKey
2467 Andrew Hughes Red Hat Roger Riggs Oracle JDK-8148582 Test java/nio/channels/ServerSocketChannel/AdaptServerSocket.java failed with SocketTimeoutException
2467 Andrew Hughes Red Hat Andrew Hughes Red Hat JDK-8147466 Add -fno-strict-overflow to IndicRearrangementProcessor{,2}.cpp
2467 Andrew Hughes Red Hat N/A Unknown JDK-8148580 Increment minor version of HSx for 7u95 and initialize the build number
2467 Andrew Hughes Red Hat Daniel Daugherty Oracle JDK-8148579 Port fix of JDK-8075773 to AIX and possibly MacOSX
2467 Andrew Hughes Red Hat Kevin Walls Oracle JDK-8148578 jps running as root fails after the fix of JDK-8050807
2554 Andrew Hughes Red Hat Jaroslav Bachorík DataDog JDK-8141329 Test fails with java.security.AccessControlException: access denied ("java.security.SecurityPermission" "getDomainCombiner")
2554 Andrew Hughes Red Hat Aleksej Efimov Oracle JDK-8141328 (tz) Support tzdata2015f
2554 Andrew Hughes Red Hat Aleksej Efimov Oracle JDK-8141327 (tz) Support tzdata2015e
2554 Andrew Hughes Red Hat Weijun Wang Oracle JDK-8141311 JDK KRB5 module throws OutOfMemoryError when CCache is corrupt
2554 Andrew Hughes Red Hat N/A Unknown JDK-8141310 should a principalname object always have a realm?
2554 Andrew Hughes Red Hat Jaroslav Bachorík DataDog JDK-8141309 JavaSecurityAccess.doIntersectionPrivilege() drops the information about the domain combiner of the stack ACC
2554 Andrew Hughes Red Hat Sean Mullan Oracle JDK-8141308 Add isAuthorized check to limited doPrivileged methods
2554 Andrew Hughes Red Hat Mandy Chung Oracle JDK-8141307 add doPrivileged methods with limited privilege scope
2554 Andrew Hughes Red Hat Chris Hegarty Independent JDK-8141306 [TEST_BUG]: java/rmi/transport/pinClientSocketFactory/PinClientSocketFactory.java fails intermittently
2554 Andrew Hughes Red Hat Ivan Gerasimov Google JDK-8141301 [TEST_BUG]: java/util/regex/RegExTest.java fails intermittently
2554 Andrew Hughes Red Hat N/A Unknown JDK-8141300 Increment minor version of HSx for 7u91 and initialize the build number
2622 Andrew Hughes Red Hat Andrew Hughes Red Hat JDK-8134610 Mac OS X build fails after July 2015 CPU
2628 Andrew Hughes Red Hat Andrew Hughes Red Hat JDK-8134248 Fix recently backported tests to work with OpenJDK 7u
2628 Andrew Hughes Red Hat Staffan Larsen Oracle JDK-8134227 [TEST_BUG] two lib/testlibrary tests are failing with "Error. failed to clean up files after test" with jtreg 4.1 b12
2628 Andrew Hughes Red Hat Weijun Wang Oracle JDK-8134222 SPNEGO auth fails if client proposes MS krb5 OID
2628 Andrew Hughes Red Hat Weijun Wang Oracle JDK-8134221 GSSContext.acceptSecContext fails when a supported mech is initiator preferred
2628 Andrew Hughes Red Hat Vincent Ryan Oracle JDK-8134220 [TEST_BUG] sun/security/pkcs11/sslecc/ClientJSSEServerJSSE.java fails with BindException
2628 Andrew Hughes Red Hat Aleksej Efimov Oracle JDK-8134219 (tz) Support tzdata2015d
2628 Andrew Hughes Red Hat Aleksej Efimov Oracle JDK-8134210 (tz) Support tzdata2015b
2628 Andrew Hughes Red Hat Aleksej Efimov Oracle JDK-8134198 schema1.xsd has wrong content. Sequence of the enum values has been changed
2628 Andrew Hughes Red Hat Aleksej Efimov Oracle JDK-8134197 JDK 8 schemagen tool does not generate xsd files for enum types
2628 Andrew Hughes Red Hat Anton Nashatyrev Oracle JDK-8134192 [macosx] Clipboard does not work with 3rd parties Clipboard Managers
2628 Andrew Hughes Red Hat Andrew Brygin Azul JDK-8134191 Dvorak keyboard mapping not honored when ctrl key pressed
2628 Andrew Hughes Red Hat Petr Pchelko Oracle JDK-8134189 [macosx] Cleanup "may not respond to selector" warnings in native code
2628 Andrew Hughes Red Hat Leonid Romanov Oracle JDK-8134188 [macosx] Key Bindings break with awt GraphicsEnvironment setFullScreenWindow
2628 Andrew Hughes Red Hat Alexandr Scherbatiy BellSoft JDK-8134187 [macosx] Frame size reverts meaning of maximized attribute if frame size close to display
2628 Andrew Hughes Red Hat Petr Pchelko Oracle JDK-8134186 [macosx] JVM crashes in CWrapper$NSWindow.screen(long)
2628 Andrew Hughes Red Hat Petr Pchelko Oracle JDK-8134185 [macosx] Flavor change notification not coming
2628 Andrew Hughes Red Hat Shanliang Jiang Oracle JDK-8134183 [TEST_BUG] javax/management/monitor/CounterMonitorTest.java hangs
2628 Andrew Hughes Red Hat Shanliang Jiang Oracle JDK-8134182 [TEST_BUG] javax/management/monitor/CounterMonitorTest.java hangs
2628 Andrew Hughes Red Hat Anthony Scarpino Oracle JDK-8134178 CipherInputStream throws BadPaddingException if stream is not fully read
2628 Andrew Hughes Red Hat Andrew Hughes Red Hat JDK-8133993 [TEST_BUG] Make CipherInputStreamExceptions compile on OpenJDK 7
2628 Andrew Hughes Red Hat Andrew Hughes Red Hat JDK-8133991 Fix mistake in 8075374 backport
2628 Andrew Hughes Red Hat Andrew Hughes Red Hat JDK-8133990 Revert introduction of lambda expression in sun.lwawt.macosx.LWCToolkit
2628 Andrew Hughes Red Hat N/A Unknown JDK-8134175 Increment the build value to b03 for hs25.51 in 8u51-b15
2628 Andrew Hughes Red Hat N/A Unknown JDK-8134174 Increment the build value to b02 for hs25.51 in 8u51-b10
2628 Andrew Hughes Red Hat N/A Unknown JDK-8134171 Increment minor version of HSx for 8u51 and initialize the build number
2628 Andrew Hughes Red Hat Mikael Gerdin Oracle JDK-8134170 Linker error when compiling G1SATBCardTableModRefBS after include order changes
2628 Andrew Hughes Red Hat Vladimir Kozlov Oracle JDK-8134169 JVM fastdebug build compiled with GCC 5 asserts with "widen increases"
2628 Andrew Hughes Red Hat David Holmes Oracle JDK-8134168 Enable hotspot builds on 4.x Linux kernels
2628 Andrew Hughes Red Hat Andrew Hughes Red Hat JDK-8133970 Only apply PaX-marking when needed by a running PaX kernel
2628 Andrew Hughes Red Hat Aleksej Efimov Oracle JDK-8134166 JCK test api/xsl/conf/string/string17 starts failing after JDK-8074297
2628 Andrew Hughes Red Hat Aleksej Efimov Oracle JDK-8134165 substring in XSLT returns wrong character if string contains supplementary chars
2628 Andrew Hughes Red Hat Aleksej Efimov Oracle JDK-8134164 Bad error message on parsing illegal character in XML attribute
2628 Andrew Hughes Red Hat N/A Unknown JDK-8134162 Update jcheck for 6-open
2628 Andrew Hughes Red Hat Andrew Hughes Red Hat JDK-8133967 Fix build where PAX_COMMAND is not specified
2628 Andrew Hughes Red Hat Andrew Hughes Red Hat JDK-8133966 Allow OpenJDK to build on PaX-enabled kernels

No changesets log

JDK-8197801 Zero debug build fails on "assert(labs(istate->_stack_base - istate->_stack_limit) == (istate->_method->max_stack() + extra_stack_entries + 1)) failed: bad stack limit"

Committer push log

Andrew Hughes, Red Hat

Bug Summary
JDK-8240014 "\\<>" in attribute value part of X500Principal constructor parameter makes strange effect
JDK-8242877 (bf) Heap buffer state changes could provoke unexpected exceptions
JDK-8240010 (ch) More channels cleanup
JDK-8250720 (ch) test java/nio/channels/AsyncCloseAndInterrupt.java failing due to "Connection succeeded"
JDK-8194022 (coll) IdentityHashMap is resized before exceeding the expected maximum size
JDK-8175416 (doc) java/awt/Window.java has several typos in javadoc
JDK-8232480 (fs) Build issue with src/solaris/classes/sun/nio/fs/SolarisUserDefinedFileAttributeView.java
JDK-8240056 (fs) Files.write can leak file descriptor in the exception case
JDK-8240058 (fs) FileStore::isReadOnly is always true on macOS Catalina
JDK-8232479 (fs) FileSystemProvider fails to initializes if run with file.encoding set to Cp037
JDK-8155136 (launcher) convert the launcher regression tests to java
JDK-8240008 (sc) Replace use of temporary selectors in socket adapters with poll
JDK-8163058 (se) Selector.open fails if invoked with thread interrupt status set [win]
JDK-8180975 (smartcardio) CardTerminal.connect() throws CardException instead of CardNotPresentException
JDK-8175408 (smartcardio) Invert reset argument in tests in sun/security/smartcardio
JDK-8175425 (typo in the spec) javax.script.ScriptEngineFactory.getLanguageName
JDK-8134210 (tz) Support tzdata2015b
JDK-8134219 (tz) Support tzdata2015d
JDK-8141327 (tz) Support tzdata2015e
JDK-8141328 (tz) Support tzdata2015f
JDK-8148591 (tz) Support tzdata2015g
JDK-8155152 (tz) Support tzdata2016a
JDK-8163063 (tz) Support tzdata2016d
JDK-8172630 (tz) Support tzdata2016f
JDK-8175479 (tz) Support tzdata2016g
JDK-8175492 (tz) Support tzdata2016i
JDK-8181016 (tz) Support tzdata2016j
JDK-8181030 (tz) Support tzdata2017a
JDK-8187213 (tz) Support tzdata2017b
JDK-8200050 (tz) Support tzdata2017c
JDK-8200055 (tz) Upgrade time-zone data to tzdata2018c
JDK-8208738 (tz) Upgrade time-zone data to tzdata2018d
JDK-8208741 (tz) Upgrade time-zone data to tzdata2018e
JDK-8219306 (tz) Upgrade time-zone data to tzdata2018g
JDK-8227915 (tz) Upgrade time-zone data to tzdata2018i
JDK-8227914 (tz) Upgrade time-zone data to tzdata2019a
JDK-8240060 (tz) Upgrade time-zone data to tzdata2019b
JDK-8240061 (tz) Upgrade time-zone data to tzdata2019c
JDK-8250730 (tz) Upgrade time-zone data to tzdata2020a
JDK-8250725 8077982 giflib upgrade breaks system giflib builds with earlier versions
JDK-8153981 [BACKOUT] JDWP: Memory Leak: GlobalRefs never deleted when processing invokeMethod command
JDK-8154288 [GCC5] java.lang.StackOverflowError on Zero JVM initialization on non x86 platforms
JDK-8175430 [javadoc] fix some javadoc errors in javax/swing
JDK-8175417 [javadoc] some errors in java/awt classes.
JDK-8175429 [javadoc] some errors in javax/swing
JDK-8199986 [lcms] ColorConvertOp to color space CS_GRAY apparently converts orange to 244,244,0
JDK-8199989 [lcms] ColorConvertOp: Alpha channel is not transferred from source to destination.
JDK-8199987 [lcms] Improve performance of ColorConverOp for default destinations
JDK-8180973 [linux] Experimental support for cgroup memory limits in container (ie Docker) environments
JDK-8175478 [macos 10.12] Trackpad scrolling of text on macOS 10.12 Sierra is very fast (Trackpad, Retina only)
JDK-8187208 [macos] JComboBox doesn't display popup in mixed JavaFX Swing Application on 8u131 and Mac OS 10.12
JDK-8134187 [macosx] Frame size reverts meaning of maximized attribute if frame size close to display
JDK-8181014 [macosx] Activating a JDialog puts to back another dialog
JDK-8181009 [macosx] AquaIcon HiDPI support
JDK-8181010 [macosx] Checkmarks of JCheckBoxMenuItems aren't rendered in high resolution on Retina
JDK-8134189 [macosx] Cleanup "may not respond to selector" warnings in native code
JDK-8180986 [macosx] Cleanup warnings in sun.lwawt
JDK-8134192 [macosx] Clipboard does not work with 3rd parties Clipboard Managers
JDK-8180987 [macosx] Cursor management unification
JDK-8134185 [macosx] Flavor change notification not coming
JDK-8181011 [macosx] Get MultiResolution image from native system
JDK-8180998 [macosx] getLocationOnScreen returns 0 if parent invisible
JDK-8181007 [macosx] java 7 and 8 JDialogs on multiscreen jump to parent frame on focus
JDK-8134186 [macosx] JVM crashes in CWrapper$NSWindow.screen(long)
JDK-8134188 [macosx] Key Bindings break with awt GraphicsEnvironment setFullScreenWindow
JDK-8181001 [macosx] Netbeans crashes in CImage.nativeCreateNSImageFromArray
JDK-8181005 [macosx] NullPointerException in getBufferStrategy()
JDK-8180985 [macosx] pack() does ignore size of a component; doesn't on the other platforms.
JDK-8232495 [macosx] Performance problems with Retina display on Mac OS X
JDK-8181003 [macosx] Popups appear behind taskbar
JDK-8175407 [macosx] Remove all references to GC from native OBJ-C code
JDK-8181000 [macosx] setIconImages() not working correctly (distorted icon when minimized)
JDK-8175406 [macosx] sun.lwawt.macosx.CAccessible leaks
JDK-8180999 [macosx] Support automatic @2x images loading on Mac OS X
JDK-8175405 [macosx] SwingNode crashes on exit
JDK-8180984 [macosx] TextArea has wrong initial size
JDK-8232491 [OGL] surface->sw blit is extremely slow
JDK-8232492 [OGL] Translucent VolatileImages don't paint correctly
JDK-8155145 [Parfait] JNI exception pending in fontpath.c:1300
JDK-8163037 [TEST BUG] test SessionCacheSizeTests.java timeout
JDK-8163067 [TEST BUG] Test SSLSession/SessionCacheSizeTests socket accept timed out
JDK-8173849 [TEST] Fix use of java.util.Base64 in test cases
JDK-8173854 [TEST] Update DHEKeySizing test case following 8076328 & 8081760
JDK-8180990 [TEST_BUG] :jdk/test/sun/misc/URLClassPath/ClassnameCharTest.java test fails with NullPointerException
JDK-8200037 [TEST_BUG] Cipher tests fail when running with unlimited policy
JDK-8155148 [TEST_BUG] ClientJSSEServerJSSE.java failing again
JDK-8172606 [TEST_BUG] com/sun/management/OperatingSystemMXBean/TestTotalSwap.java Compilation failed after JDK-8077387
JDK-8155123 [TEST_BUG] compiler/loopopts/CountedLoopProblem.java got OOME
JDK-8163055 [TEST_BUG] Intermittent test failures in sun/security/ssl/javax/net/ssl/NewAPIs
JDK-8134183 [TEST_BUG] javax/management/monitor/CounterMonitorTest.java hangs
JDK-8155151 [TEST_BUG] javax/security/auth/SubjectDomainCombiner/Optimize.java should use 4-args ProtectionDomain constructor
JDK-8155139 [TEST_BUG] jdb has succeded to read an unreadable file
JDK-8133993 [TEST_BUG] Make CipherInputStreamExceptions compile on OpenJDK 7
JDK-8180993 [TEST_BUG] sun/net/www/protocol/http/HttpInputStream.java fails intermittently
JDK-8200045 [TEST_BUG] sun/security/pkcs11/KeyPairGenerator/TestDH2048.java fails on Solaris x64 5.10
JDK-8134220 [TEST_BUG] sun/security/pkcs11/sslecc/ClientJSSEServerJSSE.java fails with BindException
JDK-8180997 [TEST_BUG] sun/security/ssl/SSLSocketImpl/CloseSocket.java failed with "Error while cleaning up threads after test"
JDK-8237604 [TEST_BUG] sun/security/tools/jarsigner/EntriesOrder.java not adapted for changes in JDK-7194449
JDK-8155132 [TEST_BUG] Tab characters in test/com/sun/jdi files
JDK-8155121 [TEST_BUG] Test SoftReference and OOM behavior
JDK-8200029 [TEST_BUG] test sun/net/www/http/HttpClient/B8025710.java failing with cert error in 8u121 b01
JDK-8191845 [TEST_BUG] Too many new-lines in backport of WeakAlg test
JDK-8134227 [TEST_BUG] two lib/testlibrary tests are failing with "Error. failed to clean up files after test" with jtreg 4.1 b12
JDK-8155138 [TEST_BUG]: com/sun/jdi/JdbReadTwiceTest.sh fails when run under root
JDK-8141306 [TEST_BUG]: java/rmi/transport/pinClientSocketFactory/PinClientSocketFactory.java fails intermittently
JDK-8141301 [TEST_BUG]: java/util/regex/RegExTest.java fails intermittently
JDK-8187166 [TESTBUG] 8174164 fix missed the test
JDK-8172608 [TESTBUG] javax/security/auth/Subject/doAs/NestedActions.java fails if extra VM options are given
JDK-8240001 [TESTBUG] Remove pointless catch block in test/jdk/sun/security/util/DerValue/BadValue.java
JDK-8172602 [TESTBUG] test for 8067364 depends on hardwired text advance
JDK-8200041 [testlibrary] rmi TestSocketFactory does not flush
JDK-8200042 [testlibrary] TestSocketFactory should allow triggers before match/replace
JDK-8203749 [Windows] java.awt.IllegalComponentStateException: component must be showing on the screen to determine its location
JDK-8250702 A TSA server returns timestamp with precision higher than milliseconds
JDK-8250721 ActionListeners on JRadioButtons don't get notified when selection is changed with arrow keys
JDK-8147466 Add -fno-strict-overflow to IndicRearrangementProcessor{,2}.cpp
JDK-8239997 Add blocking bulk read operations to java.io.InputStream
JDK-8175484 Add debug output for indicating if a chosen ciphersuite was legacy
JDK-8141307 add doPrivileged methods with limited privilege scope
JDK-8239999 Add InputStream readNBytes(int len)
JDK-8141308 Add isAuthorized check to limited doPrivileged methods
JDK-8240022 Add kinit options and krb5.conf flags that allow users to obtain renewable tickets and specify ticket lifetimes
JDK-8175486 Add MD5 to signed JAR restrictions
JDK-8175447 Add mechanism to allow non default root CAs to be not subject to algorithm restrictions
JDK-8180964 Add new C2 flag to keep safepoints in counted loops.
JDK-8193956 Add OCSP support to PKIX CertPathBuilder implementation
JDK-8239994 add result NULL-checking to freetypeScaler.c
JDK-8175442 Add security property to configure XML Signature secure validation mode
JDK-8163053 Add SSLSocket client/SSLEngine server to templates directory
JDK-8163074 Add support for 3 digit hotspot minor version numbers
JDK-8163073 add support for 3 digit update release numbers
JDK-8163050 Add support to jarsigner for specifying timestamp hash algorithm
JDK-8222541 Add test cases for lenient Japanese era parsing
JDK-8227908 Add utility methods to check indexes and ranges
JDK-8172609 Additional tests for jarsigner's warnings
JDK-8187181 Additional tests for JEP 288: Disable SHA-1 Certificates
JDK-8240035 Additional tests for krb5 settings
JDK-8200023 Additional tests for signature algorithm OIDs and transformation string
JDK-8187212 After updating to Java8u131, the bind to rmiregistry is rejected by registryFilter even though registryFilter is set
JDK-8250711 AIOOBE in GIFImageReader.initializeStringTable
JDK-8168598 AIX port of "8050807: Better performing performance data handling"
JDK-8167144 AIX: 8022507: SIGSEGV at ParMarkBitMap::verify_clear()
JDK-8167198 AIX: Changes to make AIX compile after latest upstream changes
JDK-8168601 AIX: Fix os::naked_short_sleep() in os_aix.cpp after 8028280
JDK-8222657 Allow later Symantec Policy distrust date for two Apple SubCAs
JDK-8133966 Allow OpenJDK to build on PaX-enabled kernels
JDK-8240062 Allow Sasl mechanisms to be restricted
JDK-8150476 Allow specifying an address to bind JMX remote connector
JDK-8180958 assert: failed: heap size is too big for compressed oops
JDK-8175474 Atomic*FieldUpdaters should use Class.isInstance instead of direct class check
JDK-8175473 AtomicIntegerFieldUpdater does not work when SecurityManager is installed
JDK-8194036 Attempting to remove help menu from java.awt.MenuBar throws NullPointerException
JDK-8194003 attributes are ignored when loading keys from a PKCS12 keystore
JDK-8163045 autotest.sh fails on ubuntu because libsoftokn.so not found
JDK-8194001 Avoid storing duplicate PKCS12 attributes
JDK-8200040 Backport jdk/test/lib/testlibrary/CompilerUtils.java to jdk8u which is helpful in test development
JDK-8173622 Backport of 7180907 is incomplete
JDK-8187173 backport of 8031737 to jdk8u breaks linux buld.
JDK-8199954 Bad backport of 8024468 breaks Zero build due to lack of 8010862 in OpenJDK 7
JDK-8134164 Bad error message on parsing illegal character in XML attribute
JDK-8200056 Bad primeCertainty value setting in DSAParameterGenerator
JDK-8232489 Better invalid FilePermission
JDK-8219295 Better management of CipherCore buffers
JDK-8219294 Better management of internal KeyStore buffers
JDK-8227874 Branch-free output conversion for X25519 and X448
JDK-8175432 Broken link in "javax.swing.SwingWorker"
JDK-8175433 broken links in documentation at http://docs.oracle.com/javase/6/docs/api/index.
JDK-8250728 BufImg_SetupICM add ReleasePrimitiveArrayCritical call in early return
JDK-8187161 Build failure with glibc >= 2.24: error: 'int readdir_r(DIR*, dirent*, dirent**)' is deprecated
JDK-8163032 Build needs additional flags to compile with GCC 6
JDK-8203739 Build the JCE portion of JDK-8000970
JDK-8232643 Building error in jdk7u241 after 7068616
JDK-8180961 Cache initial active_processor_count
JDK-8222653 Calendar.getDisplayName() returns empty string for new Japanese Era on some locales
JDK-8233088 Cannot use italic font style if the font has embedded bitmap
JDK-8239984 CastII/ConvI2L for a range check is prematurely eliminated
JDK-8193962 Certificate validation - java.lang.ClassCastException
JDK-8194037 CertificateException missing cause of underlying exception
JDK-8175476 Certificates not being blocked by jdk.tls.disabledAlgorithms property
JDK-8193964 CertPath/CertPathValidatorTest/KeyParamsInheritanceTest fails with NullPointerException
JDK-8199966 Change 8037816 breaks HS build on PPC64 and CPP-Interpreter platforms
JDK-8199964 Change 8037816 breaks HS build with older GCC versions which don't support diagnostic pragmas
JDK-8180967 Change type of the number of GC workers to unsigned int (2)
JDK-8200038 Check the AlgorithmParameters in algorithm constraints
JDK-8187172 CHECK_NULL and CHECK_EXCEPTION macros cleanup
JDK-8175485 Chrome interop regression with JDK-8148516
JDK-8193969 CICO ignores AAD in GCM mode
JDK-8200020 Cipher getParameters() throws RuntimeException: Cannot find SunJCE provider
JDK-8219300 CipherCore performance improvement
JDK-8134178 CipherInputStream throws BadPaddingException if stream is not fully read
JDK-8199971 Clang: enable return type warnings on BSD
JDK-8199967 clang: remove -Wno-unused-value
JDK-8193991 clarification on warning of keytool -printcrl
JDK-8175434 Clarify the default locale used in each locale sensitive operation
JDK-8203745 Class name repeated in output of Type.toString()
JDK-8175435 Clean up doclint warnings and errors in java.text package
JDK-8172650 clean up source files containing carriage return characters
JDK-8213851 clean up warnings in java.util.jar, .logging, .prefs
JDK-8232487 Clean-up JDK Build Warnings in java.util, java.io
JDK-8180969 cleanup IA64 specific code in Hotspot
JDK-8203725 Cleanup of the javadoc tag in java.security.*
JDK-8175423 Cleanup of the javadoc tag in java.security.cert
JDK-8175428 Cleanup of the javadoc tag in java.security.spec
JDK-8194002 Cleanup PKCS12 tests to ensure streams get closed
JDK-8172591 cleanup warnings indicated by the -Wunused-value compiler option on linux
JDK-8180980 closed/java/awt/MenuBar/MenuBarStress1/MenuBarStress1.java hangs on win 64 bit with jdk8
JDK-8200027 com/sun/crypto/provider/KeyAgreement/SupportedDHParamGens.java failed with timeout
JDK-8155133 com/sun/jdi/JdbMethodExitTest.sh fails when a background thread is generating events.
JDK-8219267 compile.cpp verify_graph_edges uses "bool" as "int"
JDK-8168596 Concurrency problem in PcDesc cache
JDK-8172637 ContentHandler.getContent API changed in error
JDK-8232482 Core libraries don't build with javac -Xlint:all -Werror
JDK-8172617 corelibs test scripts should pass TESTVMOPTS
JDK-8227880 correct the field size check when decoding a point on ECC curve
JDK-8199992 Crash during color profile destruction
JDK-8232503 crash in freetypeScaler.c CopyBW2Grey8
JDK-8199995 Crash on PPC and PPC v2 for Java_awt test suit
JDK-8213850 Crash with assert(handler_address == SharedRuntime::compute_compiled_exc_handler(..) failed: Must be the same
JDK-8219301 Create test to cover JDK-8205330 InitialDirContext ctor sometimes throws NPE if the server has sent a disconnection
JDK-8172611 Creating a VolatileImage with size 0,0 results in no longer working g2d.drawString
JDK-8227907 Crypto AES/ECB encryption/decryption performance regression (introduced in jdk9b73)
JDK-8222661 Currency update needed for ISO 4217 Amendment #161
JDK-8222662 Currency update needed for ISO 4217 Amendment #162.
JDK-8181002 Custom cursor HiDPI support
JDK-8181013 Deadlock in com.sun.jndi.ldap.pool.Connections
JDK-8213882 Disable all DES cipher suites
JDK-8219305 Disable anon and NULL cipher suites
JDK-8199962 Disable deprecation warning for readdir_r
JDK-8222656 Distrust TLS server certificates anchored by Symantec Root CAs
JDK-8199998 DNS provider cleanups
JDK-8219284 Do cleanup in a proper order in sunmscapi code
JDK-8194027 Do not call File::deleteOnExit in security tests
JDK-8240053 Do not request for addresses for forwarded TGT
JDK-8134191 Dvorak keyboard mapping not honored when ctrl key pressed
JDK-8227878 ECC Field Arithmetic Enhancements
JDK-8227873 Efficient and constant-time modular arithmetic
JDK-8163039 Eliminate pack200 build warnings
JDK-8175499 Eliminate the static dependency to sun.security.ec.ECKeyFactory
JDK-8175497 Enable client-side TLS 1.2 by default
JDK-8134168 Enable hotspot builds on 4.x Linux kernels
JDK-8200031 Enable unlimited cryptographic policy by default in Oracle JDK builds
JDK-8208730 EndEntityChecker should not process custom extensions after PKIX validation
JDK-8194025 enhance KDC server availability detection
JDK-8240003 Examine usages of sun.misc.IOUtils
JDK-8187201 Failed to load RSA private key from pkcs12
JDK-8199963 fastdebug builds fail due to lack of p2i
JDK-8172600 Fatal: Bug in native code: jfieldID class must match object
JDK-8213872 Feed some text to STDIN in ProcessTools.executeProcess()
JDK-8240051 File.exists throws AccessControlException for invalid paths when a SecurityManager is installed
JDK-8167335 Fix build on Linux with 64kb default page size
JDK-8133967 Fix build where PAX_COMMAND is not specified
JDK-8194033 Fix compatibility issue in AlgorithmChecker for 3rd party JCE providers
JDK-8199969 Fix debug build after 8062808: Turn on the -Wreturn-type warning
JDK-8175413 Fix doclint issues in java.beans
JDK-8240049 Fix doclint issues in java.nio.*
JDK-8175495 Fix doclint issues in java.util.concurrent
JDK-8175415 Fix doclint issues in javax.crypto and javax.security subpackages
JDK-8175418 Fix doclint warnings in javax.print
JDK-8199994 Fix for 8025429 breaks jdk build on windows
JDK-8202850 Fix for 8189123 doesn't include precompiled headers
JDK-8175419 Fix javadoc comments errors and warning reported by doclint report
JDK-8240052 fix krb5 caddr
JDK-8163038 Fix lint warnings in sun.security.ec
JDK-8133991 Fix mistake in 8075374 backport
JDK-8203728 Fix more doclint issues in javax.security
JDK-8208739 Fix potential crash in BufImg_SetupICM
JDK-8134248 Fix recently backported tests to work with OpenJDK 7u
JDK-8187185 fix warnings in java.util.jar, sun.tools.jar, zipfs demo, etc.
JDK-8240054 FontMetrics.getMaxAdvance may be less than the maximum FontMetrics.charWidth
JDK-8239996 freetype seeks to index at the end of the font data
JDK-8222449 freetypecheck compares versions using lexicographic comparison
JDK-8180983 FtpURLConnection connection leak on FileNotFoundException
JDK-8219299 Further improvements to cipher buffer management
JDK-8180968 G1 crashes if active_processor_count changes during startup
JDK-8180959 gc/arguments/TestUseCompressedOopsErgo.java does not compile
JDK-8208717 gcc warnings compiling src/solaris/native/sun/management
JDK-8208716 gcc warnings compiling src/solaris/native/sun/security/pkcs11
JDK-8208722 gcc warnings compiling various libraries files
JDK-8180991 GetVersionEx in java.base/windows/native/libjava/java_props_md.c might not get correct Windows version
JDK-8250724 GIFLIB upgrade
JDK-8134221 GSSContext.acceptSecContext fails when a supported mech is initiator preferred
JDK-8240043 GSSCredential.getRemainingLifetime() returns negative value for TTL > 24 days.
JDK-8213871 Handshake messages can be strictly ordered
JDK-8194023 Hashtable deserialization reconstitutes table with wrong capacity
JDK-8219302 Hot lock on BulkCipher.isAvailable
JDK-8193948 HotSpot VM fails to start when AggressiveHeap is set
JDK-8240002 HttpTimestamper should accept https URI
JDK-8203759 IDN do not throw IAE when hostname ends with a trailing dot
JDK-8194034 IllegalArgumentException in java.awt.image.ReplicateScaleFilter
JDK-8172613 IllegalArgumentException thrown by api/java_awt/Component/FlipBufferStrategy/indexTGF_General
JDK-8172614 IllegalArgumentException thrown by JCK test api/java_awt/Component/FlipBufferStrategy/indexTGF_General in opengl pipeline
JDK-8181024 IllegalArgumentException: jdk.tls.namedGroups
JDK-8180982 IME Composition Window is displayed at incorrect location
JDK-8180978 IME Composition Window is displayed on incorrect position
JDK-8213879 Impact of noncloneable MessageDigest implementation
JDK-8240036 Impact on krb5 test cases in the 8u nightly
JDK-8172639 Implement dead key detection for KeyEvent on Linux
JDK-8200002 Implement reliability test for DH algorithm
JDK-8175452 Implement Serialization Filtering
JDK-8154195 Implement SHA-224
JDK-8205587 Implicit function declaration in jni_util.c
JDK-8227910 Improve exception reporting for Objects.checkIndex/checkFromToIndex/checkFromIndexSize
JDK-8175453 Improve extensibility of ObjectInputFilter information passed to the filter
JDK-8175426 Improve javadocs for Socket class by adding references to SocketOptions
JDK-8203746 Improve javax.crypto.BadPaddingException messages
JDK-8193954 Improved algorithm constraints checking
JDK-8227884 Improved ECC Implementation
JDK-8180955 Incompatible heap size flags accepted by VM
JDK-8240000 Incorrect behavior when reading DER value with Integer.MAX_VALUE length
JDK-8187215 Incorrect return processing for the LF editor of MethodHandles.permuteArguments
JDK-8203747 increase java.util.logging.FileHandler MAX_LOCKS limit
JDK-8175450 Increase the minimum strength of EC keys
JDK-8200048 Increase the number of clones in the CloneableDigest
JDK-8141300 Increment minor version of HSx for 7u91 and initialize the build number
JDK-8148580 Increment minor version of HSx for 7u95 and initialize the build number
JDK-8134171 Increment minor version of HSx for 8u51 and initialize the build number
JDK-8134174 Increment the build value to b02 for hs25.51 in 8u51-b10
JDK-8134175 Increment the build value to b03 for hs25.51 in 8u51-b15
JDK-8219293 InitialDirContext ctor sometimes throws NPE if the server has sent a disconnection
JDK-8199961 Interned string and symbol table leak memory during parallel unlinking
JDK-8168592 Introduce accessor for tmp_oop in frame.
JDK-8219303 Introduce system property to control enabled ciphersuites
JDK-8175498 Introduce the jdk.tls.client.protocols system property for JDK 7u
JDK-8227885 ISO 4217 Amendment #165 Update
JDK-8227886 ISO 4217 Amendment #166 Update
JDK-8227887 ISO 4217 Amendment #167 Update
JDK-8227888 ISO 4217 Amendment #168 Update
JDK-8227889 ISO 4217 Amendment #169 Update
JDK-8222658 ISO 4217 amendment 160
JDK-8240023 JAAS Krb5LoginModule has suspect ticket-renewal logic, relies on clockskew grace
JDK-8240025 JAAS/Krb5LoginModule using des encytypes failure with NPE after JDK-8012679
JDK-8222539 Japanese new era implementation
JDK-8187216 Jar file verification failing with SecurityException: digest missing xxx
JDK-8181026 jar usage string mentions unsupported option
JDK-8208718 JarFacade.c should not include ctype.h
JDK-8175462 jarsigner -verbose -verify should print the algorithms used to sign the jar
JDK-8163049 JARSigner including TimeStamp PolicyID (TSAPolicyID) as defined in RFC3161
JDK-8213873 jarsigner should emit warning if weak algorithms or keysizes are used
JDK-8219289 jarsigner should print when a timestamp will expire
JDK-8213877 jarsigner treats timestamped signed jar invalid after the signer cert expires
JDK-8250729 java.io.File.isInvalid() is racy
JDK-8240059 java.lang.UnsatisfiedLinkError: net.dll: Can't find dependent libraries
JDK-8187180 java.nio.Bits.unaligned() doesn't return true on ppc
JDK-8200760 java.security-linux was missed in backport of JDK-8160104
JDK-8172638 javac warnings compiling java.awt.EventDispatchThread and sun.awt.X11.XIconWindow
JDK-8193999 javadoc cleanup for 8005408
JDK-8175427 javadoc cleanup in java.net
JDK-8175414 javadoc cleanup in javax.security
JDK-8203727 javadoc errors in core libs
JDK-8175424 JavaDoc for ScriptEngineFactory.getProgram() contains an error
JDK-8175394 javadoc internal DocletAbortException should set cause when appropriate
JDK-8175396 javadoc should used a standard "generated by javadoc" string
JDK-8175393 javadoc should write directly to Writer instead of composing strings
JDK-8175395 javadoc shows stacktrace after print error resulting from disk full
JDK-8175392 javadoc stopped copying doc-files
JDK-8141309 JavaSecurityAccess.doIntersectionPrivilege() drops the information about the domain combiner of the stack ACC
JDK-8163051 javax.swing.TimerQueue: timer fires late when another timer starts
JDK-8175501 javax/net/ssl/TLS/TLSClientPropertyTest.java needs to be updated for JDK-8061210
JDK-8175437 JCK test api/javax_xml/crypto/dsig/TransformService/index_ParamMethods fails
JDK-8134166 JCK test api/xsl/conf/string/string17 starts failing after JDK-8074297
JDK-8134197 JDK 8 schemagen tool does not generate xsd files for enum types
JDK-8250696 JDK 8u: sun.misc.Version.jdkUpdateVersion() returns wrong result
JDK-8141311 JDK KRB5 module throws OutOfMemoryError when CCache is corrupt
JDK-8203732 JDK should be updated to use LittleCMS 2.8
JDK-8219570 JDK-6383200 wrongly extends PBEParameterSpec API
JDK-8196978 JDK-8187667 fails on GCC 4.4.7 as found on RHEL 6
JDK-8193992 jdk8 l10n resource file translation update 4
JDK-8172651 jdk8u40 l10n resource file translation update 1
JDK-8172585 jdk8u60 l10n resource file translation update 2
JDK-8153561 JDWP: Memory Leak: GlobalRefs never deleted when processing invokeMethod command
JDK-8172604 JEditorPane.createEditorKitForContentType throws NPE after 6882559
JDK-8187211 JFileChooser with Windows look and feel crashes on win 10
JDK-8181008 JFrame in full screen mode leaves empty workspace after close
JDK-8150477 JMXInterfaceBindingTest is failing intermittently
JDK-8150478 JMXInterfaceBindingTest is failing intermittently for IPv6 addresses
JDK-8175463 JNDI libraries do not build with javac -Xlint:all -Werror
JDK-8175465 JNDI name operations should be locale independent
JDK-8194039 JNU_CHECK_EXCEPTION should support c++ JNI syntax
JDK-8227902 JpegImageReader throws IndexOutOfBoundsException when trying to read image data from tables-only image
JDK-8148578 jps running as root fails after the fix of JDK-8050807
JDK-8207151 JVM 7u181 crash with SIGSEGV when Tomcat 7 starts
JDK-8199960 JVM crashes sometimes while starting
JDK-8180965 jvm crashes when -XX:+UseCountedLoopSafepoints is enabled
JDK-8134169 JVM fastdebug build compiled with GCC 5 asserts with "widen increases"
JDK-8175403 JVM stuck in infinite loop during verification
JDK-8240044 KDC might issue a renewable ticket even if not requested
JDK-8240028 KDC tests cleanup
JDK-8240017 Kerberos ignores PA-DATA with a non-null s2kparams
JDK-8240027 Kerberos krb5 authentication: AuthList's put method leads to performance issue
JDK-8240046 Kerberos sequence number issues
JDK-8240026 KerberosTicket does not properly handle renewable tickets at the end of their lifetime
JDK-8193990 KeyStore API enhancements
JDK-8240005 KeyStore.load() throws an IOException with a wrong cause in case of wrong password
JDK-8194032 keytool fails to format resource strings for keys for some languages after JDK-8171319
JDK-8193998 keytool should not warn if signature algorithm used in cacerts is weak
JDK-8193997 keytool should print out warnings when reading or generating cert/cert req using weak algorithms
JDK-8193995 Keytool, print key algorithm of certificate or key entry
JDK-8240021 klist starttime, renewtill, ticket etype
JDK-8240019 krb5.conf does not accept directive lines before the first section
JDK-8181025 l10n for policytool
JDK-8187203 LdapCtx.processReturnCode() throwing Null Pointer Exception
JDK-8213886 LDAPS communication failure with jdk 1.8.0_181
JDK-8240024 Let allow_weak_crypto default to false
JDK-8148586 Let OracleUcrypto accept RSAPrivateKey
JDK-8134170 Linker error when compiling G1SATBCardTableModRefBS after include order changes
JDK-8199955 linux-zero does not build without precompiled header
JDK-8175431 List of spelling errors in API doc
JDK-8194006 Loading JKS keystore using non-null InputStream results in closed stream
JDK-8227890 localized currency symbol of VES
JDK-8227891 Localized names for Japanese Era Reiwa in COMPAT provider
JDK-8175471 Long narrowing conversion should describe the algorithm used and implied "risks"
JDK-8134610 Mac OS X build fails after July 2015 CPU
JDK-8187176 Macros for checking and returning on exceptions
JDK-8154217 make ephemeral DH key match the length of the certificate key
JDK-8240020 Make KerberosTime immutable
JDK-8187163 Make replace_in_map() on parent maps generic
JDK-8163043 Make sure keytool prints both unknown and unparseable extensions
JDK-8172589 Make test-in-build an option (Queens)
JDK-8180950 Make XSL generated namespace prefixes local to transformation process
JDK-8240042 Manual security tests have @ignore rather than @run main/manual
JDK-8180974 max_heap_for_compressed_oops() declared with size_t, but defined with uintx
JDK-8187214 Menu is activated after using mnemonic Alt/Key combination
JDK-8180953 Message "Error occurred during initialization of VM" on boxes with lots of RAM
JDK-8172583 method grouping tabs are not selectable
JDK-8193974 Minor optimizations to ISO10126PADDING
JDK-8232484 Misc warnings in java.util.PropertyPermission
JDK-8213854 Miscellaneous warnings sun.misc ( and related classes )
JDK-8193984 Missing @bug for tests added with JDK-8165367
JDK-8185501 Missing import in JAXP code
JDK-8172640 Missing isLoggable() checks in logging code
JDK-8199973 Missing return statement in __sync_val_compare_and_swap_8
JDK-8175409 Modify sun/security/smartcardio manual regression tests so that they do not just fail if no cardreader found
JDK-8194021 More defensive HashSet.readObject
JDK-8175420 more fix of javadoc errors and warnings reported by doclint, see the description
JDK-8175422 More javadoc warnings
JDK-8240031 More krb5 tests
JDK-8194017 More Signature tests
JDK-8163042 Move few sun.security.{util, x509, pkcs} classes used by keytool/jarsigner to another package
JDK-8222652 Move java/util/Calendar/CalendarTestScripts tests into OpenJDK
JDK-8227911 Move Objects.checkIndex BiFunction accepting methods to an internal package
JDK-8219285 MSCAPI keystore should accept Certificate[] in setEntry()
JDK-8219286 MSCAPI provider does not create unique alias names
JDK-8175449 Multi-core compilation of the jdk is prevented by auxiliary classes hidden inside java source files.
JDK-8219287 Native implementation of sunmscapi should use operator new (nothrow) for allocations
JDK-8180960 Native OOME when allocating after changes to maximum heap supporting Coops sizing on sparcv9
JDK-8239982 need comprehensive fix for unconstrained ConvI2L with narrowed type
JDK-8200032 Need new regression tests for PBE keys
JDK-8200033 Need new regressions tests for buffer handling for PBE algorithms
JDK-8200034 Need to add tests for AES cipher
JDK-8199984 Need to provide benchmarks for color management
JDK-8154205 Need to support NSA Suite B Cryptography algorithms
JDK-8250698 NegativeArraySizeException in sun.security.util.DerInputStream.getUnalignedBitString()
JDK-8172636 Networking Libraries don't build with javac -Werror
JDK-8194015 New defaults for DSA keys in jarsigner and keytool
JDK-8219290 New jarsigner timestamp warning is grammatically incorrect
JDK-8172603 new JEditorPane("text/plain","") fails for null context class loader
JDK-8175500 New tests for TLS property jdk.tls.client.protocols
JDK-8232481 NIO libraries do not build with javac -Xlint:all,-deprecation -Werror
JDK-8172647 NLS: mnemonics missing in SwingSet2/JInternalFrame demo
JDK-8172649 No mnemonics on Open and Save buttons in JFileChooser
JDK-8185502 No overflow operator on OpenJDK 7
JDK-8155122 Nondeterministic wrong answer on arithmetic
JDK-8194035 NPE hit with java.security.debug=provider
JDK-8180994 NTLM authentication fail if user specified a different realm
JDK-8175421 Null-check-in-finally pattern in java/security documentation
JDK-8250697 NullPointerException in DerValue.equals(DerValue)
JDK-8194004 NullPointerException in PKCS#12 Keystore in PKCS12KeyStore.java
JDK-8193960 NullPointerException in sun.security.provider.certpath.CertId()
JDK-8199985 NullPointerException when running regression tests LoadProfileTest by using openjdk-7-b144
JDK-8208742 ObjectInputStream filterCheck method throws NullPointerException
JDK-8193963 OCSP client can't find responder cert if it uses a different subject key id algorithm than responderID
JDK-8193961 OCSP validation fails if ocsp.responderCertSubjectName is set
JDK-8208734 On Windows Swing changes keyboard layout on a window activation
JDK-8133970 Only apply PaX-marking when needed by a running PaX kernel
JDK-8185716 OpenJDK 7 PPC64 port uses a different ins_encode format in ppc.ad
JDK-8227904 Optimize sun.nio.cs.ISO_8859_1$Encode.encodeArrayLoop() (jdk part of 6896617)
JDK-8172612 OutputAnalyzer's shouldXXX() calls return this
JDK-8222659 Override mechanism for currency data should not require creating currency.properties in java.home
JDK-8154175 P11Digest should support cloning
JDK-8163040 Parts of the JDK erroneously rely on generic array initializers with diamond
JDK-8219296 PBE: need new algorithm support in password based encryption
JDK-8213880 Pending exceptions in java.base/windows/native/libnet
JDK-8239998 Performance of InputStream.readAllBytes() could be improved
JDK-8172616 PKCS basic tests
JDK-8194019 PKCS11 provider should support 2048-bit DH
JDK-8163044 PKCS11 tests should use the NSS libraries available in the OS
JDK-8194000 PKCS12 test failure due to incorrect alias name
JDK-8193994 PKCS12KeyStore cannot extract AES Secret Keys
JDK-8163052 PKCS7.java is needlessly creating SHA1PRNG SecureRandom instances when timestamping is not done
JDK-8148597 PKIX CertPathBuilder in reverse mode doesn't work if more than one trust anchor is specified
JDK-8222540 Placeholder for Japanese new era should be two characters
JDK-8148579 Port fix of JDK-8075773 to AIX and possibly MacOSX
JDK-8163057 Potential deadlock in of sun.nio.ch.Util/IOUtil
JDK-8168579 PPC64 (part 102): cppInterpreter: implement G1 support
JDK-8168580 PPC64 (part 104) : cppInterpreter: implement support for compressed Oops
JDK-8168581 PPC64 (part 105): cppInterpreter: implement support for early return
JDK-8168582 PPC64 (part 105-2): fix build in cppInterpreter after 8019519
JDK-8168584 PPC64 (part 107): Extend ELF-decoder to support PPC64 function descriptor tables
JDK-8168583 PPC64 (part 11): Fix IA64 preprocessor conditionals on AIX.
JDK-8168589 PPC64 (part 112): C argument in register AND stack slot.
JDK-8168575 PPC64 (part 2): Clean up PPC defines.
JDK-8168588 PPC64 (part 201): cppInterpreter: implement bytecode profiling
JDK-8168586 PPC64 (part 202): cppInterpreter: support for OSR.
JDK-8168587 PPC64 (part 213): cppInterpreter: memory ordering for object initialization
JDK-8168576 PPC64 (part 3): basic changes for PPC64
JDK-8168578 PPC64 (part 4): add relocation for trampoline stubs
JDK-8168577 PPC64 (part 6): stack handling improvements
JDK-8168585 PPC64 (part 7): cppInterpreter: implement support for biased locking
JDK-8168594 PPC64/AIX: Several smaller fixes
JDK-8193951 PPC64: Adapt to 8002074: Support for AES on SPARC
JDK-8165807 PPC64: Backport PPC64 port to OpenJDK 7
JDK-8168574 PPC64: Basic changes and files to build the class library on AIX
JDK-8168572 PPC64: Enable new build on AIX (jdk part)
JDK-8168600 PPC64: Fix wrong rotate instructions in the .ad file
JDK-8168590 PPC64: gcc 4.8 warning in output_c.cpp
JDK-8168597 PPC64: implement template interpreter for ppc64le
JDK-8168593 PPC64: implement the template interpreter
JDK-8240009 PPC64: Make the various POLL constants system dependant
JDK-8168591 PPC64: Support for elf v2 abi.
JDK-8168573 PPC64: Support for little endian execution model
JDK-8168605 PPC64: unaligned Unsafe.getInt can lead to the generation of illegal instructions
JDK-8155134 PPC64: Updated the JDK regression tests to run on AIX
JDK-8168603 PPC64LE: argument passing problem when passing 15 floats in native call
JDK-8168602 PPC64LE: MacroAssembler::bxx64_patchable kills register R12
JDK-8168599 ppc: pass thread to throw_AbstractMethodError
JDK-8200019 Print size of DH keysize when errors are encountered
JDK-8172601 Printing to Postscript doesn't support dieresis
JDK-8172607 Privilege tests with JAAS Subject.doAs
JDK-8240055 Problem list java/awt/FontMetrics/MaxAdvanceIsMax.java
JDK-8240057 Problem with NullPointerException in RMI TCPEndpoint.read
JDK-8187195 Race Condition in java.lang.reflect.WeakCache
JDK-8250695 Race when reusing PerRegionTable bitmaps may result in dropped remembered set entries
JDK-8239983 range check CastII nodes should not be split through Phi
JDK-8239985 Range check dependent CastII/ConvI2L is prematurely eliminated
JDK-8213853 rawtype warnings in several net, nio and security source files
JDK-8180976 Reduce number of warnings in awt classes
JDK-8227906 Refactor DigestBase.engineUpdate() method for better code generation by JIT compiler
JDK-8232483 Reflection classes do not build with javac -Xlint:all -Werror
JDK-8175468 ReflectionFactory support for IIOP and custom serialization
JDK-8240029 reg test for 6879540
JDK-8175496 Regression test DHEKeySizing.java failing intermittently
JDK-8172646 Regression test fails: test/closed/javax/swing/JMenuItem/4654927/bug4654927.java
JDK-8180956 Regression tests for 8006088
JDK-8204484 Release session if initialization of SunPKCS11 Signature fails
JDK-8175397 remove dead code from HtmlWriter and subtypes
JDK-8208740 Remove debug print statements from RMI fix
JDK-8222648 Remove Linux version check from HotSpot builds
JDK-8250722 Repeated offer and remove on ConcurrentLinkedQueue lead to an OutOfMemoryError
JDK-8172641 Replace deprecated PlatformLogger isLoggable(int) with isLoggable(Level)
JDK-8222654 Replace the placeholder Japanese era name
JDK-8187162 replace_in_map() should operate on parent maps
JDK-8187164 ReplacedNodes dumps it's content to tty
JDK-8240037 ReplayCache tests fail on multiple platforms
JDK-8240007 Reserved for 2020-01 CPU
JDK-8180981 Resizing dialog which is JWindow parent makes JVM crash
JDK-8213881 Resources not freed on exception
JDK-8200028 Restrict the use of EXPORT cipher suites
JDK-8163048 Restructure timestamp code so that jars and modules can more easily share the same code
JDK-8193957 ReverseBuilder.getMatchingCACerts may throws NPE
JDK-8133990 Revert introduction of lambda expression in sun.lwawt.macosx.LWCToolkit
JDK-8172592 revise the fix for 8007037
JDK-8193955 Revocation checking enhancements (JEP-124)
JDK-8180972 RFE: cleanup jlong typedef on __APPLE__ and _LP64 systems
JDK-8163071 RMIConnector logs attribute names incorrectly
JDK-8187165 SafePointNode::_replaced_nodes breaks with irreducible loops
JDK-8134198 schema1.xsd has wrong content. Sequence of the enum values has been changed
JDK-8175441 Secure validation of XML based digital signature always enabled when checking wrapping attacks
JDK-8175411 Security libraries don't build with javac -Werror
JDK-8163041 Security libraries don't build with javac -Xlint:all,-deprecation -Werror
JDK-8200006 security native code doesn't always use malloc, realloc, and calloc correctly
JDK-8181031 serialVersionUID of java.awt.dnd.InvalidDnDOperationException changed in JDK8-b82
JDK-8250727 SessionId.hashCode generates too many collisions
JDK-8180977 setFont() does not update Fonts of Menus already on screen
JDK-8154211 SHA1WithDSA with key > 1024 bits not working
JDK-8194038 Ship the unlimited policy files in JDK Updates
JDK-8172619 ShortRSAKey1024.sh tests should do cleanup before start test
JDK-8141310 should a principalname object always have a realm?
JDK-8193952 SIGBUS in C2 compiled method weblogic.wsee.jaxws.framework.jaxrpc.EnvironmentFactory$SimulatedWsdlDefinitions.
JDK-8175439 Signing XML with DSA throws Exception when key is larger than 1024 bits
JDK-8240018 Simplify Config.get() of krb5
JDK-8218798 slowdebug build broken by JDK-8205714
JDK-8193986 SocketInputStream.socketRead0 can hang even with soTimeout set
JDK-8168595 Some bugfixes for the ppc64 port.
JDK-8213867 Some of the input validation in the javasound is too strict
JDK-8240004 Some tests depend on internal API sun.misc.IOUtils
JDK-8134222 SPNEGO auth fails if client proposes MS krb5 OID
JDK-8193993 String "Tabular Navigation" should be rephrased for avoiding mistranslation
JDK-8163047 String resources for Key Tool and Policy Tool should be in their respective packages
JDK-8134165 substring in XSLT returns wrong character if string contains supplementary chars
JDK-8187170 sun.management.LazyCompositeData.isTypeMatched() fails for composite types with items of ArrayType
JDK-8240039 sun.security.krb5.KdcComm interprets kdc_timeout as msec instead of sec
JDK-8163070 sun.security.mscapi.KeyStore might load incomplete data
JDK-8199991 sun/java2d/cmm/ tests failed against RI b141 & b138-nightly
JDK-8200030 sun/net/www/http/HttpClient/B8025710.java should run in ovm mode
JDK-8194029 sun/security/krb5/auto/MaxRetries.java failed with timeout
JDK-8194028 sun/security/krb5/auto/MaxRetries.java fails with Retry count is -1 less
JDK-8194026 sun/security/krb5/auto/MaxRetries.java may fail with BindException
JDK-8163069 sun/security/mscapi/ShortRSAKey1024.sh fails intermittently
JDK-8208733 sun/security/mscapi/SignedObjectChain.java fails on Windows
JDK-8208729 sun/security/pkcs11/ec/ReadCertificates.java fails intermittently
JDK-8200024 sun/security/provider/NSASuiteB/TestDSAGenParameterSpec.java timeouts intermittently
JDK-8203760 sun/security/ssl/javax/net/ssl/ServerName/IllegalSNIName.java fails
JDK-7142888 sun/security/tools/jarsigner/ec.sh fail on sparc
JDK-8219291 sun/security/tools/jarsigner/warnings/NoTimestampTest.java fails after JDK-8027781
JDK-8227877 sun/text/resources/LocaleDataTest.java fails with java.lang.Exception
JDK-8227882 SunEC throws ProviderException on invalid curves
JDK-8200021 Support DHE sizes up to 8192-bits and DSA sizes up to 3072-bits
JDK-8193950 Support for AES on SPARC
JDK-8222660 Support ISO 4217 "Current funds codes" table (A.2)
JDK-8227876 Support ISO 4217 Amendments 163 and 164
JDK-8194005 Support keystore type detection for JKS and PKCS12 keystores
JDK-8213925 Support TLS v1.2 algorithm in SunPKCS11 provider
JDK-8208731 SupportedDSAParamGen.java failed with timeout
JDK-8187178 suppress deprecation warnings in sun.rmi
JDK-8199949 Suppress not recognized property/feature warning messages from SAXParser
JDK-8175444 synchronizing handshaking hash.
JDK-8154358 SystemTap does not work when JDK is compiled with GCC 5
JDK-8180971 Tenuring threshold should be unsigned
JDK-8141329 Test fails with java.security.AccessControlException: access denied ("java.security.SecurityPermission" "getDomainCombiner")
JDK-8148582 Test java/nio/channels/ServerSocketChannel/AdaptServerSocket.java failed with SocketTimeoutException
JDK-8240045 Test native KDC, Java krb5 lib, and native krb5 lib in one test
JDK-8187200 Test PKCS8Test.java fails
JDK-8163056 Test SessionTimeOutTests can be timeout
JDK-8163060 Test SessionTimeOutTests fails intermittently
JDK-8200051 test tck.java.time.zone.TCKZoneRules is broken by tzdata2017c
JDK-8199988 Test test/sun/awt/image/bug8038000.java fails with ClassCastException
JDK-8213852 test/sun/misc/JarIndex/metaInfFilenames/Basic.java should use supported compiler interface
JDK-8163072 test/sun/security/provider/certpath/X509CertPath/IllegalCertiticates.java failing
JDK-8213874 test/sun/security/tools/jarsigner/concise_jarsigner.sh failing (cert expired?)
JDK-8155135 test/sun/tools/jinfo/Basic.sh fails on when runSA is set to true
JDK-8227879 TEST_BUG: sun/security/tools/jarsigner/ec.sh occasionally fail due to keytool error on sparc
JDK-8200036 TestCipher.java doesn't check one of the decrypted message as expected
JDK-8208736 TestFlushableGZIPOutputStream failing with IndexOutOfBoundsException
JDK-8200035 Tests for JCE crypto ciphers (part 1)
JDK-8240034 Tests for RFEs 4515853 and 4745056
JDK-8240033 Tests for sun.security.krb5.principal system property
JDK-8180957 tests/gc/arguments/Test(Serial|CMS|Parallel|G1)HeapSizeFlags jtreg tests invoke wrong class
JDK-8200039 Text in native popup is not always updated with Sogou IME
JDK-8162344 The API changes made by CR 7064075 need to be reverted
JDK-8180988 The new menu can't be shown on the menubar after clicking the "Add" button.
JDK-8193953 There are issues with shared data on windows
JDK-8240050 Tidy warnings cleanup for packages java.nio/java.io
JDK-8222655 TLS_EMPTY_RENEGOTIATION_INFO_SCSV is disabled after 8211883
JDK-8242873 To interpret case-insensitive string locale independently
JDK-8203754 tomcat gzip-compressed response bodies appear to be broken in update 151
JDK-8200054 tools/pack200/Pack200Test.java fails on Win32: Could not reserve enough space
JDK-8200015 Transport Layer Security (TLS) Session Hash and Extended Master Secret Extension
JDK-8199968 Turn on the -Wreturn-type warning
JDK-8213869 Two security tools tests do not run with only JRE
JDK-8240063 Typo in java.security: Sasl.createClient and Sasl.createServer
JDK-8227916 tzdata2018i integration causes test failures on jdk-13
JDK-8208737 Unable to use JDWP API in JDK 8 to debug JDK 9 VM
JDK-8219265 Unaligned memory access in Bits.c
JDK-8213866 Unexpected exceptions and timeouts in SF2 parser code
JDK-8240041 Unexpected NPE still possible on some Kerberos ticket calls
JDK-8200049 Unexpected timezone returned after parsing a date
JDK-8180966 Unrecognized VM option 'UseCountedLoopSafepoints'
JDK-8163054 Update CookieHttpsClientTest to use the newer framework.
JDK-8219510 Update copyright headers of files in src tree that are missing Classpath exception
JDK-8250690 Update GIFlib library to the 5.1.8
JDK-8250691 Update GIFlib library to the 5.2.1
JDK-8250726 Update GIFlib library to the latest up-to-date
JDK-8134162 Update jcheck for 6-open
JDK-8240040 Update KerberosTicket to describe behavior if it has been destroyed and fix NullPointerExceptions
JDK-8191840 Update localizations with positional arguments following JDK-8191137
JDK-8180963 Update OS detection code to recognize Windows Server 2016
JDK-8240015 Update RFC references in javadoc to RFC 5280
JDK-8068928 Update the protocol for references of docs.oracle.com to HTTPS.
JDK-8180962 Update use of GetVersionEx to get correct Windows version in hs_err files
JDK-8175412 Update XML Signature implementation to Apache Santuario 1.5.4
JDK-8213883 Upgrade JDK to libpng 1.6.35
JDK-8172633 Upgrade JDK to use LittleCMS 2.6
JDK-8193979 Upgrade JDK to use LittleCMS 2.7
JDK-8250692 Upgrade libpng to 1.6.37
JDK-8172634 Upgrade to LittleCMS 2.6 breaks AIX build
JDK-8203726 Use @code friendly idiom for '\' in javadoc
JDK-8213876 Use PKIXValidator in jarsigner
JDK-8200026 Use short name of SupportedEllipticCurvesExtension.java
JDK-8227909 Utility methods to check indexes and ranges doesn't specify behavior when function produces null
JDK-8227881 Various classes of sunec.jar are duplicated in rt.jar
JDK-8175458 Verifying ECDSA signatures permits trailing bytes
JDK-8175448 Warning cleanup for IMF classes
JDK-8232486 Warnings Cleanup in java.util.*
JDK-8232485 Warnings Cleanup: some i18n classes in java.util and sun.util
JDK-8175472 Warnings in java.util.concurrent.atomic package
JDK-8187168 Warnings in sun.instrument, tools and other sun.* classes
JDK-8187169 Warnings in sun.mangement.* and its subpackages
JDK-8208732 When determining the ciphersuite lists there is no debug output for disabled suites.
JDK-8181004 White flashing when opening Dialogs and Menus using Nimbus with dark background
JDK-8187175 Windows build failed after JDK-8030787
JDK-8200053 With JDK 1.7 text field does not obtain focus when using mnemonic Alt/Key combin
JDK-8227875 X25519/X448 code improvements
JDK-8175436 XML DSig API allows wrong tag names and extra elements in SignedInfo
JDK-8175440 XML Signature performance issue caused by unbuffered signature data
JDK-8175438 XMLSignature throws StringIndexOutOfBoundsException if ID attribute value is empty String
JDK-8199953 XSOM parser incorrectly processes type names with whitespaces
JDK-8199970 Zero build requires disabled warnings
JDK-8199972 Zero debug build fails on "assert(labs(istate->_stack_base - istate->_stack_limit) == (istate->_method->max_stack() + extra_stack_entries + 1)) failed: bad stack limit"
JDK-8155130 Zero: Better byte behaviour

Andrew Brygin, Azul

Bug Summary
JDK-8271031 Add capability to custom resolve host/domain names within the default JNDI LDAP provider
JDK-8280249 AIOB in XMLEntityScanner.scanLiteral upon parsing literals with > 100 LF chars
JDK-8255507 C2: range check elimination may allow illegal out of bound access
JDK-8273320 com.sun.net.HttpsServer spins on TLS session close
JDK-8271042 com/sun/jndi/ldap/LdapTimeoutTest.java failed due to timeout on DeadServerNoTimeoutTest is incorrect
JDK-8256139 Crash in MinINode::Ideal(PhaseGVN*, bool)
JDK-8265143 Disable TLS 1.0 and 1.1
JDK-8263373 Disable weak named curves by default in TLS, CertPath, and Signed JAR
JDK-8275612 InnerClasses: VM permits wrong inner_class_info_index value of zero
JDK-8263371 Remove dependency on EC classes from pkcs11 provider
JDK-8273536 Strange behavior of URLConnection with proxy
JDK-8275629 Unable to read certain PKCS12 keystores from SequenceInputStream
JDK-8255506 Undefined behaviour in HotSpot
JDK-8275635 Update the default enabled cipher suites preference

Dmitry Cherepanov, Azul

Bug Summary
JDK-8279054 (tz) Update Timezone Data to 2021c
JDK-8279135 (tz) Update Timezone Data to 2021e
JDK-8258474 (tz) Upgrade time-zone data to tzdata2020b
JDK-8258475 (tz) Upgrade time-zone data to tzdata2020c
JDK-8258476 (tz) Upgrade time-zone data to tzdata2020d
JDK-8263383 (tz) Upgrade time-zone data to tzdata2020f
JDK-8264794 (tz) Upgrade time-zone data to tzdata2021a
JDK-8240621 Build failure on Windows after JDK-8044500
JDK-8279055 TestZoneInfo310.java fails with tzdata2021b
JDK-8279136 TestZoneInfo310.java fails with tzdata2021e
JDK-8279056 TimeZoneTest.java fails with tzdata2021b
JDK-8279137 Update TimeZoneNames files to follow the changes made by JDK-8275766

Goetz Lindenmaier, SAP

Bug Summary
JDK-8175163 [bsd] Fix build after "8005629: javac warnings compiling java.awt.EventDispatchThread..."
JDK-8175087 [bsd] Fix build after "8024900: PPC64: Enable new build on AIX (jdk part)"
JDK-8161370 Fix jdk build with gcc 4.1.2: -fno-strict-overflow not known.
JDK-8175530 PPC64 (part 215): opto: Extend ImplicitNullCheck optimization.

Martin Balao, Red Hat

Bug Summary
JDK-8221855 Add new jtreg keywords to jdk 8
JDK-8221873 AWT hang occurs when sequenced events arrive out of sequence in multiple AppContexts.
JDK-8221856 Define "headful" jtreg keyword
JDK-8224153 Exception in thread "AWT-EventQueue-1" java.lang.IllegalArgumentException: null source
JDK-8233331 OpenJDK7 returns incorrect TrueType font metrics
JDK-8226318 Placeholder for Class Loader improvements

Omair Majid, Red Hat

Bug Summary
JDK-8149703 setWMClass fails to null-terminate WM_CLASS string