PUSHES REPORT: openjdk8u222

This report shows who pushed the backports to the given release. This usually shows who did the backporting, testing, and review work.

Report generated: Fri Sep 01 21:09:39 CEST 2023

Distribution by priority

Count Priority
1 P1
23 P2
80 P3
49 P4
1 P5

Distribution by components

Count Component
154 100% Total
47 30.5% core-libs
19 12.3% core-libs/java.util:i18n
7 4.5% core-libs/java.nio
6 3.9% core-libs/java.net
6 3.9% core-libs/java.time
3 1.9% core-libs/java.util.stream
3 1.9% core-libs/java.util
1 0.6% core-libs
1 0.6% core-libs/java.nio.charsets
1 0.6% core-libs/java.lang.invoke
34 22.1% client-libs
11 7.1% client-libs/javax.swing
9 5.8% client-libs/2d
8 5.2% client-libs/java.awt
2 1.3% client-libs
2 1.3% client-libs/javax.imageio
1 0.6% client-libs/java.awt:i18n
1 0.6% client-libs/javax.accessibility
32 20.8% security-libs
21 13.6% security-libs/java.security
7 4.5% security-libs/javax.crypto
3 1.9% security-libs/javax.net.ssl
1 0.6% security-libs
26 16.9% hotspot
9 5.8% hotspot/compiler
9 5.8% hotspot/runtime
5 3.2% hotspot/gc
2 1.3% hotspot/svc
1 0.6% hotspot/svc-agent
11 7.1% infrastructure
11 7.1% infrastructure/build
2 1.3% tools
1 0.6% tools/javac
1 0.6% tools/launcher
2 1.3% xml
1 0.6% xml/jaxp
1 0.6% xml/javax.xml.transform

Distribution by affiliation

This Release Pushes

Original Pushes

Count Committer
152 100% Total
152 100.0% Unknown
57 37.5% andrew
33 21.7% shade
23 15.1% clanger
14 9.2% phh
7 4.6% sgehwolf
4 2.6% gromero
3 2.0% adinn
3 2.0% neugens
2 1.3% dcherepanov
2 1.3% rkennke
1 0.7% zgu
1 0.7% kevinw
1 0.7% ysuenaga
1 0.7% aph
Count Committer
152 100% Total
152 100.0% Unknown
14 9.2% rhalade
10 6.6% pbansal
8 5.3% psandoz
6 3.9% naoto
6 3.9% prr
6 3.9% fyuan
5 3.3% apetcher
5 3.3% N/A
4 2.6% mdoerr
4 2.6% andrew
4 2.6% nishjain
4 2.6% serb
4 2.6% alanb
4 2.6% bpb
3 2.0% aivanov
3 2.0% chegar
3 2.0% phh
2 1.3% psadhukhan
2 1.3% shade
2 1.3% rpatil
2 1.3% joehw
2 1.3% kevinw
2 1.3% sgehwolf
2 1.3% clanger
2 1.3% ssadetsky
2 1.3% darcy
2 1.3% asmotrak
2 1.3% xuelei
2 1.3% erikj
1 0.7% ihse
1 0.7% ctornqvi
1 0.7% michaelm
1 0.7% jlahoda
1 0.7% peytoia
1 0.7% aghaisas
1 0.7% valeriep
1 0.7% jgeorge
1 0.7% thartmann
1 0.7% amlu
1 0.7% aph
1 0.7% okutsu
1 0.7% dmarkov
1 0.7% mr
1 0.7% sla
1 0.7% mli
1 0.7% xiaofeya
1 0.7% jbachorik
1 0.7% aeriksso
1 0.7% stefank
1 0.7% rraghavan
1 0.7% mhalder
1 0.7% jmasa
1 0.7% bobv
1 0.7% jcm
1 0.7% vinnie
1 0.7% kaddepalli
1 0.7% sveerabhadra
1 0.7% iignatyev
1 0.7% kvn
1 0.7% dholmes
1 0.7% mgerdin
1 0.7% simonis
1 0.7% mullan
1 0.7% jdv

Chronological push log:

Days Ago This Release Push By Original Push By Bug Summary
Name Affiliation Name Affiliation
1495 andrew Unknown andrew Unknown JDK-8228723 Backport of JDK-8199552 to OpenJDK 8 leads to duplicate -fstack-protector flags, overriding --with-extra-cflags
1507 andrew Unknown rpatil Unknown JDK-8227806 tzdata2018i integration causes test failures on jdk-13
1507 andrew Unknown N/A Unknown JDK-8227805 (tz) Upgrade Timezone Data to tzdata2018i
1507 andrew Unknown rpatil Unknown JDK-8227804 (tz) Upgrade Timezone Data to tzdata2019a
1507 andrew Unknown okutsu Unknown JDK-8227803 After Integrating tzdata2016d the test/sun/util/calendar/zi/TestZoneInfo310.java fails for "Asia/Oral" and "Asia/Qyzylorda" Timezones
1507 andrew Unknown psandoz Unknown JDK-8227800 Move Objects.checkIndex BiFunction accepting methods to an internal package
1507 andrew Unknown psandoz Unknown JDK-8227799 Improve exception reporting for Objects.checkIndex/checkFromToIndex/checkFromIndexSize
1507 andrew Unknown psandoz Unknown JDK-8227798 Utility methods to check indexes and ranges doesn't specify behavior when function produces null
1507 andrew Unknown psandoz Unknown JDK-8227797 Add utility methods to check indexes and ranges
1507 andrew Unknown valeriep Unknown JDK-8227796 Crypto AES/ECB encryption/decryption performance regression (introduced in jdk9b73)
1507 andrew Unknown jdv Unknown JDK-8227794 JpegImageReader throws IndexOutOfBoundsException when trying to read image data from tables-only image
1518 andrew Unknown N/A Unknown JDK-8227345 Localized names for Japanese Era Reiwa in COMPAT provider
1525 andrew Unknown nishjain Unknown JDK-8226987 Upgrade IANA LSR data
1525 andrew Unknown nishjain Unknown JDK-8226986 Update IANA Language Subtag Registry to Version 2018-10-31
1525 andrew Unknown nishjain Unknown JDK-8226985 Upgrading JDK with latest available LSR data from IANA.
1525 andrew Unknown nishjain Unknown JDK-8226983 Upgrading JDK with latest available LSR data from IANA.
1525 andrew Unknown fyuan Unknown JDK-8226982 localized currency symbol of VES
1525 andrew Unknown fyuan Unknown JDK-8226981 ISO 4217 Amendment #169 Update
1525 andrew Unknown fyuan Unknown JDK-8226980 ISO 4217 Amendment #168 Update
1525 andrew Unknown fyuan Unknown JDK-8226979 ISO 4217 Amendment #167 Update
1525 andrew Unknown fyuan Unknown JDK-8226978 ISO 4217 Amendment #166 Update
1525 andrew Unknown fyuan Unknown JDK-8226977 ISO 4217 Amendment #165 Update
1525 andrew Unknown nishjain Unknown JDK-8226961 Remove hard-coded IANA Subtag Registry map in LocaleEquivalentMap.java
1525 andrew Unknown apetcher Unknown JDK-8226960 Improved ECC Implementation
1526 andrew Unknown peytoia Unknown JDK-8226920 Update LSR datafile for BCP 47
1527 andrew Unknown vinnie Unknown JDK-8226858 SunEC throws ProviderException on invalid curves
1527 andrew Unknown apetcher Unknown JDK-8226857 ECC Field Arithmetic Enhancements
1528 andrew Unknown apetcher Unknown JDK-8226819 X25519/X448 code improvements
1528 andrew Unknown apetcher Unknown JDK-8226818 Branch-free output conversion for X25519 and X448
1528 neugens Unknown mli Unknown JDK-8226805 sun/text/resources/LocaleDataTest.java fails with java.lang.Exception
1528 neugens Unknown naoto Unknown JDK-8226804 Support ISO 4217 Amendments 163 and 164
1532 andrew Unknown apetcher Unknown JDK-8226633 Efficient and constant-time modular arithmetic
1535 aph Unknown aph Unknown JDK-8226405 G1 GC: Undefined behaviour in G1BlockOffsetTablePart::block_at_or_preceding
1536 andrew Unknown aivanov Unknown JDK-8226301 lookupPrintServices() does not always update the list of Windows remote printers
1536 andrew Unknown aivanov Unknown JDK-8226300 [TEST_BUG] RemotePrinterStatusRefresh test is hard to use
1536 andrew Unknown sveerabhadra Unknown JDK-8226299 [Windows] Exception if no printers are installed.
1536 andrew Unknown aghaisas Unknown JDK-8226298 Windows remote printer changes do not reflect in lookupPrintServices()
1549 andrew Unknown psadhukhan Unknown JDK-8225336 In ImageIO.write() and ImageIO.read() null stream is not handled properly.
1549 andrew Unknown prr Unknown JDK-8225334 Fonts with embedded bitmaps are not always rotated
1549 andrew Unknown joehw Unknown JDK-8225333 Update Xalan Java to 2.7.2
1549 andrew Unknown kvn Unknown JDK-8225332 testlibrary_tests/ctw/ClassesListTest.java fails with Agent timeout frequently
1549 andrew Unknown prr Unknown JDK-8225331 Remove references in xwindows.md to non-existent files.
1549 andrew Unknown psandoz Unknown JDK-8225328 Stream.flatMap() causes breaking of short-circuiting of terminal operations
1549 andrew Unknown thartmann Unknown JDK-8225327 pathological case of JIT recompilation and code cache bloat
1549 andrew Unknown iignatyev Unknown JDK-8225316 JEP-JDK-8043304: Test task: Tiered Compilation level transition tests
1550 neugens Unknown psadhukhan Unknown JDK-8225244 InputMethod cannot be used after its restarting
1550 dcherepanov Unknown serb Unknown JDK-8225228 Update GIFlib library to the 5.1.8
1550 gromero Unknown mdoerr Unknown JDK-8225205 PPC64: Improve VSR support to use up to 64 registers
1551 phh Unknown phh Unknown JDK-8225065 Revert 8221166 (8u backport of 8048782)
1551 andrew Unknown pbansal Unknown JDK-8225185 All TrayIcon MessageType icons does not show up with gtk3 option set
1551 andrew Unknown prr Unknown JDK-8225183 Rename UnixPrintServiceLookup and Win32PrintServiceLookup as a platform neutral class name
1555 zgu Unknown michaelm Unknown JDK-8225050 java/net/Socket/asyncClose/Race.java failed intermittently on Windows with ConnectException: Connection refused
1555 adinn Unknown jgeorge Unknown JDK-8225043 SA: Attach/detach might fail on Linux if debugee application create/destroy threads during attaching
1555 adinn Unknown bpb Unknown JDK-8225042 (fs) java/nio/file/FileStore/Basic.java should conditionally check FileStores
1555 adinn Unknown bpb Unknown JDK-8225041 (fs) java/nio/file/FileSystem/Basic.java should conditionally check FileStores
1556 phh Unknown xuelei Unknown JDK-8224769 Update the default SSL session cache size to 20480
1557 shade Unknown rraghavan Unknown JDK-8224921 Unsafe write after primitive array creation may result in array length change
1557 rkennke Unknown serb Unknown JDK-8224906 [TEST_BUG][macosx] closed/java/awt/BasicStroke/DashZeroWidth.java not on EDT
1557 rkennke Unknown prr Unknown JDK-8224894 Fix version number in mesa.md 3rd party legal file
1557 clanger Unknown clanger Unknown JDK-8224860 Problem list test security/infra/java/security/cert/CertPathValidator/certification/ActalisCA.java
1557 clanger Unknown rhalade Unknown JDK-8224859 Test ComodoCA.java fails
1558 sgehwolf Unknown amlu Unknown JDK-8224842 java/net/ipv6tests/UdpTest.java fails intermittently with "checkTime failed: got 1998 expected 4000"
1558 sgehwolf Unknown darcy Unknown JDK-8224841 Mark UdpTest.java as intermittently failing
1558 gromero Unknown mdoerr Unknown JDK-8224799 PPC64: implement intrinsic code with vector instructions for Unsafe.copyMemory()
1563 shade Unknown psandoz Unknown JDK-8224620 Parallel stream execution within a custom ForkJoinPool should obey the parallelism
1564 clanger Unknown rhalade Unknown JDK-8224379 Remove two DocuSign root certificates that are expiring
1565 gromero Unknown mdoerr Unknown JDK-8224245 PPC64: improve byte, int and long array copy stubs by using VSX instructions
1565 phh Unknown phh Unknown JDK-8223883 Fix jni.cpp copyright date after 8223528
1565 sgehwolf Unknown N/A Unknown JDK-8224198 SessionId.hashCode generates too many collisions
1568 andrew Unknown jlahoda Unknown JDK-8224146 [javac] fails and exits with no error if a bad annotation processor provided
1568 andrew Unknown chegar Unknown JDK-8224144 SOCKS proxying does not work with IPv6 connections
1568 andrew Unknown psandoz Unknown JDK-8224143 Parallel unordered Stream.limit() tries to collect 128 elements even if limit is less
1568 andrew Unknown naoto Unknown JDK-8224142 java/time/test/java/time/format/TestNonIsoFormatter.java failed in non-english locales.
1568 andrew Unknown dholmes Unknown JDK-8224141 Implement os::set_native_thread_name() on Solaris
1568 andrew Unknown sla Unknown JDK-8224140 RFE: os::set_native_thread_name() cleanups
1568 clanger Unknown rhalade Unknown JDK-8224102 Remove two Comodo root CA certificates that are expiring
1568 clanger Unknown prr Unknown JDK-8224104 Remove src/java.desktop/unix/classes/sun/awt/X11/keysym2ucs.h
1568 ysuenaga Unknown jbachorik Unknown JDK-8224097 HSDB could not terminate when close button is pushed.
1570 sgehwolf Unknown sgehwolf Unknown JDK-8223950 [x86] sharedRuntimeTrig/sharedRuntimeTrans compiled without optimization
1571 clanger Unknown clanger Unknown JDK-8223851 Cleanups in cacerts tests
1571 clanger Unknown rhalade Unknown JDK-8223850 Remove T-Systems root CA certificate
1571 clanger Unknown N/A Unknown JDK-8223849 Add GlobalSign's R6 Root certificate
1571 clanger Unknown mullan Unknown JDK-8223848 Remove GTE CyberTrust Global Root
1571 clanger Unknown rhalade Unknown JDK-8223847 Add additional TeliaSonera root certificate
1571 clanger Unknown rhalade Unknown JDK-8223846 Add Google Trust Services GlobalSign root certificates
1571 clanger Unknown rhalade Unknown JDK-8223845 Add T-Systems, GlobalSign and Starfield services root certificates
1571 clanger Unknown rhalade Unknown JDK-8223844 Add Entrust root certificates
1571 clanger Unknown rhalade Unknown JDK-8223843 Restore Symantec root verisignclass2g2ca
1571 clanger Unknown rhalade Unknown JDK-8223842 Add GoDaddy root certificates
1571 clanger Unknown rhalade Unknown JDK-8223841 Remove several Symantec Root CAs
1571 clanger Unknown rhalade Unknown JDK-8223840 Remove Baltimore Cybertrust Code Signing CA
1571 clanger Unknown rhalade Unknown JDK-8223839 Remove SECOM root (secomevrootca1)
1571 clanger Unknown rhalade Unknown JDK-8223838 Open-source the Oracle JDK Root Certificates
1575 phh Unknown phh Unknown JDK-8223664 Add jtreg tests for 8223528, backport to jdk8u of 8176100
1575 andrew Unknown andrew Unknown JDK-8222975 Fix 'release' file to reflect actual repo checkin used to compile JDK
1576 phh Unknown kaddepalli Unknown JDK-8223659 HTML Tooltip with "img src=" on component doesn't show
1578 phh Unknown mgerdin Unknown JDK-8223528 [REDO][REDO] G1 Needs pre barrier on dereference of weak JNI handles
1578 shade Unknown aeriksso Unknown JDK-8223526 test/serviceability/dcmd/gc/HeapDumpTest fails to verify the dump
1578 shade Unknown shade Unknown JDK-8223525 Proper units should print more significant digits
1578 sgehwolf Unknown sgehwolf Unknown JDK-8223462 [linux] Poor StrictMath performance due to non-optimized compilation
1584 shade Unknown stefank Unknown JDK-8223191 Remove duplicate AlwaysTrueClosures
1585 phh Unknown simonis Unknown JDK-8223102 [test] Fix jdk/tools/launcher/RunpathTest to handle both, RPATH and RUNPATH
1586 dcherepanov Unknown serb Unknown JDK-8223073 [macos] Appkit thread slows when any Window Manager active
1589 andrew Unknown andrew Unknown JDK-8223035 Fix 'release' file to reflect actual repo checkin used to compile JDK
1589 andrew Unknown andrew Unknown JDK-8222965 Backport of JDK-8129988 broke the build
1591 gromero Unknown mdoerr Unknown JDK-8222931 PPC64: improve array copy stubs by using vector instructions
1591 phh Unknown xuelei Unknown JDK-8222927 JSSE should create a single instance of the cacerts KeyStore
1599 phh Unknown psandoz Unknown JDK-8222549 MethodHandleProxies.asInterfaceInstance does not support default methods
1600 phh Unknown jmasa Unknown JDK-8222494 ParNew: Prune nmethods scavengable list
1600 sgehwolf Unknown ctornqvi Unknown JDK-8222479 [TESTBUG] runtime/NMT/NMTWithCDS.java fails with product builds due to missing UnlockDiagnosticVMOptions
1600 shade Unknown pbansal Unknown JDK-8222470 The fix done for JDK-8214253 have caused issues in JTree behaviour
1605 phh Unknown prr Unknown JDK-8222291 Fix for 8171000 breaks Solaris + Linux builds
1605 sgehwolf Unknown N/A Unknown JDK-8222285 Performance regression after JDK-8155635 backport into 8u
1606 andrew Unknown naoto Unknown JDK-8222220 Replace the placeholder Japanese era name
1607 andrew Unknown naoto Unknown JDK-8222088 Calendar.getDisplayName() returns empty string for new Japanese Era on some locales
1611 kevinw Unknown kevinw Unknown JDK-8221789 make reconfigure broken (jdk8u only)
1611 andrew Unknown naoto Unknown JDK-8221966 Cannot parse JapaneseDate string with DateTimeFormatterBuilder Mapped-values
1611 andrew Unknown naoto Unknown JDK-8221965 DateTimeFormatterBuilder Mapped-values do not work for JapaneseDate
1611 andrew Unknown xiaofeya Unknown JDK-8221964 Move java/util/Calendar/CalendarTestScripts tests into OpenJDK
1614 clanger Unknown andrew Unknown JDK-8221747 [TESTBUG] New test KdcPolicy.java introduced by JDK-8164656 needs same change as JDK-8190690
1614 clanger Unknown erikj Unknown JDK-8221746 System property java.vm.vendor value includes quotation marks
1614 clanger Unknown erikj Unknown JDK-8221745 COMPANY_NAME, IMPLEMENTOR, BUNDLE_VENDOR, VENDOR, but no configure flag
1614 clanger Unknown mr Unknown JDK-8221744 Cannot set COMPANY_NAME when configuring a build
1616 andrew Unknown mhalder Unknown JDK-8221715 Robot.createScreenCapture() crashes in wayland mode
1618 phh Unknown joehw Unknown JDK-8221617 SAXException: Invalid UTF-16 surrogate detected: d83c ?
1620 shade Unknown bobv Unknown JDK-8221459 [TESTBUG] runtime/containers/docker/TestCPUAwareness.java fails in docker not supporting --cpus
1624 phh Unknown ihse Unknown JDK-8221338 FONTCONFIG_CFLAGS missing from spec.gmk.in
1624 shade Unknown chegar Unknown JDK-8221293 Intermittent test failure java/net/Socket/asyncClose/AsyncClose.java
1624 shade Unknown alanb Unknown JDK-8221292 TEST_BUG: java/nio/channels/AsynchronousChannelGroup/Basic.java fails intermittently
1624 shade Unknown alanb Unknown JDK-8221291 TEST_BUG: java/nio/channels/Selector/ChangingInterests.java failed once
1624 shade Unknown alanb Unknown JDK-8221290 TEST_BUG: sun/nio/cs/MalformedSurrogates.java fails intermittently
1624 shade Unknown alanb Unknown JDK-8221289 TEST_BUG java/nio/Buffer/Chars.java fails intermittently
1624 shade Unknown chegar Unknown JDK-8221288 TEST_BUG: java/net/ipv6tests/UdpTest.java failed because of SocketTimeoutException
1624 shade Unknown aivanov Unknown JDK-8221287 Automate DashOffset test
1624 shade Unknown asmotrak Unknown JDK-8221286 Remove intermittent key from sun/security/rsa/SpecTest.java
1624 shade Unknown asmotrak Unknown JDK-8221285 sun/security/rsa/SpecTest.java timeout with Agent error: java.lang.Exception
1624 shade Unknown darcy Unknown JDK-8221284 Mark SpecTest.java as intermittently failing
1624 shade Unknown bpb Unknown JDK-8221283 java/nio/file/FileStore/Basic.java failed with "java.nio.file.AccessDeniedException : /zones/zoneone/root "
1624 shade Unknown bpb Unknown JDK-8221282 java/nio/file/FileStore/Basic.java sensitive to NFS configuration
1624 shade Unknown shade Unknown JDK-8221281 Missing ResourceMark in nmethod::metadata_do
1625 shade Unknown pbansal Unknown JDK-8221238 The whole text in target JPasswordField image are not selected.
1625 shade Unknown pbansal Unknown JDK-8221237 There is no icon in all JOptionPane target image
1625 shade Unknown dmarkov Unknown JDK-8221236 XToolkit is not correctly displayed color on 16-bit high color setting
1625 shade Unknown pbansal Unknown JDK-8221235 Expanded & Collapsed nodes of a JTree look the same on GTK3
1625 shade Unknown pbansal Unknown JDK-8221234 Tooltip is transparent rather than having a black background
1625 shade Unknown pbansal Unknown JDK-8221233 Swing applications with JRadioButton and JCheckbox fail to render correctly when using GTK3 and the GTK L&F
1625 shade Unknown pbansal Unknown JDK-8221232 JProgressBar display issue with GTKLookAndFeel
1625 shade Unknown pbansal Unknown JDK-8221231 JScrollBar display issue with GTKLookAndFeel
1625 shade Unknown pbansal Unknown JDK-8221230 JSlider display issue with slider for GTKLookAndFeel
1625 shade Unknown ssadetsky Unknown JDK-8221229 JOptionPane display issue with GTKLookAndFeel
1625 shade Unknown kevinw Unknown JDK-8221227 Problematic sparc intrinsic: com.sun.crypto.provider.CipherBlockChaining
1625 shade Unknown jcm Unknown JDK-8221226 assert(false) failed: Non-balanced monitor enter/exit! Likely JNI locking
1626 phh Unknown serb Unknown JDK-8221166 OpenJDK: PiscesCache : xmax/ymax rounding up can cause RasterFormatException
1626 shade Unknown ssadetsky Unknown JDK-8221156 JTextPane display issue with GTKLookAndFeel

No changesets log

JDK-8261124 Fix debug build after 8062808: Turn on the -Wreturn-type warning
JDK-8230979 [ppc64] Increase code size for interpreter generation.
JDK-8224756 [TESTBUG] sun/security/lib/cacerts/VerifyCACerts.java fails due to cert within 90-day expiry window
JDK-8224492 Add temporary exceptions for root certs that are due to expire soon

Committer push log

adinn, Unknown

Bug Summary
JDK-8225042 (fs) java/nio/file/FileStore/Basic.java should conditionally check FileStores
JDK-8225041 (fs) java/nio/file/FileSystem/Basic.java should conditionally check FileStores
JDK-8225043 SA: Attach/detach might fail on Linux if debugee application create/destroy threads during attaching

andrew, Unknown

Bug Summary
JDK-8227805 (tz) Upgrade Timezone Data to tzdata2018i
JDK-8227804 (tz) Upgrade Timezone Data to tzdata2019a
JDK-8224146 [javac] fails and exits with no error if a bad annotation processor provided
JDK-8226300 [TEST_BUG] RemotePrinterStatusRefresh test is hard to use
JDK-8226299 [Windows] Exception if no printers are installed.
JDK-8227797 Add utility methods to check indexes and ranges
JDK-8227803 After Integrating tzdata2016d the test/sun/util/calendar/zi/TestZoneInfo310.java fails for "Asia/Oral" and "Asia/Qyzylorda" Timezones
JDK-8225185 All TrayIcon MessageType icons does not show up with gtk3 option set
JDK-8222965 Backport of JDK-8129988 broke the build
JDK-8228723 Backport of JDK-8199552 to OpenJDK 8 leads to duplicate -fstack-protector flags, overriding --with-extra-cflags
JDK-8226818 Branch-free output conversion for X25519 and X448
JDK-8222088 Calendar.getDisplayName() returns empty string for new Japanese Era on some locales
JDK-8221966 Cannot parse JapaneseDate string with DateTimeFormatterBuilder Mapped-values
JDK-8227796 Crypto AES/ECB encryption/decryption performance regression (introduced in jdk9b73)
JDK-8221965 DateTimeFormatterBuilder Mapped-values do not work for JapaneseDate
JDK-8226857 ECC Field Arithmetic Enhancements
JDK-8226633 Efficient and constant-time modular arithmetic
JDK-8223035 Fix 'release' file to reflect actual repo checkin used to compile JDK
JDK-8225334 Fonts with embedded bitmaps are not always rotated
JDK-8224141 Implement os::set_native_thread_name() on Solaris
JDK-8227799 Improve exception reporting for Objects.checkIndex/checkFromToIndex/checkFromIndexSize
JDK-8226960 Improved ECC Implementation
JDK-8225336 In ImageIO.write() and ImageIO.read() null stream is not handled properly.
JDK-8226977 ISO 4217 Amendment #165 Update
JDK-8226978 ISO 4217 Amendment #166 Update
JDK-8226979 ISO 4217 Amendment #167 Update
JDK-8226980 ISO 4217 Amendment #168 Update
JDK-8226981 ISO 4217 Amendment #169 Update
JDK-8224142 java/time/test/java/time/format/TestNonIsoFormatter.java failed in non-english locales.
JDK-8225316 JEP-JDK-8043304: Test task: Tiered Compilation level transition tests
JDK-8227794 JpegImageReader throws IndexOutOfBoundsException when trying to read image data from tables-only image
JDK-8226982 localized currency symbol of VES
JDK-8227345 Localized names for Japanese Era Reiwa in COMPAT provider
JDK-8226301 lookupPrintServices() does not always update the list of Windows remote printers
JDK-8221964 Move java/util/Calendar/CalendarTestScripts tests into OpenJDK
JDK-8227800 Move Objects.checkIndex BiFunction accepting methods to an internal package
JDK-8224143 Parallel unordered Stream.limit() tries to collect 128 elements even if limit is less
JDK-8225327 pathological case of JIT recompilation and code cache bloat
JDK-8226961 Remove hard-coded IANA Subtag Registry map in LocaleEquivalentMap.java
JDK-8225331 Remove references in xwindows.md to non-existent files.
JDK-8225183 Rename UnixPrintServiceLookup and Win32PrintServiceLookup as a platform neutral class name
JDK-8222220 Replace the placeholder Japanese era name
JDK-8224140 RFE: os::set_native_thread_name() cleanups
JDK-8221715 Robot.createScreenCapture() crashes in wayland mode
JDK-8224144 SOCKS proxying does not work with IPv6 connections
JDK-8225328 Stream.flatMap() causes breaking of short-circuiting of terminal operations
JDK-8226858 SunEC throws ProviderException on invalid curves
JDK-8225332 testlibrary_tests/ctw/ClassesListTest.java fails with Agent timeout frequently
JDK-8227806 tzdata2018i integration causes test failures on jdk-13
JDK-8226986 Update IANA Language Subtag Registry to Version 2018-10-31
JDK-8226920 Update LSR datafile for BCP 47
JDK-8225333 Update Xalan Java to 2.7.2
JDK-8226987 Upgrade IANA LSR data
JDK-8226985 Upgrading JDK with latest available LSR data from IANA.
JDK-8227798 Utility methods to check indexes and ranges doesn't specify behavior when function produces null
JDK-8226298 Windows remote printer changes do not reflect in lookupPrintServices()
JDK-8226819 X25519/X448 code improvements

aph, Unknown

Bug Summary
JDK-8226405 G1 GC: Undefined behaviour in G1BlockOffsetTablePart::block_at_or_preceding

clanger, Unknown

Bug Summary
JDK-8221747 [TESTBUG] New test KdcPolicy.java introduced by JDK-8164656 needs same change as JDK-8190690
JDK-8223847 Add additional TeliaSonera root certificate
JDK-8223844 Add Entrust root certificates
JDK-8223849 Add GlobalSign's R6 Root certificate
JDK-8223842 Add GoDaddy root certificates
JDK-8223846 Add Google Trust Services GlobalSign root certificates
JDK-8223845 Add T-Systems, GlobalSign and Starfield services root certificates
JDK-8221744 Cannot set COMPANY_NAME when configuring a build
JDK-8223851 Cleanups in cacerts tests
JDK-8221745 COMPANY_NAME, IMPLEMENTOR, BUNDLE_VENDOR, VENDOR, but no configure flag
JDK-8223838 Open-source the Oracle JDK Root Certificates
JDK-8224860 Problem list test security/infra/java/security/cert/CertPathValidator/certification/ActalisCA.java
JDK-8223840 Remove Baltimore Cybertrust Code Signing CA
JDK-8223848 Remove GTE CyberTrust Global Root
JDK-8223839 Remove SECOM root (secomevrootca1)
JDK-8223841 Remove several Symantec Root CAs
JDK-8224104 Remove src/java.desktop/unix/classes/sun/awt/X11/keysym2ucs.h
JDK-8223850 Remove T-Systems root CA certificate
JDK-8224102 Remove two Comodo root CA certificates that are expiring
JDK-8224379 Remove two DocuSign root certificates that are expiring
JDK-8223843 Restore Symantec root verisignclass2g2ca
JDK-8221746 System property java.vm.vendor value includes quotation marks
JDK-8224859 Test ComodoCA.java fails

dcherepanov, Unknown

Bug Summary
JDK-8223073 [macos] Appkit thread slows when any Window Manager active
JDK-8225228 Update GIFlib library to the 5.1.8

gromero, Unknown

Bug Summary
JDK-8224799 PPC64: implement intrinsic code with vector instructions for Unsafe.copyMemory()
JDK-8222931 PPC64: improve array copy stubs by using vector instructions
JDK-8224245 PPC64: improve byte, int and long array copy stubs by using VSX instructions
JDK-8225205 PPC64: Improve VSR support to use up to 64 registers

kevinw, Unknown

Bug Summary
JDK-8221789 make reconfigure broken (jdk8u only)

neugens, Unknown

Bug Summary
JDK-8225244 InputMethod cannot be used after its restarting
JDK-8226805 sun/text/resources/LocaleDataTest.java fails with java.lang.Exception
JDK-8226804 Support ISO 4217 Amendments 163 and 164

phh, Unknown

Bug Summary
JDK-8223528 [REDO][REDO] G1 Needs pre barrier on dereference of weak JNI handles
JDK-8223102 [test] Fix jdk/tools/launcher/RunpathTest to handle both, RPATH and RUNPATH
JDK-8223664 Add jtreg tests for 8223528, backport to jdk8u of 8176100
JDK-8222291 Fix for 8171000 breaks Solaris + Linux builds
JDK-8223883 Fix jni.cpp copyright date after 8223528
JDK-8221338 FONTCONFIG_CFLAGS missing from spec.gmk.in
JDK-8223659 HTML Tooltip with "img src=" on component doesn't show
JDK-8222927 JSSE should create a single instance of the cacerts KeyStore
JDK-8222549 MethodHandleProxies.asInterfaceInstance does not support default methods
JDK-8221166 OpenJDK: PiscesCache : xmax/ymax rounding up can cause RasterFormatException
JDK-8222494 ParNew: Prune nmethods scavengable list
JDK-8225065 Revert 8221166 (8u backport of 8048782)
JDK-8221617 SAXException: Invalid UTF-16 surrogate detected: d83c ?
JDK-8224769 Update the default SSL session cache size to 20480

rkennke, Unknown

Bug Summary
JDK-8224906 [TEST_BUG][macosx] closed/java/awt/BasicStroke/DashZeroWidth.java not on EDT
JDK-8224894 Fix version number in mesa.md 3rd party legal file

sgehwolf, Unknown

Bug Summary
JDK-8223462 [linux] Poor StrictMath performance due to non-optimized compilation
JDK-8222479 [TESTBUG] runtime/NMT/NMTWithCDS.java fails with product builds due to missing UnlockDiagnosticVMOptions
JDK-8223950 [x86] sharedRuntimeTrig/sharedRuntimeTrans compiled without optimization
JDK-8224842 java/net/ipv6tests/UdpTest.java fails intermittently with "checkTime failed: got 1998 expected 4000"
JDK-8224841 Mark UdpTest.java as intermittently failing
JDK-8222285 Performance regression after JDK-8155635 backport into 8u
JDK-8224198 SessionId.hashCode generates too many collisions

shade, Unknown

Bug Summary
JDK-8221459 [TESTBUG] runtime/containers/docker/TestCPUAwareness.java fails in docker not supporting --cpus
JDK-8221226 assert(false) failed: Non-balanced monitor enter/exit! Likely JNI locking
JDK-8221287 Automate DashOffset test
JDK-8221235 Expanded & Collapsed nodes of a JTree look the same on GTK3
JDK-8221293 Intermittent test failure java/net/Socket/asyncClose/AsyncClose.java
JDK-8221283 java/nio/file/FileStore/Basic.java failed with "java.nio.file.AccessDeniedException : /zones/zoneone/root "
JDK-8221282 java/nio/file/FileStore/Basic.java sensitive to NFS configuration
JDK-8221229 JOptionPane display issue with GTKLookAndFeel
JDK-8221232 JProgressBar display issue with GTKLookAndFeel
JDK-8221231 JScrollBar display issue with GTKLookAndFeel
JDK-8221230 JSlider display issue with slider for GTKLookAndFeel
JDK-8221156 JTextPane display issue with GTKLookAndFeel
JDK-8221284 Mark SpecTest.java as intermittently failing
JDK-8221281 Missing ResourceMark in nmethod::metadata_do
JDK-8224620 Parallel stream execution within a custom ForkJoinPool should obey the parallelism
JDK-8221227 Problematic sparc intrinsic: com.sun.crypto.provider.CipherBlockChaining
JDK-8223525 Proper units should print more significant digits
JDK-8223191 Remove duplicate AlwaysTrueClosures
JDK-8221286 Remove intermittent key from sun/security/rsa/SpecTest.java
JDK-8221285 sun/security/rsa/SpecTest.java timeout with Agent error: java.lang.Exception
JDK-8221233 Swing applications with JRadioButton and JCheckbox fail to render correctly when using GTK3 and the GTK L&F
JDK-8223526 test/serviceability/dcmd/gc/HeapDumpTest fails to verify the dump
JDK-8221289 TEST_BUG java/nio/Buffer/Chars.java fails intermittently
JDK-8221288 TEST_BUG: java/net/ipv6tests/UdpTest.java failed because of SocketTimeoutException
JDK-8221292 TEST_BUG: java/nio/channels/AsynchronousChannelGroup/Basic.java fails intermittently
JDK-8221291 TEST_BUG: java/nio/channels/Selector/ChangingInterests.java failed once
JDK-8221290 TEST_BUG: sun/nio/cs/MalformedSurrogates.java fails intermittently
JDK-8222470 The fix done for JDK-8214253 have caused issues in JTree behaviour
JDK-8221238 The whole text in target JPasswordField image are not selected.
JDK-8221237 There is no icon in all JOptionPane target image
JDK-8221234 Tooltip is transparent rather than having a black background
JDK-8224921 Unsafe write after primitive array creation may result in array length change
JDK-8221236 XToolkit is not correctly displayed color on 16-bit high color setting

ysuenaga, Unknown

Bug Summary
JDK-8224097 HSDB could not terminate when close button is pushed.

zgu, Unknown

Bug Summary
JDK-8225050 java/net/Socket/asyncClose/Race.java failed intermittently on Windows with ConnectException: Connection refused