PUSHES REPORT: openjdk8u272

This report shows who pushed the backports to the given release. This usually shows who did the backporting, testing, and review work.

Report generated: Wed Sep 01 01:18:59 CEST 2021

Distribution by priority

Count Priority
3 P1
18 P2
58 P3
82 P4
3 P5

Distribution by components

Count Component
164 Total
48 (29.3%) hotspot
14 (8.5%) hotspot/jfr
14 (8.5%) hotspot/runtime
12 (7.3%) hotspot/compiler
4 (2.4%) hotspot/gc
3 (1.8%) hotspot/jvmti
1 (0.6%) hotspot
45 (27.4%) security-libs
11 (6.7%) security-libs
9 (5.5%) security-libs/java.security
6 (3.7%) security-libs/javax.net.ssl
6 (3.7%) security-libs/javax.crypto:pkcs11
4 (2.4%) security-libs/javax.xml.crypto
3 (1.8%) security-libs/javax.crypto
2 (1.2%) security-libs/javax.smartcardio
2 (1.2%) security-libs/javax.security
1 (0.6%) security-libs/jdk.security
1 (0.6%) security-libs/org.ietf.jgss:krb5
30 (18.3%) core-libs
6 (3.7%) core-libs/java.net
5 (3.0%) core-libs/javax.naming
3 (1.8%) core-libs
3 (1.8%) core-libs/java.util:i18n
2 (1.2%) core-libs/java.util.concurrent
2 (1.2%) core-libs/java.util
2 (1.2%) core-libs/java.lang
1 (0.6%) core-libs/jdk.nashorn
1 (0.6%) core-libs/java.nio
1 (0.6%) core-libs/java.util.regex
1 (0.6%) core-libs/java.math
1 (0.6%) core-libs/java.io
1 (0.6%) core-libs/java.text
1 (0.6%) core-libs/java.time
23 (14.0%) client-libs
8 (4.9%) client-libs/java.awt
5 (3.0%) client-libs/2d
4 (2.4%) client-libs/javax.imageio
3 (1.8%) client-libs/javax.sound
3 (1.8%) client-libs/javax.swing
10 (6.1%) core-svc
4 (2.4%) core-svc/java.lang.management
3 (1.8%) core-svc/debugger
2 (1.2%) core-svc
1 (0.6%) core-svc/javax.management
5 (3.0%) infrastructure
5 (3.0%) infrastructure/build
2 (1.2%) tools
1 (0.6%) tools/javadoc(tool)
1 (0.6%) tools/jlink
1 (0.6%) xml
1 (0.6%) xml/jaxp

Distribution by affiliation

Count Committer
164 Total
149 (90.9%) Red Hat
69 (42.1%) Andrew Hughes
29 (17.7%) Zhengyu Gu
19 (11.6%) Aleksey Shipilev
10 (6.1%) Severin Gehwolf
7 (4.3%) Martin Balao
6 (3.7%) Roland Westrelin
5 (3.0%) Alex Kasko
4 (2.4%) Elliott Baron
4 (2.4%) Amazon
4 (2.4%) Paul Hohensee
3 (1.8%) Alibaba
3 (1.8%) Denghui Dong
3 (1.8%) Azul
2 (1.2%) Dmitry Cherepanov
1 (0.6%) Andrew Brygin
3 (1.8%) DataDog
3 (1.8%) Jaroslav Bachorík
2 (1.2%) Independent
2 (1.2%) Andrey Petushkov

Chronological push log:

Days Ago Committer Affiliation Bug Summary
314 Andrew Hughes Red Hat JDK-8254937 Revert JDK-8148854 for 8u272
314 Andrew Hughes Red Hat JDK-8254673 call for JvmtiExport::post_vm_start() was removed by the fix for JDK-8249158
348 Andrew Brygin Azul JDK-8252886 [TESTBUG] sun/security/ec/TestEC.java : Compilation failed
356 Zhengyu Gu Red Hat JDK-8252979 Fix exception message to correctly represent LDAP connection failure
356 Zhengyu Gu Red Hat JDK-8252978 com/sun/jndi/ldap/LdapTimeoutTest.java failed due to timeout on DeadServerNoTimeoutTest is incorrect
356 Zhengyu Gu Red Hat JDK-8252977 8u: Windows build failed after 8222079 backport
358 Andrew Hughes Red Hat JDK-8252834 Possible NPE in ENC-PA-REP search in AS-REQ
365 Andrew Hughes Red Hat JDK-8252558 Mismatch in jsse.enableMFLNExtension property name
365 Andrew Hughes Red Hat JDK-8251478 Backport TLSv1.3 regression tests to JDK8u
365 Andrew Hughes Red Hat JDK-8251341 Minimal Java specification change
365 Andrew Hughes Red Hat JDK-8247276 Backport JDK-8161973
365 Andrew Hughes Red Hat JDK-8245681 Add TLSv1.3 regression test from 11.0.7
365 Andrew Hughes Red Hat JDK-8245653 Remove 8u TLS tests
365 Andrew Hughes Red Hat JDK-8245477 Adjust TLS tests location
365 Andrew Hughes Red Hat JDK-8245476 Disable TLSv1.3 protocol in the ClientHello message by default
365 Andrew Hughes Red Hat JDK-8245474 Add TLS_KRB5 cipher suites support according to RFC-2712
365 Andrew Hughes Red Hat JDK-8245473 OCSP stapling support
365 Andrew Hughes Red Hat JDK-8245472 Backport JDK-8038893 to JDK8
365 Andrew Hughes Red Hat JDK-8245471 Revert JDK-8148188
365 Andrew Hughes Red Hat JDK-8245470 Fix JDK8 compatibility issues
365 Andrew Hughes Red Hat JDK-8245469 Remove DTLS protocol implementation
365 Andrew Hughes Red Hat JDK-8245468 Add TLSv1.3 implementation classes from 11.0.7
365 Andrew Hughes Red Hat JDK-8245467 Remove 8u TLSv1.2 implementation files
365 Andrew Hughes Red Hat JDK-8252555 Memory leak in PKCS11 provider when using AES GCM
365 Andrew Hughes Red Hat JDK-8252554 Don't use memset to initialize fields decode_env constructor in disassembler.cpp
367 Zhengyu Gu Red Hat JDK-8252535 Add capability to custom resolve host/domain names within the default JNDI LDAP provider
368 Martin Balao Red Hat JDK-8252528 Cannot check P11Key size in P11Cipher and P11AEADCipher
368 Martin Balao Red Hat JDK-8252527 PKCS11 using NSS throws an error regarding secmod.db when NSS uses sqlite
368 Martin Balao Red Hat JDK-8252525 32-bit build failures after JDK-8080462 (Update SunPKCS11 provider with PKCS11 v2.40 support)
368 Martin Balao Red Hat JDK-8252512 Missing hash characters for header on license file
368 Martin Balao Red Hat JDK-8252511 Organize licenses by module in source, JMOD file, and run-time image
368 Martin Balao Red Hat JDK-8252510 Update SunPKCS11 provider with PKCS11 v2.40 support
368 Aleksey Shipilev Red Hat JDK-8252493 When using -Xcheck:jni an internally allocated buffer can leak
368 Aleksey Shipilev Red Hat JDK-8252492 ZapStackSegments should use optimized memset
368 Aleksey Shipilev Red Hat JDK-8252491 RuntimeStub's name lost with PrintFrameConverterAssembly
368 Aleksey Shipilev Red Hat JDK-8252490 Add SSL root certificates to Oracle Root CA program
368 Aleksey Shipilev Red Hat JDK-8252489 Circular reference in printed stack trace is not correctly indented & ambiguous
368 Andrew Hughes Red Hat JDK-8251120 [8u] HotSpot build assumes ENABLE_JFR is set to either true or false
370 Severin Gehwolf Red Hat JDK-8252361 [TESTBUG] Update base image for Docker testing to OL 7.6
370 Severin Gehwolf Red Hat JDK-8252360 OperatingSystemMXBean should be made container aware
370 Andrew Hughes Red Hat JDK-8252350 Update PKCS11 tests to run with security manager
371 Zhengyu Gu Red Hat JDK-8252314 Update MUSCLE PC/SC-Lite headers to the latest release 1.8.26
371 Zhengyu Gu Red Hat JDK-8252308 Need to enable -XX:+TraceExceptions in release builds
371 Zhengyu Gu Red Hat JDK-8252306 Test runtime/SharedArchiveFile/LimitSharedSizes.java fails in jdk 9 fcs new platforms/compiler
371 Severin Gehwolf Red Hat JDK-8252301 [TESTBUG] MetricsMemoryTester failcount test in docker container only works with debug JVMs
371 Severin Gehwolf Red Hat JDK-8251546 8u backport of JDK-8194298 breaks AIX and Solaris builds
371 Severin Gehwolf Red Hat JDK-8252300 Use -XX:+/-UseContainerSupport for enabling/disabling Java container metrics
375 Andrew Hughes Red Hat JDK-8252169 Mark regression tests using randomness
375 Elliott Baron Red Hat JDK-8252153 JDK 8u231 introduces a regression with incompatible handling of XML messages
375 Jaroslav Bachorík DataDog JDK-8249158 THREAD_START and THREAD_END event posted in primordial phase
375 Roland Westrelin Red Hat JDK-8252146 Meet not symmetric failure when running lucene on jdk8
375 Severin Gehwolf Red Hat JDK-8252137 java/lang/ProcessBuilder/Basic.java failed with "java.lang.AssertionError: Some tests failed"
375 Aleksey Shipilev Red Hat JDK-8252084 Minimal VM fails to bootcycle: undefined symbol: AgeTableTracer::is_tenuring_distribution_event_enabled
376 Andrew Hughes Red Hat JDK-8252106 Add PrimeTest for BigInteger
376 Aleksey Shipilev Red Hat JDK-8252083 Migrate SimpleDateFormatConstTest to JDK Repo
376 Aleksey Shipilev Red Hat JDK-8252082 UNIX version of Java_java_io_Console_echo does not return a clean boolean
376 Aleksey Shipilev Red Hat JDK-8252081 Add Entrust root CA - G4 to Oracle Root CA program
376 Andrew Hughes Red Hat JDK-8252072 (cal) Calendar.roll does not always roll the hours during daylight savings changes
376 Andrew Hughes Red Hat JDK-8252071 Mark a few more intermittently failing security-libs tests
377 Paul Hohensee Amazon JDK-8252048 Large reference arrays cause extremely long synchronization times
379 Elliott Baron Red Hat JDK-8251916 XML Digital Signature throws NAMESPACE_ERR exception on OpenJDK 11, works 8/9/10
379 Elliott Baron Red Hat JDK-8251915 ENVELOPING XML signature no longer works
379 Elliott Baron Red Hat JDK-8251911 Update xmldsig implementation to Apache Santuario 2.1.1
379 Andrew Hughes Red Hat JDK-8251906 HotspotDiagnosticMXBean.getVMOption() throws IllegalArgumentException for flags of type double
383 Zhengyu Gu Red Hat JDK-8251539 Enhance BaseLdapServer to support starttls extended request
383 Andrew Hughes Red Hat JDK-8251522 TEST_BUG: javax/sound/sampled/Clip/bug5070081.java fails sometimes
383 Andrew Hughes Red Hat JDK-8251521 sun/management/jmxremote/bootstrap/*.sh tests fail with error : revokeall.exe: Permission denied
383 Andrew Hughes Red Hat JDK-8251520 C2 loop unrolling fails due to unexpected graph shape
383 Andrew Hughes Red Hat JDK-8251515 Container Metrics
383 Andrew Hughes Red Hat JDK-8251514 Allow shorter method sampling interval than 10 ms
383 Andrew Hughes Red Hat JDK-8251512 JFR tool produces incorrect output when both --categories and --events are specified
383 Andrew Hughes Red Hat JDK-8251511 CMS: Missing memory fences between free chunk check and klass read
384 Paul Hohensee Amazon JDK-8251500 Fontmetrics for large Fonts has zero width
384 Zhengyu Gu Red Hat JDK-8251486 Use WeakReference for lastFontStrike for created Fonts
384 Denghui Dong Alibaba JDK-8250875 Incorrect parameter type for update_number in JDK_Version::jdk_update
390 Andrew Hughes Red Hat JDK-8251231 replace [[ and == bash extensions in regtest
390 Andrew Hughes Red Hat JDK-8251230 -XX:+TraceExceptions output should include the message
390 Andrew Hughes Red Hat JDK-8251229 Class names "SomeClass" and "LSomeClass;" treated by JVM as an equivalent
390 Andrew Hughes Red Hat JDK-8251228 Generated javadoc scattered all over the place
390 Andrew Hughes Red Hat JDK-8251223 [TESTBUG]compiler/tiered/NonTieredLevelsTest.java fails with compiler.whitebox.SimpleTestCaseHelper(int) must be compiled
390 Andrew Hughes Red Hat JDK-8251222 JFR did not collect call stacks when MaxJavaStackTraceDepth is set to zero
390 Andrew Hughes Red Hat JDK-8251221 [TESTBUG] Add keyword headful in java/awt and javax tests.
390 Andrew Hughes Red Hat JDK-8251220 Better cleanup for jdk/test/javax/imageio/plugins/shared/CanWriteSequence.java
391 Severin Gehwolf Red Hat JDK-8251164 libj2gss/NativeFunc.o "multiple definition" link errors with GCC10
391 Severin Gehwolf Red Hat JDK-8251163 java.base/unix/native/libjava/childproc.c "multiple definition" link errors with GCC10
391 Severin Gehwolf Red Hat JDK-8251162 (sctp) jdk.sctp/unix/native/libsctp/SctpNet.c "multiple definition" link errors with GCC10
393 Andrey Petushkov Independent JDK-8250964 RecordingInfo should use textual representation of path
393 Andrey Petushkov Independent JDK-8250963 JFR tool shows potentially misleading message when it cannot access a file
394 Aleksey Shipilev Red Hat JDK-8250927 [TESTBUG] Test java/awt/FontClass/CreateFont/fileaccess/FontFile.java fails
394 Aleksey Shipilev Red Hat JDK-8250926 Hard coded loop limit prevents reading of smart card data greater than 8k
394 Aleksey Shipilev Red Hat JDK-8250925 Encryption using GCM results in RuntimeException: input length out of bound
394 Aleksey Shipilev Red Hat JDK-8250924 Problems with AES-GCM native acceleration
397 Zhengyu Gu Red Hat JDK-8250836 Better cleanup for jdk/test/javax/imageio/plugins/shared/CanWriteSequence.java and WriteAfterAbort.java
397 Zhengyu Gu Red Hat JDK-8250835 Cannot load RSASSA-PSS public key with non-null params from byte array
397 Zhengyu Gu Red Hat JDK-8250833 Second parameter of "initialize" method is not used
397 Zhengyu Gu Red Hat JDK-8250832 failed class resolution reports different class name in detail message for the first and subsequent times
397 Zhengyu Gu Red Hat JDK-8250828 crash HeapWord*ParallelScavengeHeap::failed_mem_allocate
398 Aleksey Shipilev Red Hat JDK-8250767 Removing dependency on jakarta-regexp
398 Andrew Hughes Red Hat JDK-8250763 Mirror jdk.security.allowNonCaAnchor system property with a security one
398 Andrew Hughes Red Hat JDK-8250762 Expect changed behaviour reported in JDK-8249846
398 Andrew Hughes Red Hat JDK-8250761 JDB hangs when running monitor command
398 Andrew Hughes Red Hat JDK-8250760 C1: Incorrect result of field load due to missing narrowing conversion
399 Jaroslav Bachorík DataDog JDK-8250663 Thread CPU Load event may contain wrong data for CPU time under certain conditions
400 Severin Gehwolf Red Hat JDK-8250631 Add support for per Socket configuration of TCP keepalive
403 Andrew Hughes Red Hat JDK-8250526 [8u262] New JavaTimeSupplementary localisation for 'in' installed in wrong package
403 Andrew Hughes Red Hat JDK-8249677 Regression in 8u after JDK-8237117: Better ForkJoinPool behavior
403 Roland Westrelin Red Hat JDK-8250253 assert(proj != __null) at compile.cpp:3251
403 Aleksey Shipilev Red Hat JDK-8250252 Fix for JDK-8165936 broke Solaris builds
403 Aleksey Shipilev Red Hat JDK-8250251 Potential Heap buffer overflow when seaching timezone info files
404 Zhengyu Gu Red Hat JDK-8250228 Support the 'canonicalize' setting (krb5.conf) in the Kerberos client
404 Paul Hohensee Amazon JDK-8250214 [macos] Java2D Queue Flusher crash while moving application window to external monitor
404 Aleksey Shipilev Red Hat JDK-8249951 javadoc problems referencing inner class constructors
405 Martin Balao Red Hat JDK-8249889 Test SmallPrimeExponentP.java times out intermittently
406 Zhengyu Gu Red Hat JDK-8249808 [TEST_BUG] Test java/awt/dnd/BadSerializationTest/BadSerializationTest.java fails
406 Zhengyu Gu Red Hat JDK-8249807 LdapContext#reconnect always opens a new connection
410 Aleksey Shipilev Red Hat JDK-8249651 TESTBUG: jdk regression test javax/management/loading/MletParserLocaleTest.java reduce default timeout
411 Zhengyu Gu Red Hat JDK-8249610 Make sun.security.krb5.Config.getBooleanObject(String... keys) method public
411 Aleksey Shipilev Red Hat JDK-8249614 Nashorn crashes when given an empty script file.
413 Andrew Hughes Red Hat JDK-8249291 Several tests which need the @key headful keyword are missing it.
425 Zhengyu Gu Red Hat JDK-8248643 Remove extra leading space in JDK-8240295 8u backport
425 Paul Hohensee Amazon JDK-8248717 [TESTBUG] NEED_TEST: please JTREGIFY test/compiler/7177917/Test7177917.java
425 Dmitry Cherepanov Azul JDK-8248700 Issues reported after replacing symlink at Contents/MacOS/libjli.dylib with binary
425 Dmitry Cherepanov Azul JDK-8248699 Contents/MacOS/libjli.dylib cannot be a symlink
425 Roland Westrelin Red Hat JDK-8248693 Scheduling failures during gcm should be fatal
426 Roland Westrelin Red Hat JDK-8248627 CTW: C2 compilation fails with "malformed control flow"
426 Roland Westrelin Red Hat JDK-8248626 ConnectionGraph::unique_java_object(Node* N) return NULL if n is not in the CG
427 Zhengyu Gu Red Hat JDK-8248581 java/awt/Gtk/GtkVersionTest/GtkVersionTest.java fails
427 Zhengyu Gu Red Hat JDK-8248562 hs_err elapsed time in seconds is not accurate enough
427 Zhengyu Gu Red Hat JDK-8248559 javax/swing/JFileChooser/6868611/bug6868611.java throws error
427 Zhengyu Gu Red Hat JDK-8248558 Better cleanup for jdk/test/javax/imageio/spi/AppletContextTest/BadPluginConfigurationTest.sh
427 Alex Kasko Red Hat JDK-8248556 [TEST_BUG] delays needed in javax/swing/JTree/4633594/bug4633594.java
427 Alex Kasko Red Hat JDK-8248555 [PIT] test java/awt/Graphics2D/MTGraphicsAccessTest/MTGraphicsAccessTest.java hangs on Win. 8
428 Andrew Hughes Red Hat JDK-8248512 [8u262] Build installs jfr binary when JFR is disabled
428 Andrew Hughes Red Hat JDK-8248511 Remove Comodo root certificate that is expiring in May 2020
428 Andrew Hughes Red Hat JDK-8248510 Remove DocuSign root certificate that is expiring in May 2020
428 Andrew Hughes Red Hat JDK-8248509 (tz) Upgrade time-zone data to tzdata2020a
428 Andrew Hughes Red Hat JDK-8248508 Deadlock in JFR string pool
428 Andrew Hughes Red Hat JDK-8248507 Top package in method profiling shows "null" in JMC
428 Andrew Hughes Red Hat JDK-8248506 [TESTBUG] Add test for JDK-8233197
433 Zhengyu Gu Red Hat JDK-8248247 Make OutputAnalyzer.reportDiagnosticSummary public
433 Zhengyu Gu Red Hat JDK-8248244 Some sound tests rarely hangs because of incorrect synchronization
433 Zhengyu Gu Red Hat JDK-8248243 Better cleanup for javax/imageio/AllowSearch.java
433 Zhengyu Gu Red Hat JDK-8248242 Opensource unit/regression tests for ImageIO
435 Alex Kasko Red Hat JDK-8248040 Invalid "sun.awt.TimedWindowEvent" object leads to JVM crash
435 Alex Kasko Red Hat JDK-8248039 [TEST_BUG] Cygwin failure of java/awt/appletviewer/IOExceptionIfEncodedURLTest/IOExceptionIfEncodedURLTest.sh
435 Alex Kasko Red Hat JDK-8248004 adjust some WSAGetLastError usages in windows network coding
438 Denghui Dong Alibaba JDK-8247900 JFR: recordings on 32-bit systems unreadable
439 Roland Westrelin Red Hat JDK-8247840 Opensource unit/regression tests for JavaSound
440 Andrew Hughes Red Hat JDK-8247803 Add @requires os.family to the client tests with access to internal OS-specific API
440 Andrew Hughes Red Hat JDK-8247802 build failure on Linux after 8235243
440 Andrew Hughes Red Hat JDK-8247801 handle VS2017 15.9 and VS2019 in abstract_vm_version
440 Andrew Hughes Red Hat JDK-8247800 Need to update vm_version.cpp to recognise VS2017 minor versions
440 Andrew Hughes Red Hat JDK-8247799 jdwp library loader in linker_md.c quietly truncates on buffer overflow
440 Andrew Hughes Red Hat JDK-8247774 Small readability and performance improvements for zipfs
441 Zhengyu Gu Red Hat JDK-8247709 NullPointerException from ntlm.Client.type3
446 Jaroslav Bachorík DataDog JDK-8247420 Invert JvmtiExport::post_vm_initialized() and Jfr:on_vm_start() start-up order for correct option parsing
448 Andrew Hughes Red Hat JDK-8246815 XToolkit: Misread of screen information memory
448 Andrew Hughes Red Hat JDK-8246814 Replace strtok() with its safe equivalent strtok_s() in DefaultProxySelector.c
448 Andrew Hughes Red Hat JDK-8246813 TEST_BUG: minor cleanup of java/util/Scanner/ScanTest.java
448 Andrew Hughes Red Hat JDK-8246812 move ScanTest.java into OpenJDK
448 Andrew Hughes Red Hat JDK-8246810 Windows build fails after JDK-8227269
449 Zhengyu Gu Red Hat JDK-8246749 JVMTI PopFrame capability must instruct compilers not to prune locals
454 Denghui Dong Alibaba JDK-8246310 Clean commented-out code about ModuleEntry andPackageEntry in JFR
455 Andrew Hughes Red Hat JDK-8246384 Enable JFR by default on supported architectures for October 2020 release

No changesets log

JDK-8261770 Backport System Property jdk.tls.server.protocols
JDK-8256915 Unsupported ciphersuites may be offered by a TLS client
JDK-8256914 UnsatisfiedLinkError or NoSuchAlgorithmException after removing sunec.dll
JDK-8256908 Unable to use custom SSLEngine with default TrustManagerFactory after updating to JDK 11 b21
JDK-8256907 TLSv1.3 may generate TLSInnerPlainText longer than 2^14+1 bytes
JDK-8256905 TLSv1.3 fail with ClassException when EC keys are stored in PKCS11
JDK-8256899 TLSv.1.3 interop problems with OpenSSL 1.1.1 when used on the client side with mutual auth
JDK-8256898 TLS 1.3 session resumption with hello retry request failed with "illegal_parameter"
JDK-8256897 TLS 1.3 server fails if ClientHello doesn't have pre_shared_key and psk_key_exchange_modes
JDK-8256892 TLS 1.3 resumed session does not retain peer certificate chain
JDK-8256891 TLS 1.3 handshake server name indication is missing on a session resume
JDK-8256887 TLS 1.3 half-close and synchronization issues
JDK-8256884 TLS 1.3 CertificateRequest message sometimes offers disallowed signature algorithms
JDK-8256882 The size of key_exchange may be wrong on FFDHE
JDK-8256881 The "supported_groups" extension in ServerHellos
JDK-8256880 sun.security.ssl.HandshakeHash.T12HandshakeHash constructor check backwards.
JDK-8256879 Still unable to use custom SSLEngine with default TrustManagerFactory after JDK-8207029
JDK-8256878 SSLSocketImpl erroneously wraps SocketException
JDK-8256876 SSLSocket#setEnabledCipherSuites is accepting empty string
JDK-8256875 SSLSocket stream close() does not close the associated socket
JDK-8256873 SSLSessionImpl.getLocalPrincipal() throws NPE
JDK-8256872 SSLEngine negotiation fail exception behavior changed from fail-fast to fail-lazy
JDK-8256871 SSLContextImpl.statusResponseManager should be generated if required
JDK-8256869 SSL session resumption/SNI with TLS1.2 causes StackOverflowError
JDK-8256868 SSL Handshake failures are reported with more generic SSLException
JDK-8256800 RSASSA-PSS certificate cannot be selected for client auth on TLSv1.2
JDK-8256799 Replace the reflective call to the implUpdate method in HandshakeMessage::digestKey
JDK-8256767 Remove the temporary tls13VN field
JDK-8256760 Possible race condition in TLS 1.3 session resumption
JDK-8256758 NullPointerException in sun.security.ssl.OutputRecord.changeWriteCiphers
JDK-8256756 NPE in SupportedGroupsExtension
JDK-8256749 No extensions debug log for ClientHello
JDK-8256745 Misleading code in SSLCipher
JDK-8256697 javax/net/ssl/TLS tests support TLSv1.3
JDK-8256696 javax/net/ssl/templates/SSLSocketSSLEngineTemplate.java supports TLSv1.3
JDK-8256695 javax/net/ssl/templates/SSLSocketSSLEngineTemplate.java fails intermittently with "java.lang.Exception: Unexpected EOF"
JDK-8256694 javax/net/ssl/compatibility/Compatibility.java supports TLS 1.3
JDK-8256689 Increase the priorities of GCM cipher suites
JDK-8256687 Incorrectly named signature scheme ecdsa_secp512r1_sha512
JDK-8256684 Improperly use of the Optional API
JDK-8256681 Finished message validation failure should be decrypt_error alert
JDK-8256677 Duplicated synchronized keywords in SSLSocketImpl
JDK-8256676 Delegated task created by SSLEngine throws java.nio.BufferUnderflowException
JDK-8256668 Delegated task created by SSLEngine throws BufferUnderflowException
JDK-8256666 Curve in certificate should not affect signature scheme when using TLSv1.3
JDK-8256665 Check session context for TLS 1.3 session resumption
JDK-8256662 TLS 1.3 Implementation
JDK-8256646 Errors in alert ssl message does not reflect the actual certificate status
JDK-8253664 JSSE Client does not accept status_request extension in CertificateRequest messages for TLS 1.3
JDK-8252573 8u: Windows build failed after 8222079 backport
JDK-8245466 Backport TLSv1.3 protocol implementation

Committer push log

Alex Kasko, Red Hat

Bug Summary
JDK-8248555 [PIT] test java/awt/Graphics2D/MTGraphicsAccessTest/MTGraphicsAccessTest.java hangs on Win. 8
JDK-8248039 [TEST_BUG] Cygwin failure of java/awt/appletviewer/IOExceptionIfEncodedURLTest/IOExceptionIfEncodedURLTest.sh
JDK-8248556 [TEST_BUG] delays needed in javax/swing/JTree/4633594/bug4633594.java
JDK-8248004 adjust some WSAGetLastError usages in windows network coding
JDK-8248040 Invalid "sun.awt.TimedWindowEvent" object leads to JVM crash

Andrew Hughes, Red Hat

Bug Summary
JDK-8252072 (cal) Calendar.roll does not always roll the hours during daylight savings changes
JDK-8248509 (tz) Upgrade time-zone data to tzdata2020a
JDK-8251230 -XX:+TraceExceptions output should include the message
JDK-8248512 [8u262] Build installs jfr binary when JFR is disabled
JDK-8250526 [8u262] New JavaTimeSupplementary localisation for 'in' installed in wrong package
JDK-8251120 [8u] HotSpot build assumes ENABLE_JFR is set to either true or false
JDK-8251221 [TESTBUG] Add keyword headful in java/awt and javax tests.
JDK-8248506 [TESTBUG] Add test for JDK-8233197
JDK-8251223 [TESTBUG]compiler/tiered/NonTieredLevelsTest.java fails with compiler.whitebox.SimpleTestCaseHelper(int) must be compiled
JDK-8247803 Add @requires os.family to the client tests with access to internal OS-specific API
JDK-8252106 Add PrimeTest for BigInteger
JDK-8245474 Add TLS_KRB5 cipher suites support according to RFC-2712
JDK-8245468 Add TLSv1.3 implementation classes from 11.0.7
JDK-8245681 Add TLSv1.3 regression test from 11.0.7
JDK-8245477 Adjust TLS tests location
JDK-8251514 Allow shorter method sampling interval than 10 ms
JDK-8245472 Backport JDK-8038893 to JDK8
JDK-8247276 Backport JDK-8161973
JDK-8251478 Backport TLSv1.3 regression tests to JDK8u
JDK-8251220 Better cleanup for jdk/test/javax/imageio/plugins/shared/CanWriteSequence.java
JDK-8247802 build failure on Linux after 8235243
JDK-8250760 C1: Incorrect result of field load due to missing narrowing conversion
JDK-8251520 C2 loop unrolling fails due to unexpected graph shape
JDK-8254673 call for JvmtiExport::post_vm_start() was removed by the fix for JDK-8249158
JDK-8251229 Class names "SomeClass" and "LSomeClass;" treated by JVM as an equivalent
JDK-8251511 CMS: Missing memory fences between free chunk check and klass read
JDK-8251515 Container Metrics
JDK-8248508 Deadlock in JFR string pool
JDK-8245476 Disable TLSv1.3 protocol in the ClientHello message by default
JDK-8252554 Don't use memset to initialize fields decode_env constructor in disassembler.cpp
JDK-8246384 Enable JFR by default on supported architectures for October 2020 release
JDK-8250762 Expect changed behaviour reported in JDK-8249846
JDK-8245470 Fix JDK8 compatibility issues
JDK-8251228 Generated javadoc scattered all over the place
JDK-8247801 handle VS2017 15.9 and VS2019 in abstract_vm_version
JDK-8251906 HotspotDiagnosticMXBean.getVMOption() throws IllegalArgumentException for flags of type double
JDK-8250761 JDB hangs when running monitor command
JDK-8247799 jdwp library loader in linker_md.c quietly truncates on buffer overflow
JDK-8251222 JFR did not collect call stacks when MaxJavaStackTraceDepth is set to zero
JDK-8251512 JFR tool produces incorrect output when both --categories and --events are specified
JDK-8252071 Mark a few more intermittently failing security-libs tests
JDK-8252169 Mark regression tests using randomness
JDK-8252555 Memory leak in PKCS11 provider when using AES GCM
JDK-8251341 Minimal Java specification change
JDK-8250763 Mirror jdk.security.allowNonCaAnchor system property with a security one
JDK-8252558 Mismatch in jsse.enableMFLNExtension property name
JDK-8246812 move ScanTest.java into OpenJDK
JDK-8247800 Need to update vm_version.cpp to recognise VS2017 minor versions
JDK-8245473 OCSP stapling support
JDK-8252834 Possible NPE in ENC-PA-REP search in AS-REQ
JDK-8249677 Regression in 8u after JDK-8237117: Better ForkJoinPool behavior
JDK-8245653 Remove 8u TLS tests
JDK-8245467 Remove 8u TLSv1.2 implementation files
JDK-8248511 Remove Comodo root certificate that is expiring in May 2020
JDK-8248510 Remove DocuSign root certificate that is expiring in May 2020
JDK-8245469 Remove DTLS protocol implementation
JDK-8251231 replace [[ and == bash extensions in regtest
JDK-8246814 Replace strtok() with its safe equivalent strtok_s() in DefaultProxySelector.c
JDK-8245471 Revert JDK-8148188
JDK-8254937 Revert JDK-8148854 for 8u272
JDK-8249291 Several tests which need the @key headful keyword are missing it.
JDK-8247774 Small readability and performance improvements for zipfs
JDK-8251521 sun/management/jmxremote/bootstrap/*.sh tests fail with error : revokeall.exe: Permission denied
JDK-8251522 TEST_BUG: javax/sound/sampled/Clip/bug5070081.java fails sometimes
JDK-8246813 TEST_BUG: minor cleanup of java/util/Scanner/ScanTest.java
JDK-8248507 Top package in method profiling shows "null" in JMC
JDK-8252350 Update PKCS11 tests to run with security manager
JDK-8246810 Windows build fails after JDK-8227269
JDK-8246815 XToolkit: Misread of screen information memory

Andrey Petushkov, Independent

Bug Summary
JDK-8250963 JFR tool shows potentially misleading message when it cannot access a file
JDK-8250964 RecordingInfo should use textual representation of path

Andrew Brygin, Azul

Bug Summary
JDK-8252886 [TESTBUG] sun/security/ec/TestEC.java : Compilation failed

Dmitry Cherepanov, Azul

Bug Summary
JDK-8248699 Contents/MacOS/libjli.dylib cannot be a symlink
JDK-8248700 Issues reported after replacing symlink at Contents/MacOS/libjli.dylib with binary

Denghui Dong, Alibaba

Bug Summary
JDK-8246310 Clean commented-out code about ModuleEntry andPackageEntry in JFR
JDK-8250875 Incorrect parameter type for update_number in JDK_Version::jdk_update
JDK-8247900 JFR: recordings on 32-bit systems unreadable

Elliott Baron, Red Hat

Bug Summary
JDK-8251915 ENVELOPING XML signature no longer works
JDK-8252153 JDK 8u231 introduces a regression with incompatible handling of XML messages
JDK-8251911 Update xmldsig implementation to Apache Santuario 2.1.1
JDK-8251916 XML Digital Signature throws NAMESPACE_ERR exception on OpenJDK 11, works 8/9/10

Jaroslav Bachorík, DataDog

Bug Summary
JDK-8247420 Invert JvmtiExport::post_vm_initialized() and Jfr:on_vm_start() start-up order for correct option parsing
JDK-8250663 Thread CPU Load event may contain wrong data for CPU time under certain conditions
JDK-8249158 THREAD_START and THREAD_END event posted in primordial phase

Martin Balao, Red Hat

Bug Summary
JDK-8252525 32-bit build failures after JDK-8080462 (Update SunPKCS11 provider with PKCS11 v2.40 support)
JDK-8252528 Cannot check P11Key size in P11Cipher and P11AEADCipher
JDK-8252512 Missing hash characters for header on license file
JDK-8252511 Organize licenses by module in source, JMOD file, and run-time image
JDK-8252527 PKCS11 using NSS throws an error regarding secmod.db when NSS uses sqlite
JDK-8249889 Test SmallPrimeExponentP.java times out intermittently
JDK-8252510 Update SunPKCS11 provider with PKCS11 v2.40 support

Paul Hohensee, Amazon

Bug Summary
JDK-8250214 [macos] Java2D Queue Flusher crash while moving application window to external monitor
JDK-8248717 [TESTBUG] NEED_TEST: please JTREGIFY test/compiler/7177917/Test7177917.java
JDK-8251500 Fontmetrics for large Fonts has zero width
JDK-8252048 Large reference arrays cause extremely long synchronization times

Roland Westrelin, Red Hat

Bug Summary
JDK-8250253 assert(proj != __null) at compile.cpp:3251
JDK-8248626 ConnectionGraph::unique_java_object(Node* N) return NULL if n is not in the CG
JDK-8248627 CTW: C2 compilation fails with "malformed control flow"
JDK-8252146 Meet not symmetric failure when running lucene on jdk8
JDK-8247840 Opensource unit/regression tests for JavaSound
JDK-8248693 Scheduling failures during gcm should be fatal

Severin Gehwolf, Red Hat

Bug Summary
JDK-8251162 (sctp) jdk.sctp/unix/native/libsctp/SctpNet.c "multiple definition" link errors with GCC10
JDK-8251546 8u backport of JDK-8194298 breaks AIX and Solaris builds
JDK-8252301 [TESTBUG] MetricsMemoryTester failcount test in docker container only works with debug JVMs
JDK-8252361 [TESTBUG] Update base image for Docker testing to OL 7.6
JDK-8250631 Add support for per Socket configuration of TCP keepalive
JDK-8251163 java.base/unix/native/libjava/childproc.c "multiple definition" link errors with GCC10
JDK-8252137 java/lang/ProcessBuilder/Basic.java failed with "java.lang.AssertionError: Some tests failed"
JDK-8251164 libj2gss/NativeFunc.o "multiple definition" link errors with GCC10
JDK-8252360 OperatingSystemMXBean should be made container aware
JDK-8252300 Use -XX:+/-UseContainerSupport for enabling/disabling Java container metrics

Aleksey Shipilev, Red Hat

Bug Summary
JDK-8250927 [TESTBUG] Test java/awt/FontClass/CreateFont/fileaccess/FontFile.java fails
JDK-8252081 Add Entrust root CA - G4 to Oracle Root CA program
JDK-8252490 Add SSL root certificates to Oracle Root CA program
JDK-8252489 Circular reference in printed stack trace is not correctly indented & ambiguous
JDK-8250925 Encryption using GCM results in RuntimeException: input length out of bound
JDK-8250252 Fix for JDK-8165936 broke Solaris builds
JDK-8250926 Hard coded loop limit prevents reading of smart card data greater than 8k
JDK-8249951 javadoc problems referencing inner class constructors
JDK-8252083 Migrate SimpleDateFormatConstTest to JDK Repo
JDK-8252084 Minimal VM fails to bootcycle: undefined symbol: AgeTableTracer::is_tenuring_distribution_event_enabled
JDK-8249614 Nashorn crashes when given an empty script file.
JDK-8250251 Potential Heap buffer overflow when seaching timezone info files
JDK-8250924 Problems with AES-GCM native acceleration
JDK-8250767 Removing dependency on jakarta-regexp
JDK-8252491 RuntimeStub's name lost with PrintFrameConverterAssembly
JDK-8249651 TESTBUG: jdk regression test javax/management/loading/MletParserLocaleTest.java reduce default timeout
JDK-8252082 UNIX version of Java_java_io_Console_echo does not return a clean boolean
JDK-8252493 When using -Xcheck:jni an internally allocated buffer can leak
JDK-8252492 ZapStackSegments should use optimized memset

Zhengyu Gu, Red Hat

Bug Summary
JDK-8252977 8u: Windows build failed after 8222079 backport
JDK-8249808 [TEST_BUG] Test java/awt/dnd/BadSerializationTest/BadSerializationTest.java fails
JDK-8252535 Add capability to custom resolve host/domain names within the default JNDI LDAP provider
JDK-8248243 Better cleanup for javax/imageio/AllowSearch.java
JDK-8250836 Better cleanup for jdk/test/javax/imageio/plugins/shared/CanWriteSequence.java and WriteAfterAbort.java
JDK-8248558 Better cleanup for jdk/test/javax/imageio/spi/AppletContextTest/BadPluginConfigurationTest.sh
JDK-8250835 Cannot load RSASSA-PSS public key with non-null params from byte array
JDK-8252978 com/sun/jndi/ldap/LdapTimeoutTest.java failed due to timeout on DeadServerNoTimeoutTest is incorrect
JDK-8250828 crash HeapWord*ParallelScavengeHeap::failed_mem_allocate
JDK-8251539 Enhance BaseLdapServer to support starttls extended request
JDK-8250832 failed class resolution reports different class name in detail message for the first and subsequent times
JDK-8252979 Fix exception message to correctly represent LDAP connection failure
JDK-8248562 hs_err elapsed time in seconds is not accurate enough
JDK-8248581 java/awt/Gtk/GtkVersionTest/GtkVersionTest.java fails
JDK-8248559 javax/swing/JFileChooser/6868611/bug6868611.java throws error
JDK-8246749 JVMTI PopFrame capability must instruct compilers not to prune locals
JDK-8249807 LdapContext#reconnect always opens a new connection
JDK-8248247 Make OutputAnalyzer.reportDiagnosticSummary public
JDK-8249610 Make sun.security.krb5.Config.getBooleanObject(String... keys) method public
JDK-8252308 Need to enable -XX:+TraceExceptions in release builds
JDK-8247709 NullPointerException from ntlm.Client.type3
JDK-8248242 Opensource unit/regression tests for ImageIO
JDK-8248643 Remove extra leading space in JDK-8240295 8u backport
JDK-8250833 Second parameter of "initialize" method is not used
JDK-8248244 Some sound tests rarely hangs because of incorrect synchronization
JDK-8250228 Support the 'canonicalize' setting (krb5.conf) in the Kerberos client
JDK-8252306 Test runtime/SharedArchiveFile/LimitSharedSizes.java fails in jdk 9 fcs new platforms/compiler
JDK-8252314 Update MUSCLE PC/SC-Lite headers to the latest release 1.8.26
JDK-8251486 Use WeakReference for lastFontStrike for created Fonts