RELEASE NOTES: JDK 11.0.7

Notes generated: Wed Sep 01 03:26:38 CEST 2021

JEPs

None.

RELEASE NOTES

security-libs/org.ietf.jgss:krb5

Issue Description
JDK-8005819

Support cross-realm MSSFU


The support for the Kerberos MSSFU extensions [1] is now extended to cross-realm environments.

By leveraging the Kerberos cross-realm referrals enhancement introduced in the context of JDK-8215032, the 'S4U2Self' and 'S4U2Proxy' extensions may be used to impersonate user and service principals located on different realms.

[1] - https://docs.microsoft.com/en-us/openspecs/windows_protocols/ms-sfu/3bff5864-8135-400e-bdd9-33b552051d94


security-libs/javax.xml.crypto

Issue Description
JDK-8231507

Apache Santuario Library Updated to Version 2.1.4


The Apache Santuario library has been upgraded to version 2.1.4. As a result, a new system property com.sun.org.apache.xml.internal.security.parser.pool-size has been introduced.

This new system property sets the pool size of the internal DocumentBuilder cache used when processing XML Signatures. The function is equivalent to the org.apache.xml.security.parser.pool-size system property used in Apache Santuario and has the same default value of 20.


FIXED ISSUES

client-libs/2d

Priority Bug Summary
P2 JDK-8227662 freetype seeks to index at the end of the font data
P2 JDK-8232154 Update Mesa 3-D Headers to version 19.2.1
P3 JDK-8232200 [macos 10.15] Windows in fullscreen tests jumps around the screen
P3 JDK-8234769 Duplicate attribution in freetype.md
P3 JDK-8223558 Java does not render Myanmar script correctly
P3 JDK-8234323 NULL-check return value of SurfaceData_InitOps on macosx
P3 JDK-8227324 Upgrade to freetype 2.10.1
P4 JDK-8210058 Algorithmic Italic font leans opposite angle in Printing
P4 JDK-8235904 Infinite loop when rendering huge lines
P4 JDK-8225007 java/awt/print/PrinterJob/LandscapeStackOverflow.java may hang
P4 JDK-8224778 test/jdk/demo/jfc/J2Ddemo/J2DdemoTest.java cannot find J2Ddemo.jar

client-libs/java.awt

Priority Bug Summary
P2 JDK-8230597 Update GIFlib library to the 5.2.1
P3 JDK-8232433 [macos 10.15] java/awt/Window/LocationAtScreenCorner/LocationAtScreenCorner.java may fail
P3 JDK-8214578 [macos] Problem with backslashes on macOS/JIS keyboard: Java ignores system settings
P3 JDK-8230926 [macosx] Two apostrophes are entered instead of one with "U.S. International - PC" layout
P3 JDK-8207938 At step6,Click Add button,case failed automatically.
P3 JDK-8231445 check ZALLOC return values in awt coding
P3 JDK-8234786 Fix for JDK-8214578 breaks OS X 10.12 compatibility
P3 JDK-8233657 Intermittent NPE in Component.validate()
P4 JDK-8230480 check malloc/calloc results in java.desktop
P4 JDK-8225487 giflib legal file is missing attribution for openbsd-reallocarray.c.
P4 JDK-8176556 java/awt/dnd/ImageTransferTest/ImageTransferTest.java fails for JFIF
P4 JDK-8224821 java/awt/Focus/NoAutotransferToDisabledCompTest/NoAutotransferToDisabledCompTest.java fails linux-x64
P4 JDK-8225105 java/awt/Focus/ShowFrameCheckForegroundTest/ShowFrameCheckForegroundTest.java fails in Windows 10
P4 JDK-8224830 test/jdk/java/awt/Focus/ModalExcludedWindowClickTest/ModalExcludedWindowClickTest.java fails on linux-x64

client-libs/java.awt:i18n

Priority Bug Summary
P3 JDK-8225182 JNI exception pending in DestroyXIMCallback of awt_InputMethod.c:1327

client-libs/javax.accessibility

Priority Bug Summary
P3 JDK-4949105 Access Bridge lacks html tags parsing

client-libs/javax.swing

Priority Bug Summary
P2 JDK-8230235 Rendering HTML with empty img attribute and documentBaseKey cause Exception
P3 JDK-8225144 [macos] In Aqua L&F backspace key does not delete when Shift is pressed
P3 JDK-8226892 ActionListeners on JRadioButtons don't get notified when selection is changed with arrow keys
P3 JDK-8217297 Add support for multiple look and feel for SwingSet SliderDemoTest
P3 JDK-8222519 ButtonDemoScreenshotTest fails randomly with "still state to be reached"
P3 JDK-8209494 Create a test for SwingSet3 InternalFrameDemo
P3 JDK-8209993 Create a test for SwingSet3 ToolTipDemo
P3 JDK-8217235 Create automated test for SwingSet ColorChooserDemoTest
P3 JDK-8210910 Create test for FileChooserDemo
P3 JDK-8209499 Create test for SwingSet3 EditorPaneDemo
P3 JDK-8210994 Create test for SwingSet3 FrameDemo
P3 JDK-8223158 Docked MacBook cannot start any Java Swing applications
P3 JDK-8213168 Enable different look and feel tests in SwingSet3 demo test FileChooserDemoTest
P3 JDK-8214471 Enable different look and feel tests in SwingSet3 demo test ToolTipDemoTest
P3 JDK-8210055 Enable different look and feel tests in SwingSet3 demo tests
P3 JDK-8210057 Enable different look and feels in SwingSet3 demo test InternalFrameDemoTest
P3 JDK-8211443 Enable different look and feels in SwingSet3 demo test SplitPaneDemoTest
P3 JDK-8210052 Enable testing for all the available look and feels in SwingSet3 demo tests
P3 JDK-8211160 Handle different look and feels in JInternalFrameOperator
P3 JDK-8211139 Increase timeout value in all tests under jdk/sanity/client/SwingSet/src
P3 JDK-8211703 JInternalFrame : java.lang.AssertionError: cannot find the internal frame
P3 JDK-8215396 JTabbedPane preferred size calculation is wrong for SCROLL_TAB_LAYOUT
P3 JDK-8224475 JTextPane does not show images in HTML rendering
P3 JDK-8237541 Missing files in backport of JDK-8209499
P3 JDK-8237540 Missing files in backport of JDK-8210910
P3 JDK-8211322 Reduce the timeout of tooltip in SwingSet2DemoTest
P3 JDK-8212897 Some improvements in the EditorPaneDemotest
P3 JDK-8209418 Synchronize test/jdk/sanity/client/lib/jemmy with code-tools/jemmy/v2
P4 JDK-8234386 [macos] NPE was thrown at expanding Choice from maximized frame
P4 JDK-8240724 [test] jdk11 downport of 8224475 misses binary file test/jdk/javax/swing/JTextPane/arrow.png
P4 JDK-8042383 [TEST_BUG] Test javax/swing/plaf/basic/BasicMenuUI/4983388/bug4983388.java fails with shortcuts on menus do not work
P4 JDK-8228479 Correct the format of ColorChooserDemoTest
P4 JDK-8198321 javax/swing/JEditorPane/5076514/bug5076514.java fails
P4 JDK-8196467 javax/swing/JInternalFrame/Test6325652.java fails
P4 JDK-8203904 javax/swing/JSplitPane/4816114/bug4816114.java: The divider location is wrong
P4 JDK-8235744 PIT: test/jdk/javax/swing/text/html/TestJLabelWithHTMLText.java times out in linux-x64
P4 JDK-8194944 Regression automated test 'open/test/jdk/javax/swing/JInternalFrame/8145896/TestJInternalFrameMaximize.java' fails
P4 JDK-8199072 Test javax/swing/GroupLayout/6613904/bug6613904.java is unstable
P4 JDK-8198398 Test javax/swing/JColorChooser/Test6199676.java fails in mach5
P4 JDK-8221312 test/jdk/sanity/client/SwingSet/src/ColorChooserDemoTest.java failed
P4 JDK-8216353 Use utility APIs introduced in org/netbeans/jemmy/util/LookAndFeel class in client sanity test cases

core-libs

Priority Bug Summary
P4 JDK-8220348 [ntintel] asserts about copying unaligned array

core-libs/java.lang

Priority Bug Summary
P3 JDK-8231584 Deadlock with ClassLoader.findLibrary and System.loadLibrary call
P4 JDK-8208715 Conversion of milliseconds to nanoseconds in UNIXProcess contains bug.
P4 JDK-8209824 Improve the code coverage for ThreadLocal
P4 JDK-8224905 java/lang/ProcessBuilder/Basic.java#id1 failed with stream closed

core-libs/java.lang.invoke

Priority Bug Summary
P3 JDK-8232806 Introduce a system property to disable eager lambda initialization

core-libs/java.lang:reflect

Priority Bug Summary
P3 JDK-8222448 java/lang/reflect/PublicMethods/PublicMethodsTest.java times out

core-libs/java.math

Priority Bug Summary
P4 JDK-8225117 java/math/BigInteger/SymmetricRangeTests.java fails with ParseException

core-libs/java.net

Priority Bug Summary
P1 JDK-8218662 Allow 204 responses with Content-Length:0
P2 JDK-8068184 Fix for JDK-8032832 caused a deadlock
P4 JDK-8233018 Add a new test to verify that DatagramSocket is not interruptible
P4 JDK-8193596 java/net/DatagramPacket/ReuseBuf.java failed due to timeout
P4 JDK-8218882 NET_Writev is declared, NET_WriteV is defined
P4 JDK-8234501 remove obsolete NET_ReadV
P4 JDK-8225430 Replace wildcard address with loopback or local host in tests - part 14
P4 JDK-8223638 Replace wildcard address with loopback or local host in tests - part 6

core-libs/java.nio

Priority Bug Summary
P3 JDK-8216472 (se) Stack overflow during selection operation leads to crash (win)
P3 JDK-8234824 java/nio/channels/SocketChannel/AdaptSocket.java fails on Windows 10
P4 JDK-8219597 (bf) Heap buffer state changes could provoke unexpected exceptions
P4 JDK-8232003 (fs) Files.write can leak file descriptor in the exception case
P4 JDK-7143743 (zipfs) Potential memory leak with zip provider
P4 JDK-8229888 (zipfs) Updating an existing zip file does not preserve original permissions
P4 JDK-8220479 java/nio/channels/Selector/SelectWithConsumer.java failed at testTwoChannels()

core-libs/java.rmi

Priority Bug Summary
P2 JDK-8237368 Problem with NullPointerException in RMI TCPEndpoint.read

core-libs/java.util

Priority Bug Summary
P3 JDK-8220613 java/util/Arrays/TimSortStackSize2.java times out with fastdebug build

core-libs/java.util.jar

Priority Bug Summary
P3 JDK-8234466 Class loading deadlock involving X509Factory#commitEvent()
P4 JDK-8237508 Simplify JarFile.isInitializing

core-libs/java.util:collections

Priority Bug Summary
P3 JDK-8234423 Modifying ArrayList.subList().subList() resets modCount of subList

core-libs/java.util:i18n

Priority Bug Summary
P3 JDK-8225435 Upgrade IANA Language Subtag Registry to the latest for JDK14
P4 JDK-8234288 Turkey Time Zone returns incorrect time zone name

core-libs/javax.naming

Priority Bug Summary
P3 JDK-8223260 NamingManager should cache InitialContextFactory
P4 JDK-8223727 com/sun/jndi/ldap/privconn/RunTest.java failed due to hang in LdapRequest.getReplyBer

core-svc/debugger

Priority Bug Summary
P2 JDK-8226608 Hide the onjcmd option from the help output
P3 JDK-8224673 Adjust permission for delayed starting of debugging
P3 JDK-8169718 nsk/jdb/locals/locals002: ERROR: Cannot find boolVar with expected value: false
P3 JDK-8163083 SocketListeningConnector does not allow invocations with port 0
P4 JDK-8239856 [ntintel] asserts about copying unaligned array element
P4 JDK-8220451 jdi/EventQueue/remove/remove004 failed due to "ERROR: thread2 is not alive"
P4 JDK-8222741 jdi/EventQueue/remove/remove004 fails due to VMDisconnectedException
P4 JDK-8220456 jdi/EventQueue/remove_l/remove_l004 failed due to "TIMEOUT while waiting for event"
P4 JDK-8232370 Refactor some com.sun.jdi tests to enable IDE integration

core-svc/java.lang.management

Priority Bug Summary
P4 JDK-8185005 Improve performance of ThreadMXBean.getThreadInfo(long ids[], int maxDepth)

hotspot

Priority Bug Summary
P3 JDK-8233328 fix minimal VM build on Linux s390x
P5 JDK-8224851 AArch64: fix warnings and errors with Clang and GCC 8.3

hotspot/compiler

Priority Bug Summary
P2 JDK-8233032 assert(in_bb(n)) failed: must be
P2 JDK-8234350 assert(mode == ControlAroundStripMined && (use == sfpt || !use->is_reachable_from_root())) failed: missed a node
P2 JDK-8213348 jdk.internal.vm.compiler.management service providers missing in module descriptor
P2 JDK-8233529 loopTransform.cpp:2984: Error: assert(p_f->Opcode() == Op_IfFalse) failed
P2 JDK-8234610 MaxVectorSize set wrongly when UseAVX=3 is specified after JDK-8221092
P3 JDK-8209574 [AOT] breakpoint events are generated in different threads does not meet expected count when testcase vm/jvmti/Breakpoint/brkp001/brkp00102/brkp00102.html is executed
P3 JDK-8206963 [AOT] bug with multiple class loaders
P3 JDK-8216180 [AOT] compiler/intrinsics/bigInteger/TestMulAdd.java crashed with AOT enabled
P3 JDK-8210220 [AOT] jdwp test cases are failing with error # ERROR: TEST FAILED: Cought IOException while receiving event packet: # ERROR: java.net.SocketTimeoutException: Read timed out
P3 JDK-8145845 [AOT] NullPointerException in compiler/whitebox/GetCodeHeapEntriesTest.java
P3 JDK-8152988 [AOT] Update test batch definitions to include aot-ed java.base module mode into hs-comp testing
P3 JDK-8235998 [C2] Memory leaks during tracing after "8224193: stringStream should not use Resource Area".
P3 JDK-8236140 assert(!VerifyHashTableKeys || _hash_lock == 0) failed: remove node from hash table before modifying it
P3 JDK-8233656 assert(d->is_CFG() && n->is_CFG()) failed: must have CFG nodes
P3 JDK-8229994 assert(false) failed: Bad graph detected in get_early_ctrl_for_expensive
P3 JDK-8235288 AVX 512 instructions inadvertently used on Xeon for small vector width operations
P3 JDK-8236179 C1 register allocation failure with T_ADDRESS
P3 JDK-8234617 C1: Incorrect result of field load due to missing narrowing conversion
P3 JDK-8214344 C2: assert(con.basic_type() != T_ILLEGAL) failed: elembt=byte; loadbt=void; unsigned=0
P3 JDK-8231430 C2: Memory stomp in max_array_length() for T_ILLEGAL type
P3 JDK-8208379 compiler/jvmci/events/JvmciNotifyInstallEventTest.java failed with "Got unexpected event count after 2nd install attempt: expected 9 to equal 2"
P3 JDK-8237945 CTW: C2 compilation fails with assert(just_allocated_object(alloc_ctl) == ptr) failed: most recent allo
P3 JDK-8233019 java.lang.Class.isPrimitive() (C1) returns wrong result if Klass* is aligned to 32bit
P3 JDK-8235510 java.util.zip.CRC32 performance drop after 8200067
P3 JDK-8230677 Should disable Escape Analysis if JVMTI capability can_get_owned_monitor_info was taken
P3 JDK-8237375 SimpleThresholdPolicy misses CounterDecay timestamp initialization
P3 JDK-8236709 struct SwitchRange in HS violates C++ One Definition Rule
P3 JDK-8238438 SuperWord::co_locate_pack picks memory state of first instead of last load
P3 JDK-8214904 Test8004741.java failed due to "Too few ThreadDeath hits; expected at least 6 but saw only 5"
P4 JDK-8225199 [Graal] compiler/jvmci/compilerToVM/IsMatureVsReprofileTest.java fails with -XX:CompileThresholdScaling=0.1
P4 JDK-8210793 [JVMCI] AllocateCompileIdTest.java failed to find DiagnosticCommand.class
P4 JDK-8215322 add @file support to jaotc
P4 JDK-8223769 Assert triggers with -XX:+StressReflectiveCode
P4 JDK-8235383 C1 compilation fails with -XX:+PrintIRDuringConstruction -XX:+Verbose
P4 JDK-8238811 C2: assert(i >= req() || i == 0 || is_Region() || is_Phi()) with -XX:+VerifyGraphEdges
P4 JDK-8209686 cleanup arguments to PhaseIdealLoop() constructor
P4 JDK-8225350 compiler/jvmci/compilerToVM/IsCompilableTest.java timed out
P4 JDK-8233491 Crash in AdapterHandlerLibrary::get_adapter with CDS due to code cache exhaustion
P4 JDK-8238366 CTW runner closes standard output on exit
P4 JDK-8238247 CTW runner should sweep nmethods more aggressively
P4 JDK-8238591 CTW: Split applications/ctw/modules/jdk_localedata.java
P4 JDK-8227112 exclude compiler/intrinsics/sha/sanity tests from AOT runs
P4 JDK-8214557 Filter out VM flags which don't affect AOT code generation
P4 JDK-8239466 Loss of precision in counter decay calculation in 11u backport of JDK-8237375
P4 JDK-8193042 NativeLookup::lookup_critical_entry() should only load shared library once
P4 JDK-8230459 Test failed to resume JVMCI CompilerThread
P4 JDK-8178798 Two compiler/aot/verification/vmflags tests fail by timeout with UseAVX=3
P4 JDK-8225567 Wrong file headers with 8202414 fix changeset
P5 JDK-8167276 jvmci/compilerToVM/MaterializeVirtualObjectTest.java fails with -XX:-EliminateAllocations

hotspot/gc

Priority Bug Summary
P2 JDK-8217717 ZGC: Broken oop map in C1 load barrier stub
P3 JDK-8204529 gc/TestAllocateHeapAtMultiple.java fail with Agent 7 timed out
P3 JDK-8211211 vmTestbase/metaspace/stressDictionary/StressDictionary.java timeout
P4 JDK-8209802 Garbage collectors should register JFR types themselves to avoid build errors.
P4 JDK-8237217 Incorrect G1StringDedupEntry type used in StringDedupTable destructor
P4 JDK-8224187 Refactor arraycopy_prologue to allow ZGC read barriers on arraycopy

hotspot/jfr

Priority Bug Summary
P2 JDK-8231025 Incorrect method tag offset for big endian platform
P3 JDK-8230400 Missing constant pool entry for a method in stacktrace
P3 JDK-8225797 OldObjectSample event creates unexpected amount of checkpoint data
P3 JDK-8231081 TestMetadataRetention fails due to missing symbol id
P4 JDK-8210024 JFR calls virtual is_Java_thread from ~Thread()
P4 JDK-8219205 JFR file without license header

hotspot/jvmti

Priority Bug Summary
P2 JDK-8232056 GetOwnedMonitorInfoWithEATest.java fails with ZGC: Heap too small
P3 JDK-8209361 [AOT] Unexpected number of references for JVMTI_HEAP_REFERENCE_CONSTANT_POOL [111-->111]: 0 (expected at least 1)
P4 JDK-8201513 nsk/jvmti/IterateThroughHeap/filter-* are broken

hotspot/runtime

Priority Bug Summary
P2 JDK-8238596 AVX enabled by default for Skylake even when unsupported
P2 JDK-8235325 build failure on Linux after 8235243
P2 JDK-8229345 Memory leak due to vtable stubs not being shared on SPARC
P2 JDK-8210523 runtime/appcds/cacheObject/DifferentHeapSizes.java crash
P2 JDK-8241296 Segfault in JNIHandleBlock::oops_do()
P2 JDK-8207832 serviceability/sa/ClhsdbCDSCore.java failed with java.lang.Error: Couldn't find core file location in:
P2 JDK-8227528 TestAbortVMOnSafepointTimeout.java failed due to "RuntimeException: 'Safepoint sync time longer than' missing from stdout/stderr"
P3 JDK-8234397 add OS uptime information to os::print_os_info output
P3 JDK-8210289 ArchivedKlassSubGraphInfoRecord is incomplete
P3 JDK-8209385 CDS runtime classpath checking is too strict when only classes from the system modules are archived
P3 JDK-8233078 fix minimal VM build on Linux ppc64(le)
P3 JDK-8235489 handle return values of sscanf calls in hotspot
P3 JDK-8226406 JVM fails to detect mismatched or corrupt CDS archive
P3 JDK-8208658 Make CDS archived heap regions usable even if compressed oop encoding has changed
P3 JDK-8232571 new sun.misc.Signal("INFO") throws IllegalArgumentException since JDK11
P3 JDK-8215355 Object monitor deadlock with no threads holding the monitor (using jemalloc 5.1)
P3 JDK-8209657 Refactor filemap.hpp to simplify integration with Serviceability Agent
P3 JDK-8209389 SIGSEGV in WalkOopAndArchiveClosure::do_oop_work
P3 JDK-8209826 Undefined reference to os::write after JDK-8209657 (filemap.hpp cleanup)
P4 JDK-8217338 [Containers] Improve systemd slice memory limit support
P4 JDK-8233466 aarch64: remove unnecessary load of mdo when profiling return and parameters type
P4 JDK-8232060 add some initializations using sigemptyset in os_aix.cpp
P4 JDK-8209850 Allow NamedThreads to use GlobalCounter critical sections
P4 JDK-8220786 Create new switch to redirect error reporting output to stdout or stderr
P4 JDK-8229236 CriticalJNINatives: dll handling should be done in native thread state
P4 JDK-8234741 enhance os::get_core_path on macOS
P4 JDK-8235671 enhance print_rlimit_info in os_posix
P4 JDK-8204551 Event descriptions are truncated in logs
P4 JDK-8235243 handle VS2017 15.9 and VS2019 in abstract_vm_version
P4 JDK-8209976 Improve iteration over non-JavaThreads
P4 JDK-8232207 Linux os::available_memory re-reads cgroup configuration on every invocation
P4 JDK-8189633 Missing -Xcheck:jni checking for DeleteWeakGlobalRef
P4 JDK-8214850 Rename vm_operations.?pp files to vmOperations.?pp files
P4 JDK-8214840 runtime/NMT/MallocStressTest.java timed out
P4 JDK-8237819 s390x - remove unused pd_zero_to_words_large
P4 JDK-8203911 Test runtime/modules/getModuleJNI/GetModule fails with -Xcheck:jni
P4 JDK-8231753 use more Posix functionality in aix os::print_os_info

hotspot/svc

Priority Bug Summary
P3 JDK-8230611 infinite loop in LogOutputList::wait_until_no_readers()
P4 JDK-8207367 10 vmTestbase/nsk/jdi tests timed out when running with jtreg

hotspot/svc-agent

Priority Bug Summary
P3 JDK-8235637 jhsdb jmap from OpenJDK 11.0.5 doesn't work if prelink is enabled
P3 JDK-8196969 JTreg Failure: serviceability/sa/ClhsdbJstack.java causes NPE
P3 JDK-8227645 Some tests in serviceability/sa run with fixed -Xmx values and risk running out of memory
P4 JDK-8203364 Some serviceability/sa/ tests intermittently fail with java.io.IOException: LingeredApp terminated with non-zero exit code 3

hotspot/test

Priority Bug Summary
P3 JDK-8208157 requires.VMProps throws NPE for missing properties in "release" file
P4 JDK-8209807 improve handling exception in requires.VMProps

infrastructure

Priority Bug Summary
P2 JDK-8223671 The latest Java 8 is not ready to use in applications on future macOS versions
P3 JDK-8238534 Deep sign macOS bundles before bundle archive is being created
P3 JDK-8232880 Update test documentation with additional settings for client UI tooltip tests
P4 JDK-8234340 Bump update version for OpenJDK: jdk-11.0.7

infrastructure/build

Priority Bug Summary
P2 JDK-8217613 [AOT] TEST_OPTS_AOT_MODULES doesn't work on mac
P2 JDK-8236848 [JDK 11u] make run-test-tier1 fails after backport of JDK-8232834
P2 JDK-8222264 Windows incremental build is broken with JDK-8217728
P3 JDK-8234525 enable link-time section-gc for linux s390x to remove unused code
P3 JDK-8160926 FLAGS_COMPILER_CHECK_ARGUMENTS doesn't handle cross-compilation
P3 JDK-8238225 Issues reported after replacing symlink at Contents/MacOS/libjli.dylib with binary
P3 JDK-8223627 jdk-13+20 bundle name contains null instead of ea
P3 JDK-8237879 make 4.3 breaks build
P3 JDK-8217634 RunTest documentation and usability update
P3 JDK-8232834 RunTest sometimes fails to produce valid exitcode.txt
P3 JDK-8234809 set relro in linker flags when building with gcc
P3 JDK-8214534 Setting of THIS_FILE in the build is broken
P3 JDK-8209817 stack is executable when building with Clang on Linux
P3 JDK-8216354 Syntax error in toolchain_windows.m4
P3 JDK-8213906 Update arm devkits with libXrandr headers
P4 JDK-8210459 Add support for generating compile_commands.json
P4 JDK-8223678 Add Visual Studio Code workspace generation support (for native code)
P4 JDK-8201349 build broken when configured with --with-zlib=bundled on gcc 7.3
P4 JDK-8223464 Improve version string for Oracle CI builds
P4 JDK-8211781 re-building fails after changing Graal sources
P4 JDK-8189861 Refactor CacheFind
P4 JDK-8217728 Speed up incremental rerun of "make hotspot"
P4 JDK-8236488 Support for configure option --with-native-debug-symbols=internal is impossible on Windows
P4 JDK-8221851 Use of THIS_FILE in hotspot invalidates precompiled header on Linux/GCC
P4 JDK-8233383 Various minor fixes
P4 JDK-8232167 Visual Studio install found through --with-tools-dir value is discarded
P4 JDK-8236500 Windows ucrt.dll should be looked up in versioned WINSDK subdirectory

security-libs/java.security

Priority Bug Summary
P2 JDK-8228969 2019-09-28 public suffix list update
P2 JDK-8225180 SignedObject with invalid Key not throwing the InvalidKeyException in Windows
P3 JDK-8228613 java.security.Provider#getServices order is no longer deterministic
P3 JDK-8231387 java.security.Provider.getService returns random result due to race condition with mutating methods in the same class
P3 JDK-7092821 java.security.Provider.getService() is synchronized and became scalability bottleneck
P4 JDK-8225130 Add exception for expiring Comodo roots to VerifyCACerts test
P4 JDK-8225128 Add exception for expiring DocuSign root to VerifyCACerts test
P4 JDK-8237869 exclude jtreg test security/infra/java/security/cert/CertPathValidator/certification/LuxTrustCA.java because of instabilities

security-libs/javax.crypto

Priority Bug Summary
P3 JDK-8223003 SunMSCAPI keys are not cleaned up
P3 JDK-8238502 sunmscapi.dll causing EXCEPTION_ACCESS_VIOLATION
P4 JDK-8201355 Avoid native memory allocation in sun.security.mscapi.PRNG.generateSeed
P4 JDK-8213009 Refactoring existing SunMSCAPI classes
P4 JDK-8223063 Support CNG RSA keys
P4 JDK-8213010 Supporting keys created with certmgr.exe

security-libs/javax.crypto:pkcs11

Priority Bug Summary
P3 JDK-8183107 PKCS11 regression regarding checkKeySize
P3 JDK-8232950 SUNPKCS11 Provider incorrectly check key length for PSS Signatures.

security-libs/javax.net.ssl

Priority Bug Summary
P2 JDK-8236039 JSSE Client does not accept status_request extension in CertificateRequest messages for TLS 1.3
P3 JDK-8225766 Curve in certificate should not affect signature scheme when using TLSv1.3
P3 JDK-8221270 Duplicated synchronized keywords in SSLSocketImpl
P3 JDK-8218889 Improperly use of the Optional API
P3 JDK-8219723 javax/net/ssl/compatibility/Compatibility.java failed on some SNI cases
P3 JDK-8222391 javax/net/ssl/compatibility/Compatibility.java should be more flexible
P3 JDK-8203687 javax/net/ssl/compatibility/Compatibility.java supports TLS 1.3
P3 JDK-8231810 javax/net/ssl/templates/SSLSocketSSLEngineTemplate.java fails intermittently with "java.lang.Exception: Unexpected EOF"
P4 JDK-8210632 Add key exchange algorithm to javax/net/ssl/TLSCommon/CipherSuite.java
P4 JDK-4919790 Errors in alert ssl message does not reflect the actual certificate status
P4 JDK-8234724 javax/net/ssl/templates/SSLSocketSSLEngineTemplate.java supports TLSv1.3
P4 JDK-8234723 javax/net/ssl/TLS tests support TLSv1.3
P4 JDK-8237600 Test SunJSSEFIPSInit fails on Ubuntu

security-libs/javax.smartcardio

Priority Bug Summary
P3 JDK-8163251 Hard coded loop limit prevents reading of smart card data greater than 8k

security-libs/javax.xml.crypto

Priority Bug Summary
P3 JDK-8231507 Update Apache Santuario (XML Signature) to version 2.1.4

security-libs/jdk.security

Priority Bug Summary
P4 JDK-8210476 sun/security/mscapi/PrngSlow.java fails with Still too slow

security-libs/org.ietf.jgss:krb5

Priority Bug Summary
P4 JDK-8005819 Support cross-realm MSSFU

tools

Priority Bug Summary
P4 JDK-8232170 FSInfo#getJarClassPath throws an exception not declared in its throws clause

tools/javac

Priority Bug Summary
P2 JDK-8213908 AssertionError in DeferredAttr at setOverloadKind
P3 JDK-8218268 Javac treats Manifest Class-Path entries as Paths instead of URLs
P4 JDK-8214345 infinite recursion while checking super class

tools/javadoc(tool)

Priority Bug Summary
P3 JDK-8200432 javadoc fails with ClassCastException on {@link byte[]}

tools/jconsole

Priority Bug Summary
P3 JDK-8236873 Worker has a deadlock bug

tools/jlink

Priority Bug Summary
P4 JDK-8230004 jdk/internal/jimage/JImageOpenTest.java runs no test
P4 JDK-8216535 tools/jimage/JImageExtractTest.java timed out

tools/launcher

Priority Bug Summary
P4 JDK-8234339 replace JLI_StrTok in java_md_solinux.c

xml/jaxp

Priority Bug Summary
P4 JDK-8232713 Update BCEL version to 6.3.1 in license file
P4 JDK-8233548 Update CUP to v0.11b